hbase-dev mailing list archives

Site index · List index
Message view « Date » · « Thread »
Top « Date » · « Thread »
From Apache Jenkins Server <jenk...@builds.apache.org>
Subject Build failed in Jenkins: HBase-0.92 #250
Date Wed, 18 Jan 2012 03:17:04 GMT
See <https://builds.apache.org/job/HBase-0.92/250/>

------------------------------------------
[...truncated 6706 lines...]
Running org.apache.hadoop.hbase.rest.TestScannerResource
Tests run: 5, Failures: 0, Errors: 0, Skipped: 0, Time elapsed: 34.591 sec
Forking command line: /bin/sh -c cd /x1/jenkins/jenkins-slave/workspace/HBase-0.92/trunk &&
/x1/jenkins/tools/java/jdk1.6.0_27-32/jre/bin/java -enableassertions -Xmx1400m -Djava.security.egd=file:/dev/./urandom
-jar /x1/jenkins/jenkins-slave/workspace/HBase-0.92/trunk/target/surefire/surefirebooter9159039297806899242.jar
/x1/jenkins/jenkins-slave/workspace/HBase-0.92/trunk/target/surefire/surefire6201323980267073713tmp
/x1/jenkins/jenkins-slave/workspace/HBase-0.92/trunk/target/surefire/surefire6791667818960518974tmp
Running org.apache.hadoop.hbase.rest.TestVersionResource
Tests run: 7, Failures: 0, Errors: 0, Skipped: 0, Time elapsed: 17.267 sec
Forking command line: /bin/sh -c cd /x1/jenkins/jenkins-slave/workspace/HBase-0.92/trunk &&
/x1/jenkins/tools/java/jdk1.6.0_27-32/jre/bin/java -enableassertions -Xmx1400m -Djava.security.egd=file:/dev/./urandom
-jar /x1/jenkins/jenkins-slave/workspace/HBase-0.92/trunk/target/surefire/surefirebooter323373054996083143.jar
/x1/jenkins/jenkins-slave/workspace/HBase-0.92/trunk/target/surefire/surefire357956561128146252tmp
/x1/jenkins/jenkins-slave/workspace/HBase-0.92/trunk/target/surefire/surefire256236173589303478tmp
Running org.apache.hadoop.hbase.rest.TestStatusResource
Tests run: 2, Failures: 0, Errors: 0, Skipped: 0, Time elapsed: 17.587 sec
Forking command line: /bin/sh -c cd /x1/jenkins/jenkins-slave/workspace/HBase-0.92/trunk &&
/x1/jenkins/tools/java/jdk1.6.0_27-32/jre/bin/java -enableassertions -Xmx1400m -Djava.security.egd=file:/dev/./urandom
-jar /x1/jenkins/jenkins-slave/workspace/HBase-0.92/trunk/target/surefire/surefirebooter6182703209326983555.jar
/x1/jenkins/jenkins-slave/workspace/HBase-0.92/trunk/target/surefire/surefire2819717109518953497tmp
/x1/jenkins/jenkins-slave/workspace/HBase-0.92/trunk/target/surefire/surefire3793554252248272445tmp
Running org.apache.hadoop.hbase.rest.TestTransform
Tests run: 1, Failures: 0, Errors: 0, Skipped: 0, Time elapsed: 18.969 sec
Forking command line: /bin/sh -c cd /x1/jenkins/jenkins-slave/workspace/HBase-0.92/trunk &&
/x1/jenkins/tools/java/jdk1.6.0_27-32/jre/bin/java -enableassertions -Xmx1400m -Djava.security.egd=file:/dev/./urandom
-jar /x1/jenkins/jenkins-slave/workspace/HBase-0.92/trunk/target/surefire/surefirebooter6183370931881190337.jar
/x1/jenkins/jenkins-slave/workspace/HBase-0.92/trunk/target/surefire/surefire8794701115473852935tmp
/x1/jenkins/jenkins-slave/workspace/HBase-0.92/trunk/target/surefire/surefire5737178206730882668tmp
Running org.apache.hadoop.hbase.rest.TestScannersWithFilters
Tests run: 10, Failures: 0, Errors: 0, Skipped: 0, Time elapsed: 24.807 sec
Forking command line: /bin/sh -c cd /x1/jenkins/jenkins-slave/workspace/HBase-0.92/trunk &&
/x1/jenkins/tools/java/jdk1.6.0_27-32/jre/bin/java -enableassertions -Xmx1400m -Djava.security.egd=file:/dev/./urandom
-jar /x1/jenkins/jenkins-slave/workspace/HBase-0.92/trunk/target/surefire/surefirebooter8370897271558547225.jar
/x1/jenkins/jenkins-slave/workspace/HBase-0.92/trunk/target/surefire/surefire9017064223415305581tmp
/x1/jenkins/jenkins-slave/workspace/HBase-0.92/trunk/target/surefire/surefire221625267163473700tmp
Running org.apache.hadoop.hbase.metrics.TestMetricsMBeanBase
Tests run: 2, Failures: 0, Errors: 0, Skipped: 0, Time elapsed: 1.101 sec
Forking command line: /bin/sh -c cd /x1/jenkins/jenkins-slave/workspace/HBase-0.92/trunk &&
/x1/jenkins/tools/java/jdk1.6.0_27-32/jre/bin/java -enableassertions -Xmx1400m -Djava.security.egd=file:/dev/./urandom
-jar /x1/jenkins/jenkins-slave/workspace/HBase-0.92/trunk/target/surefire/surefirebooter6503748826413721927.jar
/x1/jenkins/jenkins-slave/workspace/HBase-0.92/trunk/target/surefire/surefire1703017277472383026tmp
/x1/jenkins/jenkins-slave/workspace/HBase-0.92/trunk/target/surefire/surefire7302695545210902892tmp
Running org.apache.hadoop.hbase.io.hfile.TestHFileWriterV2
Tests run: 1, Failures: 0, Errors: 0, Skipped: 0, Time elapsed: 0.82 sec
Forking command line: /bin/sh -c cd /x1/jenkins/jenkins-slave/workspace/HBase-0.92/trunk &&
/x1/jenkins/tools/java/jdk1.6.0_27-32/jre/bin/java -enableassertions -Xmx1400m -Djava.security.egd=file:/dev/./urandom
-jar /x1/jenkins/jenkins-slave/workspace/HBase-0.92/trunk/target/surefire/surefirebooter2816835109255553287.jar
/x1/jenkins/jenkins-slave/workspace/HBase-0.92/trunk/target/surefire/surefire193010803742576360tmp
/x1/jenkins/jenkins-slave/workspace/HBase-0.92/trunk/target/surefire/surefire3301442858201142178tmp
Running org.apache.hadoop.hbase.io.hfile.TestHFile
Tests run: 6, Failures: 0, Errors: 0, Skipped: 0, Time elapsed: 0.637 sec
Forking command line: /bin/sh -c cd /x1/jenkins/jenkins-slave/workspace/HBase-0.92/trunk &&
/x1/jenkins/tools/java/jdk1.6.0_27-32/jre/bin/java -enableassertions -Xmx1400m -Djava.security.egd=file:/dev/./urandom
-jar /x1/jenkins/jenkins-slave/workspace/HBase-0.92/trunk/target/surefire/surefirebooter2567102545801342378.jar
/x1/jenkins/jenkins-slave/workspace/HBase-0.92/trunk/target/surefire/surefire1076537513438636498tmp
/x1/jenkins/jenkins-slave/workspace/HBase-0.92/trunk/target/surefire/surefire7190023902134941670tmp
Running org.apache.hadoop.hbase.io.hfile.TestHFileBlockIndex
Tests run: 10, Failures: 0, Errors: 0, Skipped: 0, Time elapsed: 7.271 sec
Forking command line: /bin/sh -c cd /x1/jenkins/jenkins-slave/workspace/HBase-0.92/trunk &&
/x1/jenkins/tools/java/jdk1.6.0_27-32/jre/bin/java -enableassertions -Xmx1400m -Djava.security.egd=file:/dev/./urandom
-jar /x1/jenkins/jenkins-slave/workspace/HBase-0.92/trunk/target/surefire/surefirebooter5932667817993046683.jar
/x1/jenkins/jenkins-slave/workspace/HBase-0.92/trunk/target/surefire/surefire1953614467068214081tmp
/x1/jenkins/jenkins-slave/workspace/HBase-0.92/trunk/target/surefire/surefire7698973564347155548tmp
Running org.apache.hadoop.hbase.io.hfile.TestHFileSeek
Tests run: 1, Failures: 0, Errors: 0, Skipped: 0, Time elapsed: 4.284 sec
Forking command line: /bin/sh -c cd /x1/jenkins/jenkins-slave/workspace/HBase-0.92/trunk &&
/x1/jenkins/tools/java/jdk1.6.0_27-32/jre/bin/java -enableassertions -Xmx1400m -Djava.security.egd=file:/dev/./urandom
-jar /x1/jenkins/jenkins-slave/workspace/HBase-0.92/trunk/target/surefire/surefirebooter233486426643783498.jar
/x1/jenkins/jenkins-slave/workspace/HBase-0.92/trunk/target/surefire/surefire5605552548114256771tmp
/x1/jenkins/jenkins-slave/workspace/HBase-0.92/trunk/target/surefire/surefire2313697513818255020tmp
Running org.apache.hadoop.hbase.io.hfile.TestLruBlockCache
Tests run: 7, Failures: 0, Errors: 0, Skipped: 0, Time elapsed: 0.316 sec
Forking command line: /bin/sh -c cd /x1/jenkins/jenkins-slave/workspace/HBase-0.92/trunk &&
/x1/jenkins/tools/java/jdk1.6.0_27-32/jre/bin/java -enableassertions -Xmx1400m -Djava.security.egd=file:/dev/./urandom
-jar /x1/jenkins/jenkins-slave/workspace/HBase-0.92/trunk/target/surefire/surefirebooter6531150395077876132.jar
/x1/jenkins/jenkins-slave/workspace/HBase-0.92/trunk/target/surefire/surefire6436525822435686452tmp
/x1/jenkins/jenkins-slave/workspace/HBase-0.92/trunk/target/surefire/surefire5513394762074437856tmp
Running org.apache.hadoop.hbase.io.hfile.TestFixedFileTrailer
Tests run: 2, Failures: 0, Errors: 0, Skipped: 0, Time elapsed: 0.562 sec
Forking command line: /bin/sh -c cd /x1/jenkins/jenkins-slave/workspace/HBase-0.92/trunk &&
/x1/jenkins/tools/java/jdk1.6.0_27-32/jre/bin/java -enableassertions -Xmx1400m -Djava.security.egd=file:/dev/./urandom
-jar /x1/jenkins/jenkins-slave/workspace/HBase-0.92/trunk/target/surefire/surefirebooter2278950516764390883.jar
/x1/jenkins/jenkins-slave/workspace/HBase-0.92/trunk/target/surefire/surefire9134543766622248447tmp
/x1/jenkins/jenkins-slave/workspace/HBase-0.92/trunk/target/surefire/surefire7485812676394707873tmp
Running org.apache.hadoop.hbase.io.hfile.TestCachedBlockQueue
Tests run: 2, Failures: 0, Errors: 0, Skipped: 0, Time elapsed: 0.09 sec
Forking command line: /bin/sh -c cd /x1/jenkins/jenkins-slave/workspace/HBase-0.92/trunk &&
/x1/jenkins/tools/java/jdk1.6.0_27-32/jre/bin/java -enableassertions -Xmx1400m -Djava.security.egd=file:/dev/./urandom
-jar /x1/jenkins/jenkins-slave/workspace/HBase-0.92/trunk/target/surefire/surefirebooter7047858518197204331.jar
/x1/jenkins/jenkins-slave/workspace/HBase-0.92/trunk/target/surefire/surefire6528288583416270705tmp
/x1/jenkins/jenkins-slave/workspace/HBase-0.92/trunk/target/surefire/surefire6812577348812226118tmp
Running org.apache.hadoop.hbase.io.hfile.TestHFilePerformance
Tests run: 1, Failures: 0, Errors: 0, Skipped: 0, Time elapsed: 4.256 sec
Forking command line: /bin/sh -c cd /x1/jenkins/jenkins-slave/workspace/HBase-0.92/trunk &&
/x1/jenkins/tools/java/jdk1.6.0_27-32/jre/bin/java -enableassertions -Xmx1400m -Djava.security.egd=file:/dev/./urandom
-jar /x1/jenkins/jenkins-slave/workspace/HBase-0.92/trunk/target/surefire/surefirebooter6991310099400485260.jar
/x1/jenkins/jenkins-slave/workspace/HBase-0.92/trunk/target/surefire/surefire1583439452461820450tmp
/x1/jenkins/jenkins-slave/workspace/HBase-0.92/trunk/target/surefire/surefire7723556564548816084tmp
Running org.apache.hadoop.hbase.io.hfile.TestCacheOnWrite
Tests run: 6, Failures: 0, Errors: 0, Skipped: 0, Time elapsed: 5.656 sec
Forking command line: /bin/sh -c cd /x1/jenkins/jenkins-slave/workspace/HBase-0.92/trunk &&
/x1/jenkins/tools/java/jdk1.6.0_27-32/jre/bin/java -enableassertions -Xmx1400m -Djava.security.egd=file:/dev/./urandom
-jar /x1/jenkins/jenkins-slave/workspace/HBase-0.92/trunk/target/surefire/surefirebooter5751467200023434254.jar
/x1/jenkins/jenkins-slave/workspace/HBase-0.92/trunk/target/surefire/surefire5902179577120002052tmp
/x1/jenkins/jenkins-slave/workspace/HBase-0.92/trunk/target/surefire/surefire6565622788112273018tmp
Running org.apache.hadoop.hbase.io.hfile.TestReseekTo
Tests run: 1, Failures: 0, Errors: 0, Skipped: 0, Time elapsed: 0.674 sec
Forking command line: /bin/sh -c cd /x1/jenkins/jenkins-slave/workspace/HBase-0.92/trunk &&
/x1/jenkins/tools/java/jdk1.6.0_27-32/jre/bin/java -enableassertions -Xmx1400m -Djava.security.egd=file:/dev/./urandom
-jar /x1/jenkins/jenkins-slave/workspace/HBase-0.92/trunk/target/surefire/surefirebooter5504884266638282771.jar
/x1/jenkins/jenkins-slave/workspace/HBase-0.92/trunk/target/surefire/surefire8855279321508217107tmp
/x1/jenkins/jenkins-slave/workspace/HBase-0.92/trunk/target/surefire/surefire1847686678150613510tmp
Running org.apache.hadoop.hbase.io.hfile.TestSeekTo
Tests run: 3, Failures: 0, Errors: 0, Skipped: 0, Time elapsed: 0.501 sec
Forking command line: /bin/sh -c cd /x1/jenkins/jenkins-slave/workspace/HBase-0.92/trunk &&
/x1/jenkins/tools/java/jdk1.6.0_27-32/jre/bin/java -enableassertions -Xmx1400m -Djava.security.egd=file:/dev/./urandom
-jar /x1/jenkins/jenkins-slave/workspace/HBase-0.92/trunk/target/surefire/surefirebooter327921028866646347.jar
/x1/jenkins/jenkins-slave/workspace/HBase-0.92/trunk/target/surefire/surefire3099421022095933608tmp
/x1/jenkins/jenkins-slave/workspace/HBase-0.92/trunk/target/surefire/surefire8299599108824487472tmp
Running org.apache.hadoop.hbase.io.hfile.TestBlockCacheColumnFamilySummary
Tests run: 4, Failures: 0, Errors: 0, Skipped: 0, Time elapsed: 0.066 sec
Forking command line: /bin/sh -c cd /x1/jenkins/jenkins-slave/workspace/HBase-0.92/trunk &&
/x1/jenkins/tools/java/jdk1.6.0_27-32/jre/bin/java -enableassertions -Xmx1400m -Djava.security.egd=file:/dev/./urandom
-jar /x1/jenkins/jenkins-slave/workspace/HBase-0.92/trunk/target/surefire/surefirebooter4612093528187460632.jar
/x1/jenkins/jenkins-slave/workspace/HBase-0.92/trunk/target/surefire/surefire8820580280905637810tmp
/x1/jenkins/jenkins-slave/workspace/HBase-0.92/trunk/target/surefire/surefire1849991594098481991tmp
Running org.apache.hadoop.hbase.io.hfile.TestHFileBlock
Tests run: 7, Failures: 0, Errors: 0, Skipped: 0, Time elapsed: 23.902 sec
Forking command line: /bin/sh -c cd /x1/jenkins/jenkins-slave/workspace/HBase-0.92/trunk &&
/x1/jenkins/tools/java/jdk1.6.0_27-32/jre/bin/java -enableassertions -Xmx1400m -Djava.security.egd=file:/dev/./urandom
-jar /x1/jenkins/jenkins-slave/workspace/HBase-0.92/trunk/target/surefire/surefirebooter8439599381921817022.jar
/x1/jenkins/jenkins-slave/workspace/HBase-0.92/trunk/target/surefire/surefire2057583435670995662tmp
/x1/jenkins/jenkins-slave/workspace/HBase-0.92/trunk/target/surefire/surefire7577433023874653276tmp
Running org.apache.hadoop.hbase.io.hfile.slab.TestSlabCache
Tests run: 7, Failures: 0, Errors: 0, Skipped: 0, Time elapsed: 14.96 sec
Forking command line: /bin/sh -c cd /x1/jenkins/jenkins-slave/workspace/HBase-0.92/trunk &&
/x1/jenkins/tools/java/jdk1.6.0_27-32/jre/bin/java -enableassertions -Xmx1400m -Djava.security.egd=file:/dev/./urandom
-jar /x1/jenkins/jenkins-slave/workspace/HBase-0.92/trunk/target/surefire/surefirebooter3537138722441780318.jar
/x1/jenkins/jenkins-slave/workspace/HBase-0.92/trunk/target/surefire/surefire5147736477104802945tmp
/x1/jenkins/jenkins-slave/workspace/HBase-0.92/trunk/target/surefire/surefire4075466804525129088tmp
Running org.apache.hadoop.hbase.io.hfile.slab.TestSingleSizeCache
Tests run: 5, Failures: 0, Errors: 0, Skipped: 0, Time elapsed: 18.348 sec
Forking command line: /bin/sh -c cd /x1/jenkins/jenkins-slave/workspace/HBase-0.92/trunk &&
/x1/jenkins/tools/java/jdk1.6.0_27-32/jre/bin/java -enableassertions -Xmx1400m -Djava.security.egd=file:/dev/./urandom
-jar /x1/jenkins/jenkins-slave/workspace/HBase-0.92/trunk/target/surefire/surefirebooter1830244132807475822.jar
/x1/jenkins/jenkins-slave/workspace/HBase-0.92/trunk/target/surefire/surefire601159344178046737tmp
/x1/jenkins/jenkins-slave/workspace/HBase-0.92/trunk/target/surefire/surefire3965683403507016295tmp
Running org.apache.hadoop.hbase.io.hfile.slab.TestSlab
Tests run: 1, Failures: 0, Errors: 0, Skipped: 0, Time elapsed: 0.124 sec
Forking command line: /bin/sh -c cd /x1/jenkins/jenkins-slave/workspace/HBase-0.92/trunk &&
/x1/jenkins/tools/java/jdk1.6.0_27-32/jre/bin/java -enableassertions -Xmx1400m -Djava.security.egd=file:/dev/./urandom
-jar /x1/jenkins/jenkins-slave/workspace/HBase-0.92/trunk/target/surefire/surefirebooter6285227864461527986.jar
/x1/jenkins/jenkins-slave/workspace/HBase-0.92/trunk/target/surefire/surefire5217912487009198487tmp
/x1/jenkins/jenkins-slave/workspace/HBase-0.92/trunk/target/surefire/surefire7374675017826877177tmp
Running org.apache.hadoop.hbase.io.hfile.TestHFileReaderV1
Tests run: 1, Failures: 0, Errors: 0, Skipped: 0, Time elapsed: 0.459 sec
Forking command line: /bin/sh -c cd /x1/jenkins/jenkins-slave/workspace/HBase-0.92/trunk &&
/x1/jenkins/tools/java/jdk1.6.0_27-32/jre/bin/java -enableassertions -Xmx1400m -Djava.security.egd=file:/dev/./urandom
-jar /x1/jenkins/jenkins-slave/workspace/HBase-0.92/trunk/target/surefire/surefirebooter2507830115679319843.jar
/x1/jenkins/jenkins-slave/workspace/HBase-0.92/trunk/target/surefire/surefire6028293051883734144tmp
/x1/jenkins/jenkins-slave/workspace/HBase-0.92/trunk/target/surefire/surefire3066990505926728286tmp
Running org.apache.hadoop.hbase.io.TestHalfStoreFileReader
Tests run: 1, Failures: 0, Errors: 0, Skipped: 0, Time elapsed: 0.661 sec
Forking command line: /bin/sh -c cd /x1/jenkins/jenkins-slave/workspace/HBase-0.92/trunk &&
/x1/jenkins/tools/java/jdk1.6.0_27-32/jre/bin/java -enableassertions -Xmx1400m -Djava.security.egd=file:/dev/./urandom
-jar /x1/jenkins/jenkins-slave/workspace/HBase-0.92/trunk/target/surefire/surefirebooter8648966064087999842.jar
/x1/jenkins/jenkins-slave/workspace/HBase-0.92/trunk/target/surefire/surefire8310771644894586247tmp
/x1/jenkins/jenkins-slave/workspace/HBase-0.92/trunk/target/surefire/surefire1831047962362712997tmp
Running org.apache.hadoop.hbase.io.TestHbaseObjectWritable
Tests run: 4, Failures: 0, Errors: 0, Skipped: 0, Time elapsed: 0.36 sec
Forking command line: /bin/sh -c cd /x1/jenkins/jenkins-slave/workspace/HBase-0.92/trunk &&
/x1/jenkins/tools/java/jdk1.6.0_27-32/jre/bin/java -enableassertions -Xmx1400m -Djava.security.egd=file:/dev/./urandom
-jar /x1/jenkins/jenkins-slave/workspace/HBase-0.92/trunk/target/surefire/surefirebooter7582172381253484030.jar
/x1/jenkins/jenkins-slave/workspace/HBase-0.92/trunk/target/surefire/surefire8207955516662044830tmp
/x1/jenkins/jenkins-slave/workspace/HBase-0.92/trunk/target/surefire/surefire2049285568421757101tmp
Running org.apache.hadoop.hbase.io.TestImmutableBytesWritable
Tests run: 3, Failures: 0, Errors: 0, Skipped: 0, Time elapsed: 0.105 sec
Forking command line: /bin/sh -c cd /x1/jenkins/jenkins-slave/workspace/HBase-0.92/trunk &&
/x1/jenkins/tools/java/jdk1.6.0_27-32/jre/bin/java -enableassertions -Xmx1400m -Djava.security.egd=file:/dev/./urandom
-jar /x1/jenkins/jenkins-slave/workspace/HBase-0.92/trunk/target/surefire/surefirebooter2488843393325930311.jar
/x1/jenkins/jenkins-slave/workspace/HBase-0.92/trunk/target/surefire/surefire629584113652070319tmp
/x1/jenkins/jenkins-slave/workspace/HBase-0.92/trunk/target/surefire/surefire9153851852167277841tmp
Running org.apache.hadoop.hbase.io.TestHeapSize
Tests run: 2, Failures: 0, Errors: 0, Skipped: 0, Time elapsed: 0.135 sec
Forking command line: /bin/sh -c cd /x1/jenkins/jenkins-slave/workspace/HBase-0.92/trunk &&
/x1/jenkins/tools/java/jdk1.6.0_27-32/jre/bin/java -enableassertions -Xmx1400m -Djava.security.egd=file:/dev/./urandom
-jar /x1/jenkins/jenkins-slave/workspace/HBase-0.92/trunk/target/surefire/surefirebooter333914706135202218.jar
/x1/jenkins/jenkins-slave/workspace/HBase-0.92/trunk/target/surefire/surefire1712696012806392225tmp
/x1/jenkins/jenkins-slave/workspace/HBase-0.92/trunk/target/surefire/surefire1704850575553459835tmp
Running org.apache.hadoop.hbase.TestRegionRebalancing
Tests run: 1, Failures: 0, Errors: 0, Skipped: 0, Time elapsed: 47.449 sec
Forking command line: /bin/sh -c cd /x1/jenkins/jenkins-slave/workspace/HBase-0.92/trunk &&
/x1/jenkins/tools/java/jdk1.6.0_27-32/jre/bin/java -enableassertions -Xmx1400m -Djava.security.egd=file:/dev/./urandom
-jar /x1/jenkins/jenkins-slave/workspace/HBase-0.92/trunk/target/surefire/surefirebooter1095866599845206859.jar
/x1/jenkins/jenkins-slave/workspace/HBase-0.92/trunk/target/surefire/surefire7004911797770064345tmp
/x1/jenkins/jenkins-slave/workspace/HBase-0.92/trunk/target/surefire/surefire7764351824371657842tmp
Running org.apache.hadoop.hbase.mapred.TestTableInputFormat
Tests run: 6, Failures: 0, Errors: 0, Skipped: 0, Time elapsed: 28.025 sec
Forking command line: /bin/sh -c cd /x1/jenkins/jenkins-slave/workspace/HBase-0.92/trunk &&
/x1/jenkins/tools/java/jdk1.6.0_27-32/jre/bin/java -enableassertions -Xmx1400m -Djava.security.egd=file:/dev/./urandom
-jar /x1/jenkins/jenkins-slave/workspace/HBase-0.92/trunk/target/surefire/surefirebooter2019219915978674787.jar
/x1/jenkins/jenkins-slave/workspace/HBase-0.92/trunk/target/surefire/surefire8900692151989489799tmp
/x1/jenkins/jenkins-slave/workspace/HBase-0.92/trunk/target/surefire/surefire5073802844030812199tmp
Running org.apache.hadoop.hbase.mapred.TestTableMapReduce
Tests run: 1, Failures: 0, Errors: 0, Skipped: 0, Time elapsed: 72.433 sec
Forking command line: /bin/sh -c cd /x1/jenkins/jenkins-slave/workspace/HBase-0.92/trunk &&
/x1/jenkins/tools/java/jdk1.6.0_27-32/jre/bin/java -enableassertions -Xmx1400m -Djava.security.egd=file:/dev/./urandom
-jar /x1/jenkins/jenkins-slave/workspace/HBase-0.92/trunk/target/surefire/surefirebooter8881427094181283708.jar
/x1/jenkins/jenkins-slave/workspace/HBase-0.92/trunk/target/surefire/surefire5820577886189748500tmp
/x1/jenkins/jenkins-slave/workspace/HBase-0.92/trunk/target/surefire/surefire8112138476742892479tmp
Running org.apache.hadoop.hbase.replication.regionserver.TestReplicationSink
Tests run: 5, Failures: 0, Errors: 0, Skipped: 0, Time elapsed: 21.914 sec
Forking command line: /bin/sh -c cd /x1/jenkins/jenkins-slave/workspace/HBase-0.92/trunk &&
/x1/jenkins/tools/java/jdk1.6.0_27-32/jre/bin/java -enableassertions -Xmx1400m -Djava.security.egd=file:/dev/./urandom
-jar /x1/jenkins/jenkins-slave/workspace/HBase-0.92/trunk/target/surefire/surefirebooter4982080193059485656.jar
/x1/jenkins/jenkins-slave/workspace/HBase-0.92/trunk/target/surefire/surefire2688492067689616164tmp
/x1/jenkins/jenkins-slave/workspace/HBase-0.92/trunk/target/surefire/surefire7471623832226381837tmp
Running org.apache.hadoop.hbase.replication.regionserver.TestReplicationSourceManager
Tests run: 1, Failures: 0, Errors: 0, Skipped: 0, Time elapsed: 0.877 sec
Forking command line: /bin/sh -c cd /x1/jenkins/jenkins-slave/workspace/HBase-0.92/trunk &&
/x1/jenkins/tools/java/jdk1.6.0_27-32/jre/bin/java -enableassertions -Xmx1400m -Djava.security.egd=file:/dev/./urandom
-jar /x1/jenkins/jenkins-slave/workspace/HBase-0.92/trunk/target/surefire/surefirebooter2174825532425962042.jar
/x1/jenkins/jenkins-slave/workspace/HBase-0.92/trunk/target/surefire/surefire3430758163024008531tmp
/x1/jenkins/jenkins-slave/workspace/HBase-0.92/trunk/target/surefire/surefire4875280141931513359tmp
Running org.apache.hadoop.hbase.replication.TestReplicationSource
Tests run: 1, Failures: 0, Errors: 0, Skipped: 0, Time elapsed: 2.216 sec
Forking command line: /bin/sh -c cd /x1/jenkins/jenkins-slave/workspace/HBase-0.92/trunk &&
/x1/jenkins/tools/java/jdk1.6.0_27-32/jre/bin/java -enableassertions -Xmx1400m -Djava.security.egd=file:/dev/./urandom
-jar /x1/jenkins/jenkins-slave/workspace/HBase-0.92/trunk/target/surefire/surefirebooter8359186851554858416.jar
/x1/jenkins/jenkins-slave/workspace/HBase-0.92/trunk/target/surefire/surefire6614568852842475784tmp
/x1/jenkins/jenkins-slave/workspace/HBase-0.92/trunk/target/surefire/surefire7616167347549468085tmp
Running org.apache.hadoop.hbase.replication.TestReplication
Tests run: 8, Failures: 0, Errors: 0, Skipped: 0, Time elapsed: 120.698 sec
Forking command line: /bin/sh -c cd /x1/jenkins/jenkins-slave/workspace/HBase-0.92/trunk &&
/x1/jenkins/tools/java/jdk1.6.0_27-32/jre/bin/java -enableassertions -Xmx1400m -Djava.security.egd=file:/dev/./urandom
-jar /x1/jenkins/jenkins-slave/workspace/HBase-0.92/trunk/target/surefire/surefirebooter8280267605987444277.jar
/x1/jenkins/jenkins-slave/workspace/HBase-0.92/trunk/target/surefire/surefire4819164499710381103tmp
/x1/jenkins/jenkins-slave/workspace/HBase-0.92/trunk/target/surefire/surefire3398173650095543496tmp
Running org.apache.hadoop.hbase.replication.TestReplicationPeer
Tests run: 1, Failures: 0, Errors: 0, Skipped: 0, Time elapsed: 25.528 sec
Forking command line: /bin/sh -c cd /x1/jenkins/jenkins-slave/workspace/HBase-0.92/trunk &&
/x1/jenkins/tools/java/jdk1.6.0_27-32/jre/bin/java -enableassertions -Xmx1400m -Djava.security.egd=file:/dev/./urandom
-jar /x1/jenkins/jenkins-slave/workspace/HBase-0.92/trunk/target/surefire/surefirebooter3132517409966215782.jar
/x1/jenkins/jenkins-slave/workspace/HBase-0.92/trunk/target/surefire/surefire2907686429788293098tmp
/x1/jenkins/jenkins-slave/workspace/HBase-0.92/trunk/target/surefire/surefire5164568731658120524tmp
Running org.apache.hadoop.hbase.replication.TestMultiSlaveReplication
Tests run: 1, Failures: 0, Errors: 0, Skipped: 0, Time elapsed: 55.98 sec
Forking command line: /bin/sh -c cd /x1/jenkins/jenkins-slave/workspace/HBase-0.92/trunk &&
/x1/jenkins/tools/java/jdk1.6.0_27-32/jre/bin/java -enableassertions -Xmx1400m -Djava.security.egd=file:/dev/./urandom
-jar /x1/jenkins/jenkins-slave/workspace/HBase-0.92/trunk/target/surefire/surefirebooter2776671483036173275.jar
/x1/jenkins/jenkins-slave/workspace/HBase-0.92/trunk/target/surefire/surefire1569751731655992072tmp
/x1/jenkins/jenkins-slave/workspace/HBase-0.92/trunk/target/surefire/surefire2913874977451996796tmp
Running org.apache.hadoop.hbase.replication.TestMasterReplication
Tests run: 2, Failures: 0, Errors: 0, Skipped: 0, Time elapsed: 89.935 sec
Forking command line: /bin/sh -c cd /x1/jenkins/jenkins-slave/workspace/HBase-0.92/trunk &&
/x1/jenkins/tools/java/jdk1.6.0_27-32/jre/bin/java -enableassertions -Xmx1400m -Djava.security.egd=file:/dev/./urandom
-jar /x1/jenkins/jenkins-slave/workspace/HBase-0.92/trunk/target/surefire/surefirebooter3931336693449105541.jar
/x1/jenkins/jenkins-slave/workspace/HBase-0.92/trunk/target/surefire/surefire6172492497008329037tmp
/x1/jenkins/jenkins-slave/workspace/HBase-0.92/trunk/target/surefire/surefire3200491868491593416tmp
Running org.apache.hadoop.hbase.util.TestHBaseFsckComparator
Tests run: 7, Failures: 0, Errors: 0, Skipped: 0, Time elapsed: 0.133 sec
Forking command line: /bin/sh -c cd /x1/jenkins/jenkins-slave/workspace/HBase-0.92/trunk &&
/x1/jenkins/tools/java/jdk1.6.0_27-32/jre/bin/java -enableassertions -Xmx1400m -Djava.security.egd=file:/dev/./urandom
-jar /x1/jenkins/jenkins-slave/workspace/HBase-0.92/trunk/target/surefire/surefirebooter3952850682575211068.jar
/x1/jenkins/jenkins-slave/workspace/HBase-0.92/trunk/target/surefire/surefire6390779658927790231tmp
/x1/jenkins/jenkins-slave/workspace/HBase-0.92/trunk/target/surefire/surefire9018585557027408325tmp
Running org.apache.hadoop.hbase.util.TestMergeTool
Tests run: 1, Failures: 0, Errors: 0, Skipped: 0, Time elapsed: 336.787 sec
Forking command line: /bin/sh -c cd /x1/jenkins/jenkins-slave/workspace/HBase-0.92/trunk &&
/x1/jenkins/tools/java/jdk1.6.0_27-32/jre/bin/java -enableassertions -Xmx1400m -Djava.security.egd=file:/dev/./urandom
-jar /x1/jenkins/jenkins-slave/workspace/HBase-0.92/trunk/target/surefire/surefirebooter6711359288092559179.jar
/x1/jenkins/jenkins-slave/workspace/HBase-0.92/trunk/target/surefire/surefire2101932262690455309tmp
/x1/jenkins/jenkins-slave/workspace/HBase-0.92/trunk/target/surefire/surefire6287523236660960484tmp
Running org.apache.hadoop.hbase.util.TestFSTableDescriptors
Tests run: 10, Failures: 0, Errors: 0, Skipped: 0, Time elapsed: 0.765 sec
Forking command line: /bin/sh -c cd /x1/jenkins/jenkins-slave/workspace/HBase-0.92/trunk &&
/x1/jenkins/tools/java/jdk1.6.0_27-32/jre/bin/java -enableassertions -Xmx1400m -Djava.security.egd=file:/dev/./urandom
-jar /x1/jenkins/jenkins-slave/workspace/HBase-0.92/trunk/target/surefire/surefirebooter3460415240789939238.jar
/x1/jenkins/jenkins-slave/workspace/HBase-0.92/trunk/target/surefire/surefire7071555868310395609tmp
/x1/jenkins/jenkins-slave/workspace/HBase-0.92/trunk/target/surefire/surefire2527784226041298092tmp
Running org.apache.hadoop.hbase.util.TestIdLock
Tests run: 1, Failures: 0, Errors: 0, Skipped: 0, Time elapsed: 15.201 sec
Forking command line: /bin/sh -c cd /x1/jenkins/jenkins-slave/workspace/HBase-0.92/trunk &&
/x1/jenkins/tools/java/jdk1.6.0_27-32/jre/bin/java -enableassertions -Xmx1400m -Djava.security.egd=file:/dev/./urandom
-jar /x1/jenkins/jenkins-slave/workspace/HBase-0.92/trunk/target/surefire/surefirebooter6450830453506138407.jar
/x1/jenkins/jenkins-slave/workspace/HBase-0.92/trunk/target/surefire/surefire2435204071028362460tmp
/x1/jenkins/jenkins-slave/workspace/HBase-0.92/trunk/target/surefire/surefire572817234333443861tmp
Running org.apache.hadoop.hbase.util.TestCompressionTest
Tests run: 1, Failures: 0, Errors: 0, Skipped: 0, Time elapsed: 0.308 sec
Forking command line: /bin/sh -c cd /x1/jenkins/jenkins-slave/workspace/HBase-0.92/trunk &&
/x1/jenkins/tools/java/jdk1.6.0_27-32/jre/bin/java -enableassertions -Xmx1400m -Djava.security.egd=file:/dev/./urandom
-jar /x1/jenkins/jenkins-slave/workspace/HBase-0.92/trunk/target/surefire/surefirebooter1605802091075783818.jar
/x1/jenkins/jenkins-slave/workspace/HBase-0.92/trunk/target/surefire/surefire4140551446990898150tmp
/x1/jenkins/jenkins-slave/workspace/HBase-0.92/trunk/target/surefire/surefire8139592306500041916tmp
Running org.apache.hadoop.hbase.util.TestBytes
Tests run: 13, Failures: 0, Errors: 0, Skipped: 0, Time elapsed: 0.117 sec
Forking command line: /bin/sh -c cd /x1/jenkins/jenkins-slave/workspace/HBase-0.92/trunk &&
/x1/jenkins/tools/java/jdk1.6.0_27-32/jre/bin/java -enableassertions -Xmx1400m -Djava.security.egd=file:/dev/./urandom
-jar /x1/jenkins/jenkins-slave/workspace/HBase-0.92/trunk/target/surefire/surefirebooter156132497681384653.jar
/x1/jenkins/jenkins-slave/workspace/HBase-0.92/trunk/target/surefire/surefire8478594427126283960tmp
/x1/jenkins/jenkins-slave/workspace/HBase-0.92/trunk/target/surefire/surefire6283430303617953088tmp
Running org.apache.hadoop.hbase.util.TestSortedCopyOnWriteSet
Tests run: 2, Failures: 0, Errors: 0, Skipped: 0, Time elapsed: 0.052 sec
Forking command line: /bin/sh -c cd /x1/jenkins/jenkins-slave/workspace/HBase-0.92/trunk &&
/x1/jenkins/tools/java/jdk1.6.0_27-32/jre/bin/java -enableassertions -Xmx1400m -Djava.security.egd=file:/dev/./urandom
-jar /x1/jenkins/jenkins-slave/workspace/HBase-0.92/trunk/target/surefire/surefirebooter9075135525664056258.jar
/x1/jenkins/jenkins-slave/workspace/HBase-0.92/trunk/target/surefire/surefire2209794973744193379tmp
/x1/jenkins/jenkins-slave/workspace/HBase-0.92/trunk/target/surefire/surefire318305480739081752tmp
Running org.apache.hadoop.hbase.util.TestEnvironmentEdgeManager
Tests run: 2, Failures: 0, Errors: 0, Skipped: 0, Time elapsed: 0.168 sec
Forking command line: /bin/sh -c cd /x1/jenkins/jenkins-slave/workspace/HBase-0.92/trunk &&
/x1/jenkins/tools/java/jdk1.6.0_27-32/jre/bin/java -enableassertions -Xmx1400m -Djava.security.egd=file:/dev/./urandom
-jar /x1/jenkins/jenkins-slave/workspace/HBase-0.92/trunk/target/surefire/surefirebooter3345400913864865080.jar
/x1/jenkins/jenkins-slave/workspace/HBase-0.92/trunk/target/surefire/surefire6902719563136057991tmp
/x1/jenkins/jenkins-slave/workspace/HBase-0.92/trunk/target/surefire/surefire7492058756798954781tmp
Running org.apache.hadoop.hbase.util.TestKeying
Tests run: 1, Failures: 0, Errors: 0, Skipped: 0, Time elapsed: 0.032 sec
Forking command line: /bin/sh -c cd /x1/jenkins/jenkins-slave/workspace/HBase-0.92/trunk &&
/x1/jenkins/tools/java/jdk1.6.0_27-32/jre/bin/java -enableassertions -Xmx1400m -Djava.security.egd=file:/dev/./urandom
-jar /x1/jenkins/jenkins-slave/workspace/HBase-0.92/trunk/target/surefire/surefirebooter2466858313498520019.jar
/x1/jenkins/jenkins-slave/workspace/HBase-0.92/trunk/target/surefire/surefire6120481484356370250tmp
/x1/jenkins/jenkins-slave/workspace/HBase-0.92/trunk/target/surefire/surefire1165928072941246508tmp
Running org.apache.hadoop.hbase.util.TestByteBloomFilter
Tests run: 5, Failures: 0, Errors: 0, Skipped: 0, Time elapsed: 0.998 sec
Forking command line: /bin/sh -c cd /x1/jenkins/jenkins-slave/workspace/HBase-0.92/trunk &&
/x1/jenkins/tools/java/jdk1.6.0_27-32/jre/bin/java -enableassertions -Xmx1400m -Djava.security.egd=file:/dev/./urandom
-jar /x1/jenkins/jenkins-slave/workspace/HBase-0.92/trunk/target/surefire/surefirebooter3632522476483977655.jar
/x1/jenkins/jenkins-slave/workspace/HBase-0.92/trunk/target/surefire/surefire6636279379480380581tmp
/x1/jenkins/jenkins-slave/workspace/HBase-0.92/trunk/target/surefire/surefire3353631828662352008tmp
Running org.apache.hadoop.hbase.util.TestRootPath
Tests run: 1, Failures: 0, Errors: 0, Skipped: 0, Time elapsed: 0.09 sec
Forking command line: /bin/sh -c cd /x1/jenkins/jenkins-slave/workspace/HBase-0.92/trunk &&
/x1/jenkins/tools/java/jdk1.6.0_27-32/jre/bin/java -enableassertions -Xmx1400m -Djava.security.egd=file:/dev/./urandom
-jar /x1/jenkins/jenkins-slave/workspace/HBase-0.92/trunk/target/surefire/surefirebooter3701739216453507441.jar
/x1/jenkins/jenkins-slave/workspace/HBase-0.92/trunk/target/surefire/surefire8583031413127598098tmp
/x1/jenkins/jenkins-slave/workspace/HBase-0.92/trunk/target/surefire/surefire546291755690935324tmp
Running org.apache.hadoop.hbase.util.TestMergeTable
Tests run: 1, Failures: 0, Errors: 0, Skipped: 0, Time elapsed: 29.385 sec
Forking command line: /bin/sh -c cd /x1/jenkins/jenkins-slave/workspace/HBase-0.92/trunk &&
/x1/jenkins/tools/java/jdk1.6.0_27-32/jre/bin/java -enableassertions -Xmx1400m -Djava.security.egd=file:/dev/./urandom
-jar /x1/jenkins/jenkins-slave/workspace/HBase-0.92/trunk/target/surefire/surefirebooter127767684546211718.jar
/x1/jenkins/jenkins-slave/workspace/HBase-0.92/trunk/target/surefire/surefire1799578078756943001tmp
/x1/jenkins/jenkins-slave/workspace/HBase-0.92/trunk/target/surefire/surefire726263707294709303tmp
Running org.apache.hadoop.hbase.util.TestHBaseFsck
Tests run: 6, Failures: 0, Errors: 0, Skipped: 0, Time elapsed: 43.758 sec
Forking command line: /bin/sh -c cd /x1/jenkins/jenkins-slave/workspace/HBase-0.92/trunk &&
/x1/jenkins/tools/java/jdk1.6.0_27-32/jre/bin/java -enableassertions -Xmx1400m -Djava.security.egd=file:/dev/./urandom
-jar /x1/jenkins/jenkins-slave/workspace/HBase-0.92/trunk/target/surefire/surefirebooter4051296222738642158.jar
/x1/jenkins/jenkins-slave/workspace/HBase-0.92/trunk/target/surefire/surefire3923816829825421875tmp
/x1/jenkins/jenkins-slave/workspace/HBase-0.92/trunk/target/surefire/surefire7195877862889787688tmp
Running org.apache.hadoop.hbase.util.TestFSUtils
Tests run: 2, Failures: 0, Errors: 0, Skipped: 0, Time elapsed: 19.702 sec
Forking command line: /bin/sh -c cd /x1/jenkins/jenkins-slave/workspace/HBase-0.92/trunk &&
/x1/jenkins/tools/java/jdk1.6.0_27-32/jre/bin/java -enableassertions -Xmx1400m -Djava.security.egd=file:/dev/./urandom
-jar /x1/jenkins/jenkins-slave/workspace/HBase-0.92/trunk/target/surefire/surefirebooter1456218816198790036.jar
/x1/jenkins/jenkins-slave/workspace/HBase-0.92/trunk/target/surefire/surefire4161902088351403301tmp
/x1/jenkins/jenkins-slave/workspace/HBase-0.92/trunk/target/surefire/surefire8929606329037713733tmp
Running org.apache.hadoop.hbase.util.TestPoolMap
Tests run: 9, Failures: 0, Errors: 0, Skipped: 0, Time elapsed: 0.038 sec
Forking command line: /bin/sh -c cd /x1/jenkins/jenkins-slave/workspace/HBase-0.92/trunk &&
/x1/jenkins/tools/java/jdk1.6.0_27-32/jre/bin/java -enableassertions -Xmx1400m -Djava.security.egd=file:/dev/./urandom
-jar /x1/jenkins/jenkins-slave/workspace/HBase-0.92/trunk/target/surefire/surefirebooter8851628699630488482.jar
/x1/jenkins/jenkins-slave/workspace/HBase-0.92/trunk/target/surefire/surefire127132408236291312tmp
/x1/jenkins/jenkins-slave/workspace/HBase-0.92/trunk/target/surefire/surefire3010822032462531550tmp
Running org.apache.hadoop.hbase.util.TestBase64
Tests run: 1, Failures: 0, Errors: 0, Skipped: 0, Time elapsed: 0.081 sec
Forking command line: /bin/sh -c cd /x1/jenkins/jenkins-slave/workspace/HBase-0.92/trunk &&
/x1/jenkins/tools/java/jdk1.6.0_27-32/jre/bin/java -enableassertions -Xmx1400m -Djava.security.egd=file:/dev/./urandom
-jar /x1/jenkins/jenkins-slave/workspace/HBase-0.92/trunk/target/surefire/surefirebooter4334897707315580048.jar
/x1/jenkins/jenkins-slave/workspace/HBase-0.92/trunk/target/surefire/surefire8132990686025844941tmp
/x1/jenkins/jenkins-slave/workspace/HBase-0.92/trunk/target/surefire/surefire7423942999928455923tmp
Running org.apache.hadoop.hbase.util.hbck.TestOfflineMetaRebuildBase
Tests run: 1, Failures: 0, Errors: 0, Skipped: 0, Time elapsed: 32.747 sec
Forking command line: /bin/sh -c cd /x1/jenkins/jenkins-slave/workspace/HBase-0.92/trunk &&
/x1/jenkins/tools/java/jdk1.6.0_27-32/jre/bin/java -enableassertions -Xmx1400m -Djava.security.egd=file:/dev/./urandom
-jar /x1/jenkins/jenkins-slave/workspace/HBase-0.92/trunk/target/surefire/surefirebooter7218452031739283543.jar
/x1/jenkins/jenkins-slave/workspace/HBase-0.92/trunk/target/surefire/surefire8882303565571408550tmp
/x1/jenkins/jenkins-slave/workspace/HBase-0.92/trunk/target/surefire/surefire7407703467968818146tmp
Running org.apache.hadoop.hbase.util.hbck.TestOfflineMetaRebuildOverlap
Tests run: 1, Failures: 0, Errors: 0, Skipped: 0, Time elapsed: 32.387 sec
Forking command line: /bin/sh -c cd /x1/jenkins/jenkins-slave/workspace/HBase-0.92/trunk &&
/x1/jenkins/tools/java/jdk1.6.0_27-32/jre/bin/java -enableassertions -Xmx1400m -Djava.security.egd=file:/dev/./urandom
-jar /x1/jenkins/jenkins-slave/workspace/HBase-0.92/trunk/target/surefire/surefirebooter2433651126492095767.jar
/x1/jenkins/jenkins-slave/workspace/HBase-0.92/trunk/target/surefire/surefire3272892201446399160tmp
/x1/jenkins/jenkins-slave/workspace/HBase-0.92/trunk/target/surefire/surefire6161605845635589583tmp
Running org.apache.hadoop.hbase.util.hbck.TestOfflineMetaRebuildHole
Tests run: 1, Failures: 0, Errors: 0, Skipped: 0, Time elapsed: 32.619 sec
Forking command line: /bin/sh -c cd /x1/jenkins/jenkins-slave/workspace/HBase-0.92/trunk &&
/x1/jenkins/tools/java/jdk1.6.0_27-32/jre/bin/java -enableassertions -Xmx1400m -Djava.security.egd=file:/dev/./urandom
-jar /x1/jenkins/jenkins-slave/workspace/HBase-0.92/trunk/target/surefire/surefirebooter7436110180765152665.jar
/x1/jenkins/jenkins-slave/workspace/HBase-0.92/trunk/target/surefire/surefire5526515631135779790tmp
/x1/jenkins/jenkins-slave/workspace/HBase-0.92/trunk/target/surefire/surefire8494340241425018363tmp
Running org.apache.hadoop.hbase.util.TestDefaultEnvironmentEdge
Tests run: 1, Failures: 0, Errors: 0, Skipped: 0, Time elapsed: 0.044 sec
Forking command line: /bin/sh -c cd /x1/jenkins/jenkins-slave/workspace/HBase-0.92/trunk &&
/x1/jenkins/tools/java/jdk1.6.0_27-32/jre/bin/java -enableassertions -Xmx1400m -Djava.security.egd=file:/dev/./urandom
-jar /x1/jenkins/jenkins-slave/workspace/HBase-0.92/trunk/target/surefire/surefirebooter7251874336568245320.jar
/x1/jenkins/jenkins-slave/workspace/HBase-0.92/trunk/target/surefire/surefire5809506036914040935tmp
/x1/jenkins/jenkins-slave/workspace/HBase-0.92/trunk/target/surefire/surefire3860263364274881012tmp
Running org.apache.hadoop.hbase.util.TestIncrementingEnvironmentEdge
Tests run: 1, Failures: 0, Errors: 0, Skipped: 0, Time elapsed: 0.046 sec
Forking command line: /bin/sh -c cd /x1/jenkins/jenkins-slave/workspace/HBase-0.92/trunk &&
/x1/jenkins/tools/java/jdk1.6.0_27-32/jre/bin/java -enableassertions -Xmx1400m -Djava.security.egd=file:/dev/./urandom
-jar /x1/jenkins/jenkins-slave/workspace/HBase-0.92/trunk/target/surefire/surefirebooter5833050464615773316.jar
/x1/jenkins/jenkins-slave/workspace/HBase-0.92/trunk/target/surefire/surefire1181690866806233000tmp
/x1/jenkins/jenkins-slave/workspace/HBase-0.92/trunk/target/surefire/surefire6473672008466864770tmp
Running org.apache.hadoop.hbase.util.TestRegionSplitCalculator
Tests run: 14, Failures: 0, Errors: 0, Skipped: 0, Time elapsed: 0.144 sec
Forking command line: /bin/sh -c cd /x1/jenkins/jenkins-slave/workspace/HBase-0.92/trunk &&
/x1/jenkins/tools/java/jdk1.6.0_27-32/jre/bin/java -enableassertions -Xmx1400m -Djava.security.egd=file:/dev/./urandom
-jar /x1/jenkins/jenkins-slave/workspace/HBase-0.92/trunk/target/surefire/surefirebooter2692320441695202861.jar
/x1/jenkins/jenkins-slave/workspace/HBase-0.92/trunk/target/surefire/surefire3956293027130308996tmp
/x1/jenkins/jenkins-slave/workspace/HBase-0.92/trunk/target/surefire/surefire312504227034625281tmp
Running org.apache.hadoop.hbase.TestHRegionLocation
Tests run: 3, Failures: 0, Errors: 0, Skipped: 0, Time elapsed: 0.118 sec
Forking command line: /bin/sh -c cd /x1/jenkins/jenkins-slave/workspace/HBase-0.92/trunk &&
/x1/jenkins/tools/java/jdk1.6.0_27-32/jre/bin/java -enableassertions -Xmx1400m -Djava.security.egd=file:/dev/./urandom
-jar /x1/jenkins/jenkins-slave/workspace/HBase-0.92/trunk/target/surefire/surefirebooter3619136600166204844.jar
/x1/jenkins/jenkins-slave/workspace/HBase-0.92/trunk/target/surefire/surefire570468158259305469tmp
/x1/jenkins/jenkins-slave/workspace/HBase-0.92/trunk/target/surefire/surefire9146246195702691543tmp
Running org.apache.hadoop.hbase.migration.TestMigrationFrom090To092
Tests run: 1, Failures: 0, Errors: 0, Skipped: 0, Time elapsed: 0.221 sec
Forking command line: /bin/sh -c cd /x1/jenkins/jenkins-slave/workspace/HBase-0.92/trunk &&
/x1/jenkins/tools/java/jdk1.6.0_27-32/jre/bin/java -enableassertions -Xmx1400m -Djava.security.egd=file:/dev/./urandom
-jar /x1/jenkins/jenkins-slave/workspace/HBase-0.92/trunk/target/surefire/surefirebooter8776934411092796942.jar
/x1/jenkins/jenkins-slave/workspace/HBase-0.92/trunk/target/surefire/surefire6948191683677269014tmp
/x1/jenkins/jenkins-slave/workspace/HBase-0.92/trunk/target/surefire/surefire7164876489454339537tmp
Running org.apache.hadoop.hbase.TestCompare
Tests run: 1, Failures: 0, Errors: 0, Skipped: 0, Time elapsed: 0.179 sec
Forking command line: /bin/sh -c cd /x1/jenkins/jenkins-slave/workspace/HBase-0.92/trunk &&
/x1/jenkins/tools/java/jdk1.6.0_27-32/jre/bin/java -enableassertions -Xmx1400m -Djava.security.egd=file:/dev/./urandom
-jar /x1/jenkins/jenkins-slave/workspace/HBase-0.92/trunk/target/surefire/surefirebooter2957503375608743785.jar
/x1/jenkins/jenkins-slave/workspace/HBase-0.92/trunk/target/surefire/surefire8818537376918724102tmp
/x1/jenkins/jenkins-slave/workspace/HBase-0.92/trunk/target/surefire/surefire5594089630451196221tmp
Running org.apache.hadoop.hbase.TestInfoServers
Tests run: 2, Failures: 0, Errors: 0, Skipped: 0, Time elapsed: 15.683 sec
Forking command line: /bin/sh -c cd /x1/jenkins/jenkins-slave/workspace/HBase-0.92/trunk &&
/x1/jenkins/tools/java/jdk1.6.0_27-32/jre/bin/java -enableassertions -Xmx1400m -Djava.security.egd=file:/dev/./urandom
-jar /x1/jenkins/jenkins-slave/workspace/HBase-0.92/trunk/target/surefire/surefirebooter5667894979829657827.jar
/x1/jenkins/jenkins-slave/workspace/HBase-0.92/trunk/target/surefire/surefire3659211997955299562tmp
/x1/jenkins/jenkins-slave/workspace/HBase-0.92/trunk/target/surefire/surefire7077336625192002602tmp
Running org.apache.hadoop.hbase.TestHServerAddress
Tests run: 6, Failures: 0, Errors: 0, Skipped: 0, Time elapsed: 0.053 sec
Forking command line: /bin/sh -c cd /x1/jenkins/jenkins-slave/workspace/HBase-0.92/trunk &&
/x1/jenkins/tools/java/jdk1.6.0_27-32/jre/bin/java -enableassertions -Xmx1400m -Djava.security.egd=file:/dev/./urandom
-jar /x1/jenkins/jenkins-slave/workspace/HBase-0.92/trunk/target/surefire/surefirebooter8590401490598531553.jar
/x1/jenkins/jenkins-slave/workspace/HBase-0.92/trunk/target/surefire/surefire1957107805147260830tmp
/x1/jenkins/jenkins-slave/workspace/HBase-0.92/trunk/target/surefire/surefire458159013001401225tmp
Running org.apache.hadoop.hbase.TestServerName
Tests run: 4, Failures: 0, Errors: 0, Skipped: 0, Time elapsed: 0.109 sec

Results :

Tests run: 1077, Failures: 0, Errors: 0, Skipped: 8

[INFO] ------------------------------------------------------------------------
[INFO] BUILD FAILURE
[INFO] ------------------------------------------------------------------------
[INFO] Total time: 2:04:11.398s
[INFO] Finished at: Wed Jan 18 03:08:27 UTC 2012
[INFO] Final Memory: 52M/746M
[INFO] ------------------------------------------------------------------------
[ERROR] Failed to execute goal org.apache.maven.plugins:maven-surefire-plugin:2.10:test (default-test)
on project hbase: Failure or timeout -> [Help 1]
org.apache.maven.lifecycle.LifecycleExecutionException: Failed to execute goal org.apache.maven.plugins:maven-surefire-plugin:2.10:test
(default-test) on project hbase: Failure or timeout
	at org.apache.maven.lifecycle.internal.MojoExecutor.execute(MojoExecutor.java:217)
	at org.apache.maven.lifecycle.internal.MojoExecutor.execute(MojoExecutor.java:153)
	at org.apache.maven.lifecycle.internal.MojoExecutor.execute(MojoExecutor.java:145)
	at org.apache.maven.lifecycle.internal.MojoExecutor.executeForkedExecutions(MojoExecutor.java:365)
	at org.apache.maven.lifecycle.internal.MojoExecutor.execute(MojoExecutor.java:199)
	at org.apache.maven.lifecycle.internal.MojoExecutor.execute(MojoExecutor.java:153)
	at org.apache.maven.lifecycle.internal.MojoExecutor.execute(MojoExecutor.java:145)
	at org.apache.maven.lifecycle.internal.LifecycleModuleBuilder.buildProject(LifecycleModuleBuilder.java:84)
	at org.apache.maven.lifecycle.internal.LifecycleModuleBuilder.buildProject(LifecycleModuleBuilder.java:59)
	at org.apache.maven.lifecycle.internal.LifecycleStarter.singleThreadedBuild(LifecycleStarter.java:183)
	at org.apache.maven.lifecycle.internal.LifecycleStarter.execute(LifecycleStarter.java:161)
	at org.apache.maven.DefaultMaven.doExecute(DefaultMaven.java:319)
	at org.apache.maven.DefaultMaven.execute(DefaultMaven.java:156)
	at org.apache.maven.cli.MavenCli.execute(MavenCli.java:537)
	at org.apache.maven.cli.MavenCli.doMain(MavenCli.java:196)
	at org.apache.maven.cli.MavenCli.main(MavenCli.java:141)
	at sun.reflect.NativeMethodAccessorImpl.invoke0(Native Method)
	at sun.reflect.NativeMethodAccessorImpl.invoke(NativeMethodAccessorImpl.java:39)
	at sun.reflect.DelegatingMethodAccessorImpl.invoke(DelegatingMethodAccessorImpl.java:25)
	at java.lang.reflect.Method.invoke(Method.java:597)
	at org.codehaus.plexus.classworlds.launcher.Launcher.launchEnhanced(Launcher.java:290)
	at org.codehaus.plexus.classworlds.launcher.Launcher.launch(Launcher.java:230)
	at org.codehaus.plexus.classworlds.launcher.Launcher.mainWithExitCode(Launcher.java:409)
	at org.codehaus.plexus.classworlds.launcher.Launcher.main(Launcher.java:352)
Caused by: org.apache.maven.plugin.MojoExecutionException: Failure or timeout
	at org.apache.maven.plugin.surefire.SurefirePlugin.assertNoFailureOrTimeout(SurefirePlugin.java:633)
	at org.apache.maven.plugin.surefire.SurefirePlugin.handleSummary(SurefirePlugin.java:614)
	at org.apache.maven.plugin.surefire.AbstractSurefireMojo.executeAfterPreconditionsChecked(AbstractSurefireMojo.java:137)
	at org.apache.maven.plugin.surefire.AbstractSurefireMojo.execute(AbstractSurefireMojo.java:98)
	at org.apache.maven.plugin.DefaultBuildPluginManager.executeMojo(DefaultBuildPluginManager.java:101)
	at org.apache.maven.lifecycle.internal.MojoExecutor.execute(MojoExecutor.java:209)
	... 23 more
[ERROR] 
[ERROR] 
[ERROR] For more information about the errors and possible solutions, please read the following
articles:
[ERROR] [Help 1] http://cwiki.apache.org/confluence/display/MAVEN/MojoExecutionException
Build step 'Invoke top-level Maven targets' marked build as failure
[locks-and-latches] Releasing all the locks
[locks-and-latches] All the locks released
Archiving artifacts
Recording test results


Mime
View raw message