hbase-dev mailing list archives

Site index · List index
Message view « Date » · « Thread »
Top « Date » · « Thread »
From Apache Jenkins Server <jenk...@builds.apache.org>
Subject Build failed in Jenkins: HBase-0.92-security #78
Date Mon, 16 Jan 2012 23:45:39 GMT
See <https://builds.apache.org/job/HBase-0.92-security/78/>

------------------------------------------
[...truncated 6740 lines...]
Forking command line: /bin/sh -c cd <https://builds.apache.org/job/HBase-0.92-security/ws/trunk> && /home/hudson/tools/java/jdk1.6.0_27-32/jre/bin/java -enableassertions -Xmx1400m -Djava.security.egd=file:/dev/./urandom -jar <https://builds.apache.org/job/HBase-0.92-security/ws/trunk/target/surefire/surefirebooter8565616590357785307.jar> <https://builds.apache.org/job/HBase-0.92-security/ws/trunk/target/surefire/surefire4077516746979067192tmp> <https://builds.apache.org/job/HBase-0.92-security/ws/trunk/target/surefire/surefire5206720106188246611tmp>
Running org.apache.hadoop.hbase.regionserver.TestKeyValueScanFixture
Tests run: 1, Failures: 0, Errors: 0, Skipped: 0, Time elapsed: 0.117 sec
Forking command line: /bin/sh -c cd <https://builds.apache.org/job/HBase-0.92-security/ws/trunk> && /home/hudson/tools/java/jdk1.6.0_27-32/jre/bin/java -enableassertions -Xmx1400m -Djava.security.egd=file:/dev/./urandom -jar <https://builds.apache.org/job/HBase-0.92-security/ws/trunk/target/surefire/surefirebooter4984601343277223722.jar> <https://builds.apache.org/job/HBase-0.92-security/ws/trunk/target/surefire/surefire1281303831842147014tmp> <https://builds.apache.org/job/HBase-0.92-security/ws/trunk/target/surefire/surefire5998914168234496945tmp>
Running org.apache.hadoop.hbase.regionserver.TestStoreFile
Tests run: 8, Failures: 0, Errors: 0, Skipped: 0, Time elapsed: 1.771 sec
Forking command line: /bin/sh -c cd <https://builds.apache.org/job/HBase-0.92-security/ws/trunk> && /home/hudson/tools/java/jdk1.6.0_27-32/jre/bin/java -enableassertions -Xmx1400m -Djava.security.egd=file:/dev/./urandom -jar <https://builds.apache.org/job/HBase-0.92-security/ws/trunk/target/surefire/surefirebooter6762207630354603821.jar> <https://builds.apache.org/job/HBase-0.92-security/ws/trunk/target/surefire/surefire389991828595100945tmp> <https://builds.apache.org/job/HBase-0.92-security/ws/trunk/target/surefire/surefire2703944508383166546tmp>
Running org.apache.hadoop.hbase.regionserver.TestKeyValueSkipListSet
Tests run: 4, Failures: 0, Errors: 0, Skipped: 0, Time elapsed: 0.122 sec
Forking command line: /bin/sh -c cd <https://builds.apache.org/job/HBase-0.92-security/ws/trunk> && /home/hudson/tools/java/jdk1.6.0_27-32/jre/bin/java -enableassertions -Xmx1400m -Djava.security.egd=file:/dev/./urandom -jar <https://builds.apache.org/job/HBase-0.92-security/ws/trunk/target/surefire/surefirebooter5516236465170398550.jar> <https://builds.apache.org/job/HBase-0.92-security/ws/trunk/target/surefire/surefire2925550443462593498tmp> <https://builds.apache.org/job/HBase-0.92-security/ws/trunk/target/surefire/surefire5541169393109746065tmp>
Running org.apache.hadoop.hbase.regionserver.TestExplicitColumnTracker
Tests run: 4, Failures: 0, Errors: 0, Skipped: 0, Time elapsed: 0.9 sec
Forking command line: /bin/sh -c cd <https://builds.apache.org/job/HBase-0.92-security/ws/trunk> && /home/hudson/tools/java/jdk1.6.0_27-32/jre/bin/java -enableassertions -Xmx1400m -Djava.security.egd=file:/dev/./urandom -jar <https://builds.apache.org/job/HBase-0.92-security/ws/trunk/target/surefire/surefirebooter1596362265770927998.jar> <https://builds.apache.org/job/HBase-0.92-security/ws/trunk/target/surefire/surefire5868804169912937822tmp> <https://builds.apache.org/job/HBase-0.92-security/ws/trunk/target/surefire/surefire7875614817071210687tmp>
Running org.apache.hadoop.hbase.regionserver.TestHRegionServerBulkLoad
Tests run: 1, Failures: 0, Errors: 0, Skipped: 0, Time elapsed: 53.002 sec
Forking command line: /bin/sh -c cd <https://builds.apache.org/job/HBase-0.92-security/ws/trunk> && /home/hudson/tools/java/jdk1.6.0_27-32/jre/bin/java -enableassertions -Xmx1400m -Djava.security.egd=file:/dev/./urandom -jar <https://builds.apache.org/job/HBase-0.92-security/ws/trunk/target/surefire/surefirebooter7497271311862838656.jar> <https://builds.apache.org/job/HBase-0.92-security/ws/trunk/target/surefire/surefire2875174313638645822tmp> <https://builds.apache.org/job/HBase-0.92-security/ws/trunk/target/surefire/surefire7411812268805018096tmp>
Running org.apache.hadoop.hbase.regionserver.TestMemStoreLAB
Tests run: 3, Failures: 0, Errors: 0, Skipped: 0, Time elapsed: 1.402 sec
Forking command line: /bin/sh -c cd <https://builds.apache.org/job/HBase-0.92-security/ws/trunk> && /home/hudson/tools/java/jdk1.6.0_27-32/jre/bin/java -enableassertions -Xmx1400m -Djava.security.egd=file:/dev/./urandom -jar <https://builds.apache.org/job/HBase-0.92-security/ws/trunk/target/surefire/surefirebooter3376036785628918980.jar> <https://builds.apache.org/job/HBase-0.92-security/ws/trunk/target/surefire/surefire3118164851112294219tmp> <https://builds.apache.org/job/HBase-0.92-security/ws/trunk/target/surefire/surefire2870969633979072622tmp>
Running org.apache.hadoop.hbase.regionserver.TestSplitLogWorker
Tests run: 5, Failures: 0, Errors: 0, Skipped: 0, Time elapsed: 2.525 sec
Forking command line: /bin/sh -c cd <https://builds.apache.org/job/HBase-0.92-security/ws/trunk> && /home/hudson/tools/java/jdk1.6.0_27-32/jre/bin/java -enableassertions -Xmx1400m -Djava.security.egd=file:/dev/./urandom -jar <https://builds.apache.org/job/HBase-0.92-security/ws/trunk/target/surefire/surefirebooter4505097665033039326.jar> <https://builds.apache.org/job/HBase-0.92-security/ws/trunk/target/surefire/surefire6396328305708116843tmp> <https://builds.apache.org/job/HBase-0.92-security/ws/trunk/target/surefire/surefire1827106348500187633tmp>
Running org.apache.hadoop.hbase.regionserver.TestMultiColumnScanner
Tests run: 6, Failures: 0, Errors: 0, Skipped: 0, Time elapsed: 18.733 sec
Forking command line: /bin/sh -c cd <https://builds.apache.org/job/HBase-0.92-security/ws/trunk> && /home/hudson/tools/java/jdk1.6.0_27-32/jre/bin/java -enableassertions -Xmx1400m -Djava.security.egd=file:/dev/./urandom -jar <https://builds.apache.org/job/HBase-0.92-security/ws/trunk/target/surefire/surefirebooter1396672133972730740.jar> <https://builds.apache.org/job/HBase-0.92-security/ws/trunk/target/surefire/surefire4371095403592479948tmp> <https://builds.apache.org/job/HBase-0.92-security/ws/trunk/target/surefire/surefire2286189272911557771tmp>
Running org.apache.hadoop.hbase.regionserver.TestSplitTransaction
Tests run: 6, Failures: 0, Errors: 0, Skipped: 0, Time elapsed: 3.914 sec
Forking command line: /bin/sh -c cd <https://builds.apache.org/job/HBase-0.92-security/ws/trunk> && /home/hudson/tools/java/jdk1.6.0_27-32/jre/bin/java -enableassertions -Xmx1400m -Djava.security.egd=file:/dev/./urandom -jar <https://builds.apache.org/job/HBase-0.92-security/ws/trunk/target/surefire/surefirebooter1083492484102895548.jar> <https://builds.apache.org/job/HBase-0.92-security/ws/trunk/target/surefire/surefire4178844201847414617tmp> <https://builds.apache.org/job/HBase-0.92-security/ws/trunk/target/surefire/surefire4606622073240671041tmp>
Running org.apache.hadoop.hbase.regionserver.TestCompoundBloomFilter
Tests run: 3, Failures: 0, Errors: 0, Skipped: 0, Time elapsed: 20.985 sec
Forking command line: /bin/sh -c cd <https://builds.apache.org/job/HBase-0.92-security/ws/trunk> && /home/hudson/tools/java/jdk1.6.0_27-32/jre/bin/java -enableassertions -Xmx1400m -Djava.security.egd=file:/dev/./urandom -jar <https://builds.apache.org/job/HBase-0.92-security/ws/trunk/target/surefire/surefirebooter3350930696970361376.jar> <https://builds.apache.org/job/HBase-0.92-security/ws/trunk/target/surefire/surefire8023127048446862136tmp> <https://builds.apache.org/job/HBase-0.92-security/ws/trunk/target/surefire/surefire783805450797056161tmp>
Running org.apache.hadoop.hbase.regionserver.TestEndToEndSplitTransaction
Tests run: 1, Failures: 0, Errors: 0, Skipped: 0, Time elapsed: 49.788 sec
Forking command line: /bin/sh -c cd <https://builds.apache.org/job/HBase-0.92-security/ws/trunk> && /home/hudson/tools/java/jdk1.6.0_27-32/jre/bin/java -enableassertions -Xmx1400m -Djava.security.egd=file:/dev/./urandom -jar <https://builds.apache.org/job/HBase-0.92-security/ws/trunk/target/surefire/surefirebooter3464985850045795545.jar> <https://builds.apache.org/job/HBase-0.92-security/ws/trunk/target/surefire/surefire399180522380780212tmp> <https://builds.apache.org/job/HBase-0.92-security/ws/trunk/target/surefire/surefire6443452279080421937tmp>
Running org.apache.hadoop.hbase.regionserver.TestWideScanner
Tests run: 1, Failures: 0, Errors: 0, Skipped: 0, Time elapsed: 2.058 sec
Forking command line: /bin/sh -c cd <https://builds.apache.org/job/HBase-0.92-security/ws/trunk> && /home/hudson/tools/java/jdk1.6.0_27-32/jre/bin/java -enableassertions -Xmx1400m -Djava.security.egd=file:/dev/./urandom -jar <https://builds.apache.org/job/HBase-0.92-security/ws/trunk/target/surefire/surefirebooter1316635012630111144.jar> <https://builds.apache.org/job/HBase-0.92-security/ws/trunk/target/surefire/surefire7785942553810670977tmp> <https://builds.apache.org/job/HBase-0.92-security/ws/trunk/target/surefire/surefire4655089394667143904tmp>
Running org.apache.hadoop.hbase.regionserver.TestHRegion
Tests run: 60, Failures: 0, Errors: 0, Skipped: 0, Time elapsed: 43.169 sec
Forking command line: /bin/sh -c cd <https://builds.apache.org/job/HBase-0.92-security/ws/trunk> && /home/hudson/tools/java/jdk1.6.0_27-32/jre/bin/java -enableassertions -Xmx1400m -Djava.security.egd=file:/dev/./urandom -jar <https://builds.apache.org/job/HBase-0.92-security/ws/trunk/target/surefire/surefirebooter2765433160164515341.jar> <https://builds.apache.org/job/HBase-0.92-security/ws/trunk/target/surefire/surefire5078753584606941227tmp> <https://builds.apache.org/job/HBase-0.92-security/ws/trunk/target/surefire/surefire5135631600067425947tmp>
Running org.apache.hadoop.hbase.regionserver.TestMinVersions
Tests run: 6, Failures: 0, Errors: 0, Skipped: 0, Time elapsed: 1.234 sec
Forking command line: /bin/sh -c cd <https://builds.apache.org/job/HBase-0.92-security/ws/trunk> && /home/hudson/tools/java/jdk1.6.0_27-32/jre/bin/java -enableassertions -Xmx1400m -Djava.security.egd=file:/dev/./urandom -jar <https://builds.apache.org/job/HBase-0.92-security/ws/trunk/target/surefire/surefirebooter4276578588907979058.jar> <https://builds.apache.org/job/HBase-0.92-security/ws/trunk/target/surefire/surefire6090031636166749436tmp> <https://builds.apache.org/job/HBase-0.92-security/ws/trunk/target/surefire/surefire2207134361429774649tmp>
Running org.apache.hadoop.hbase.client.TestGet
Tests run: 2, Failures: 0, Errors: 0, Skipped: 0, Time elapsed: 0.14 sec
Forking command line: /bin/sh -c cd <https://builds.apache.org/job/HBase-0.92-security/ws/trunk> && /home/hudson/tools/java/jdk1.6.0_27-32/jre/bin/java -enableassertions -Xmx1400m -Djava.security.egd=file:/dev/./urandom -jar <https://builds.apache.org/job/HBase-0.92-security/ws/trunk/target/surefire/surefirebooter7378550321279813615.jar> <https://builds.apache.org/job/HBase-0.92-security/ws/trunk/target/surefire/surefire277931567973130223tmp> <https://builds.apache.org/job/HBase-0.92-security/ws/trunk/target/surefire/surefire2455333638632410004tmp>
Running org.apache.hadoop.hbase.client.TestAttributes
Tests run: 3, Failures: 0, Errors: 0, Skipped: 0, Time elapsed: 0.141 sec
Forking command line: /bin/sh -c cd <https://builds.apache.org/job/HBase-0.92-security/ws/trunk> && /home/hudson/tools/java/jdk1.6.0_27-32/jre/bin/java -enableassertions -Xmx1400m -Djava.security.egd=file:/dev/./urandom -jar <https://builds.apache.org/job/HBase-0.92-security/ws/trunk/target/surefire/surefirebooter2073794861118045839.jar> <https://builds.apache.org/job/HBase-0.92-security/ws/trunk/target/surefire/surefire5212884802594768337tmp> <https://builds.apache.org/job/HBase-0.92-security/ws/trunk/target/surefire/surefire19896757836537616tmp>
Running org.apache.hadoop.hbase.client.TestResult
Tests run: 3, Failures: 0, Errors: 0, Skipped: 0, Time elapsed: 0.144 sec
Forking command line: /bin/sh -c cd <https://builds.apache.org/job/HBase-0.92-security/ws/trunk> && /home/hudson/tools/java/jdk1.6.0_27-32/jre/bin/java -enableassertions -Xmx1400m -Djava.security.egd=file:/dev/./urandom -jar <https://builds.apache.org/job/HBase-0.92-security/ws/trunk/target/surefire/surefirebooter5201647924591635022.jar> <https://builds.apache.org/job/HBase-0.92-security/ws/trunk/target/surefire/surefire1099019797480096894tmp> <https://builds.apache.org/job/HBase-0.92-security/ws/trunk/target/surefire/surefire1480669036470935479tmp>
Running org.apache.hadoop.hbase.client.replication.TestReplicationAdmin
Tests run: 1, Failures: 0, Errors: 0, Skipped: 0, Time elapsed: 1.047 sec
Forking command line: /bin/sh -c cd <https://builds.apache.org/job/HBase-0.92-security/ws/trunk> && /home/hudson/tools/java/jdk1.6.0_27-32/jre/bin/java -enableassertions -Xmx1400m -Djava.security.egd=file:/dev/./urandom -jar <https://builds.apache.org/job/HBase-0.92-security/ws/trunk/target/surefire/surefirebooter7335495218424151018.jar> <https://builds.apache.org/job/HBase-0.92-security/ws/trunk/target/surefire/surefire1337247370785999379tmp> <https://builds.apache.org/job/HBase-0.92-security/ws/trunk/target/surefire/surefire5232782641410534241tmp>
Running org.apache.hadoop.hbase.client.TestTimestampsFilter
Tests run: 3, Failures: 0, Errors: 0, Skipped: 0, Time elapsed: 37.07 sec
Forking command line: /bin/sh -c cd <https://builds.apache.org/job/HBase-0.92-security/ws/trunk> && /home/hudson/tools/java/jdk1.6.0_27-32/jre/bin/java -enableassertions -Xmx1400m -Djava.security.egd=file:/dev/./urandom -jar <https://builds.apache.org/job/HBase-0.92-security/ws/trunk/target/surefire/surefirebooter1995283749648145000.jar> <https://builds.apache.org/job/HBase-0.92-security/ws/trunk/target/surefire/surefire3582280787323026444tmp> <https://builds.apache.org/job/HBase-0.92-security/ws/trunk/target/surefire/surefire7932054551682987789tmp>
Running org.apache.hadoop.hbase.client.TestMultipleTimestamps
Tests run: 8, Failures: 0, Errors: 0, Skipped: 0, Time elapsed: 74.19 sec
Forking command line: /bin/sh -c cd <https://builds.apache.org/job/HBase-0.92-security/ws/trunk> && /home/hudson/tools/java/jdk1.6.0_27-32/jre/bin/java -enableassertions -Xmx1400m -Djava.security.egd=file:/dev/./urandom -jar <https://builds.apache.org/job/HBase-0.92-security/ws/trunk/target/surefire/surefirebooter6961433614369166746.jar> <https://builds.apache.org/job/HBase-0.92-security/ws/trunk/target/surefire/surefire550364113599367845tmp> <https://builds.apache.org/job/HBase-0.92-security/ws/trunk/target/surefire/surefire6093174138376015678tmp>
Running org.apache.hadoop.hbase.client.TestFromClientSide
Tests run: 46, Failures: 0, Errors: 0, Skipped: 3, Time elapsed: 235.386 sec
Forking command line: /bin/sh -c cd <https://builds.apache.org/job/HBase-0.92-security/ws/trunk> && /home/hudson/tools/java/jdk1.6.0_27-32/jre/bin/java -enableassertions -Xmx1400m -Djava.security.egd=file:/dev/./urandom -jar <https://builds.apache.org/job/HBase-0.92-security/ws/trunk/target/surefire/surefirebooter6225245494123227118.jar> <https://builds.apache.org/job/HBase-0.92-security/ws/trunk/target/surefire/surefire5563872522865283644tmp> <https://builds.apache.org/job/HBase-0.92-security/ws/trunk/target/surefire/surefire1976583926477073300tmp>
Running org.apache.hadoop.hbase.client.TestHCM
Tests run: 5, Failures: 0, Errors: 0, Skipped: 0, Time elapsed: 24.825 sec
Forking command line: /bin/sh -c cd <https://builds.apache.org/job/HBase-0.92-security/ws/trunk> && /home/hudson/tools/java/jdk1.6.0_27-32/jre/bin/java -enableassertions -Xmx1400m -Djava.security.egd=file:/dev/./urandom -jar <https://builds.apache.org/job/HBase-0.92-security/ws/trunk/target/surefire/surefirebooter3002513739247727897.jar> <https://builds.apache.org/job/HBase-0.92-security/ws/trunk/target/surefire/surefire42926476738219958tmp> <https://builds.apache.org/job/HBase-0.92-security/ws/trunk/target/surefire/surefire8037012680719088478tmp>
Running org.apache.hadoop.hbase.client.TestHTablePool
Tests run: 18, Failures: 0, Errors: 0, Skipped: 0, Time elapsed: 32.725 sec
Forking command line: /bin/sh -c cd <https://builds.apache.org/job/HBase-0.92-security/ws/trunk> && /home/hudson/tools/java/jdk1.6.0_27-32/jre/bin/java -enableassertions -Xmx1400m -Djava.security.egd=file:/dev/./urandom -jar <https://builds.apache.org/job/HBase-0.92-security/ws/trunk/target/surefire/surefirebooter8718851197583835302.jar> <https://builds.apache.org/job/HBase-0.92-security/ws/trunk/target/surefire/surefire1276904183650625641tmp> <https://builds.apache.org/job/HBase-0.92-security/ws/trunk/target/surefire/surefire6047371655979798618tmp>
Running org.apache.hadoop.hbase.client.TestHTableUtil
Tests run: 2, Failures: 0, Errors: 0, Skipped: 0, Time elapsed: 25.925 sec
Forking command line: /bin/sh -c cd <https://builds.apache.org/job/HBase-0.92-security/ws/trunk> && /home/hudson/tools/java/jdk1.6.0_27-32/jre/bin/java -enableassertions -Xmx1400m -Djava.security.egd=file:/dev/./urandom -jar <https://builds.apache.org/job/HBase-0.92-security/ws/trunk/target/surefire/surefirebooter14294737723447123.jar> <https://builds.apache.org/job/HBase-0.92-security/ws/trunk/target/surefire/surefire627959083275621391tmp> <https://builds.apache.org/job/HBase-0.92-security/ws/trunk/target/surefire/surefire5534169504738164823tmp>
Running org.apache.hadoop.hbase.client.TestScan
Tests run: 2, Failures: 0, Errors: 0, Skipped: 0, Time elapsed: 0.146 sec
Forking command line: /bin/sh -c cd <https://builds.apache.org/job/HBase-0.92-security/ws/trunk> && /home/hudson/tools/java/jdk1.6.0_27-32/jre/bin/java -enableassertions -Xmx1400m -Djava.security.egd=file:/dev/./urandom -jar <https://builds.apache.org/job/HBase-0.92-security/ws/trunk/target/surefire/surefirebooter4328696859983609949.jar> <https://builds.apache.org/job/HBase-0.92-security/ws/trunk/target/surefire/surefire8324725434736979019tmp> <https://builds.apache.org/job/HBase-0.92-security/ws/trunk/target/surefire/surefire543004632638015953tmp>
Running org.apache.hadoop.hbase.client.TestAdmin
Tests run: 35, Failures: 0, Errors: 0, Skipped: 0, Time elapsed: 581.7 sec
Forking command line: /bin/sh -c cd <https://builds.apache.org/job/HBase-0.92-security/ws/trunk> && /home/hudson/tools/java/jdk1.6.0_27-32/jre/bin/java -enableassertions -Xmx1400m -Djava.security.egd=file:/dev/./urandom -jar <https://builds.apache.org/job/HBase-0.92-security/ws/trunk/target/surefire/surefirebooter8965864529540307489.jar> <https://builds.apache.org/job/HBase-0.92-security/ws/trunk/target/surefire/surefire5455335076367675278tmp> <https://builds.apache.org/job/HBase-0.92-security/ws/trunk/target/surefire/surefire131269919281987263tmp>
Running org.apache.hadoop.hbase.client.TestMetaScanner
Tests run: 1, Failures: 0, Errors: 0, Skipped: 0, Time elapsed: 24.544 sec
Forking command line: /bin/sh -c cd <https://builds.apache.org/job/HBase-0.92-security/ws/trunk> && /home/hudson/tools/java/jdk1.6.0_27-32/jre/bin/java -enableassertions -Xmx1400m -Djava.security.egd=file:/dev/./urandom -jar <https://builds.apache.org/job/HBase-0.92-security/ws/trunk/target/surefire/surefirebooter5483013479965577559.jar> <https://builds.apache.org/job/HBase-0.92-security/ws/trunk/target/surefire/surefire6603401581077982431tmp> <https://builds.apache.org/job/HBase-0.92-security/ws/trunk/target/surefire/surefire730445267115816610tmp>
Running org.apache.hadoop.hbase.client.TestShell
Tests run: 1, Failures: 0, Errors: 0, Skipped: 0, Time elapsed: 131.156 sec
Forking command line: /bin/sh -c cd <https://builds.apache.org/job/HBase-0.92-security/ws/trunk> && /home/hudson/tools/java/jdk1.6.0_27-32/jre/bin/java -enableassertions -Xmx1400m -Djava.security.egd=file:/dev/./urandom -jar <https://builds.apache.org/job/HBase-0.92-security/ws/trunk/target/surefire/surefirebooter171801696393604030.jar> <https://builds.apache.org/job/HBase-0.92-security/ws/trunk/target/surefire/surefire2935643277751458521tmp> <https://builds.apache.org/job/HBase-0.92-security/ws/trunk/target/surefire/surefire768769776700779942tmp>
Running org.apache.hadoop.hbase.client.TestScannerTimeout
Tests run: 4, Failures: 0, Errors: 0, Skipped: 0, Time elapsed: 56.501 sec
Forking command line: /bin/sh -c cd <https://builds.apache.org/job/HBase-0.92-security/ws/trunk> && /home/hudson/tools/java/jdk1.6.0_27-32/jre/bin/java -enableassertions -Xmx1400m -Djava.security.egd=file:/dev/./urandom -jar <https://builds.apache.org/job/HBase-0.92-security/ws/trunk/target/surefire/surefirebooter8011840797265724587.jar> <https://builds.apache.org/job/HBase-0.92-security/ws/trunk/target/surefire/surefire6675217718861000593tmp> <https://builds.apache.org/job/HBase-0.92-security/ws/trunk/target/surefire/surefire405002373355578190tmp>
Running org.apache.hadoop.hbase.client.TestMetaMigrationRemovingHTD
Tests run: 3, Failures: 0, Errors: 0, Skipped: 0, Time elapsed: 33.553 sec
Forking command line: /bin/sh -c cd <https://builds.apache.org/job/HBase-0.92-security/ws/trunk> && /home/hudson/tools/java/jdk1.6.0_27-32/jre/bin/java -enableassertions -Xmx1400m -Djava.security.egd=file:/dev/./urandom -jar <https://builds.apache.org/job/HBase-0.92-security/ws/trunk/target/surefire/surefirebooter8947443003546446610.jar> <https://builds.apache.org/job/HBase-0.92-security/ws/trunk/target/surefire/surefire4657085175870269912tmp> <https://builds.apache.org/job/HBase-0.92-security/ws/trunk/target/surefire/surefire4928620565321458527tmp>
Running org.apache.hadoop.hbase.client.TestOperation
Tests run: 1, Failures: 0, Errors: 0, Skipped: 0, Time elapsed: 0.577 sec
Forking command line: /bin/sh -c cd <https://builds.apache.org/job/HBase-0.92-security/ws/trunk> && /home/hudson/tools/java/jdk1.6.0_27-32/jre/bin/java -enableassertions -Xmx1400m -Djava.security.egd=file:/dev/./urandom -jar <https://builds.apache.org/job/HBase-0.92-security/ws/trunk/target/surefire/surefirebooter3051985741141295671.jar> <https://builds.apache.org/job/HBase-0.92-security/ws/trunk/target/surefire/surefire5774623217704603028tmp> <https://builds.apache.org/job/HBase-0.92-security/ws/trunk/target/surefire/surefire6097626860372700225tmp>
Running org.apache.hadoop.hbase.client.TestMultiParallel
Tests run: 10, Failures: 0, Errors: 0, Skipped: 0, Time elapsed: 52.838 sec
Forking command line: /bin/sh -c cd <https://builds.apache.org/job/HBase-0.92-security/ws/trunk> && /home/hudson/tools/java/jdk1.6.0_27-32/jre/bin/java -enableassertions -Xmx1400m -Djava.security.egd=file:/dev/./urandom -jar <https://builds.apache.org/job/HBase-0.92-security/ws/trunk/target/surefire/surefirebooter7889114633525034436.jar> <https://builds.apache.org/job/HBase-0.92-security/ws/trunk/target/surefire/surefire5501218726516808304tmp> <https://builds.apache.org/job/HBase-0.92-security/ws/trunk/target/surefire/surefire466736524985794959tmp>
Running org.apache.hadoop.hbase.TestMultiVersions
Tests run: 3, Failures: 0, Errors: 0, Skipped: 0, Time elapsed: 38.526 sec
Forking command line: /bin/sh -c cd <https://builds.apache.org/job/HBase-0.92-security/ws/trunk> && /home/hudson/tools/java/jdk1.6.0_27-32/jre/bin/java -enableassertions -Xmx1400m -Djava.security.egd=file:/dev/./urandom -jar <https://builds.apache.org/job/HBase-0.92-security/ws/trunk/target/surefire/surefirebooter7027270011522072534.jar> <https://builds.apache.org/job/HBase-0.92-security/ws/trunk/target/surefire/surefire3308967273423372144tmp> <https://builds.apache.org/job/HBase-0.92-security/ws/trunk/target/surefire/surefire4584348664763145155tmp>
Running org.apache.hadoop.hbase.thrift.TestThriftServer
Tests run: 1, Failures: 0, Errors: 0, Skipped: 0, Time elapsed: 28.473 sec
Forking command line: /bin/sh -c cd <https://builds.apache.org/job/HBase-0.92-security/ws/trunk> && /home/hudson/tools/java/jdk1.6.0_27-32/jre/bin/java -enableassertions -Xmx1400m -Djava.security.egd=file:/dev/./urandom -jar <https://builds.apache.org/job/HBase-0.92-security/ws/trunk/target/surefire/surefirebooter5103263820772270523.jar> <https://builds.apache.org/job/HBase-0.92-security/ws/trunk/target/surefire/surefire7766280263773842496tmp> <https://builds.apache.org/job/HBase-0.92-security/ws/trunk/target/surefire/surefire6424213420366533870tmp>
Running org.apache.hadoop.hbase.master.TestRollingRestart
Tests run: 1, Failures: 0, Errors: 0, Skipped: 0, Time elapsed: 85.03 sec
Forking command line: /bin/sh -c cd <https://builds.apache.org/job/HBase-0.92-security/ws/trunk> && /home/hudson/tools/java/jdk1.6.0_27-32/jre/bin/java -enableassertions -Xmx1400m -Djava.security.egd=file:/dev/./urandom -jar <https://builds.apache.org/job/HBase-0.92-security/ws/trunk/target/surefire/surefirebooter8187513823284175544.jar> <https://builds.apache.org/job/HBase-0.92-security/ws/trunk/target/surefire/surefire7264775916961636210tmp> <https://builds.apache.org/job/HBase-0.92-security/ws/trunk/target/surefire/surefire6933983103488507937tmp>
Running org.apache.hadoop.hbase.master.TestActiveMasterManager
Tests run: 2, Failures: 0, Errors: 0, Skipped: 0, Time elapsed: 1 sec
Forking command line: /bin/sh -c cd <https://builds.apache.org/job/HBase-0.92-security/ws/trunk> && /home/hudson/tools/java/jdk1.6.0_27-32/jre/bin/java -enableassertions -Xmx1400m -Djava.security.egd=file:/dev/./urandom -jar <https://builds.apache.org/job/HBase-0.92-security/ws/trunk/target/surefire/surefirebooter772203206471716593.jar> <https://builds.apache.org/job/HBase-0.92-security/ws/trunk/target/surefire/surefire8126490895619655271tmp> <https://builds.apache.org/job/HBase-0.92-security/ws/trunk/target/surefire/surefire3117456248749396480tmp>
Running org.apache.hadoop.hbase.master.TestDeadServer
Tests run: 1, Failures: 0, Errors: 0, Skipped: 0, Time elapsed: 0.139 sec
Forking command line: /bin/sh -c cd <https://builds.apache.org/job/HBase-0.92-security/ws/trunk> && /home/hudson/tools/java/jdk1.6.0_27-32/jre/bin/java -enableassertions -Xmx1400m -Djava.security.egd=file:/dev/./urandom -jar <https://builds.apache.org/job/HBase-0.92-security/ws/trunk/target/surefire/surefirebooter5537065127319501094.jar> <https://builds.apache.org/job/HBase-0.92-security/ws/trunk/target/surefire/surefire591737588852589108tmp> <https://builds.apache.org/job/HBase-0.92-security/ws/trunk/target/surefire/surefire5868353393305585057tmp>
Running org.apache.hadoop.hbase.master.TestLogsCleaner
Tests run: 1, Failures: 0, Errors: 0, Skipped: 0, Time elapsed: 3.346 sec
Forking command line: /bin/sh -c cd <https://builds.apache.org/job/HBase-0.92-security/ws/trunk> && /home/hudson/tools/java/jdk1.6.0_27-32/jre/bin/java -enableassertions -Xmx1400m -Djava.security.egd=file:/dev/./urandom -jar <https://builds.apache.org/job/HBase-0.92-security/ws/trunk/target/surefire/surefirebooter6600033990768473970.jar> <https://builds.apache.org/job/HBase-0.92-security/ws/trunk/target/surefire/surefire8951221626213084622tmp> <https://builds.apache.org/job/HBase-0.92-security/ws/trunk/target/surefire/surefire6751000805950647038tmp>
Running org.apache.hadoop.hbase.master.TestZKBasedOpenCloseRegion
Tests run: 3, Failures: 0, Errors: 0, Skipped: 0, Time elapsed: 33.497 sec
Forking command line: /bin/sh -c cd <https://builds.apache.org/job/HBase-0.92-security/ws/trunk> && /home/hudson/tools/java/jdk1.6.0_27-32/jre/bin/java -enableassertions -Xmx1400m -Djava.security.egd=file:/dev/./urandom -jar <https://builds.apache.org/job/HBase-0.92-security/ws/trunk/target/surefire/surefirebooter3110230237742088952.jar> <https://builds.apache.org/job/HBase-0.92-security/ws/trunk/target/surefire/surefire1099982633129375281tmp> <https://builds.apache.org/job/HBase-0.92-security/ws/trunk/target/surefire/surefire8318021141840456372tmp>
Running org.apache.hadoop.hbase.master.TestMaster
Tests run: 1, Failures: 0, Errors: 0, Skipped: 0, Time elapsed: 28.536 sec
Forking command line: /bin/sh -c cd <https://builds.apache.org/job/HBase-0.92-security/ws/trunk> && /home/hudson/tools/java/jdk1.6.0_27-32/jre/bin/java -enableassertions -Xmx1400m -Djava.security.egd=file:/dev/./urandom -jar <https://builds.apache.org/job/HBase-0.92-security/ws/trunk/target/surefire/surefirebooter4813911139242366573.jar> <https://builds.apache.org/job/HBase-0.92-security/ws/trunk/target/surefire/surefire4591685445935994853tmp> <https://builds.apache.org/job/HBase-0.92-security/ws/trunk/target/surefire/surefire7919427518509301090tmp>
Running org.apache.hadoop.hbase.master.TestMasterTransitions
Tests run: 3, Failures: 0, Errors: 0, Skipped: 3, Time elapsed: 36.57 sec
Forking command line: /bin/sh -c cd <https://builds.apache.org/job/HBase-0.92-security/ws/trunk> && /home/hudson/tools/java/jdk1.6.0_27-32/jre/bin/java -enableassertions -Xmx1400m -Djava.security.egd=file:/dev/./urandom -jar <https://builds.apache.org/job/HBase-0.92-security/ws/trunk/target/surefire/surefirebooter7679299716913745191.jar> <https://builds.apache.org/job/HBase-0.92-security/ws/trunk/target/surefire/surefire4344880432853060828tmp> <https://builds.apache.org/job/HBase-0.92-security/ws/trunk/target/surefire/surefire6858106843663364126tmp>
Running org.apache.hadoop.hbase.master.TestOpenedRegionHandler
Tests run: 2, Failures: 0, Errors: 0, Skipped: 0, Time elapsed: 35.21 sec
Forking command line: /bin/sh -c cd <https://builds.apache.org/job/HBase-0.92-security/ws/trunk> && /home/hudson/tools/java/jdk1.6.0_27-32/jre/bin/java -enableassertions -Xmx1400m -Djava.security.egd=file:/dev/./urandom -jar <https://builds.apache.org/job/HBase-0.92-security/ws/trunk/target/surefire/surefirebooter5785523945635696761.jar> <https://builds.apache.org/job/HBase-0.92-security/ws/trunk/target/surefire/surefire1473665485372645863tmp> <https://builds.apache.org/job/HBase-0.92-security/ws/trunk/target/surefire/surefire1101859388341929317tmp>
Running org.apache.hadoop.hbase.master.TestClockSkewDetection
Tests run: 1, Failures: 0, Errors: 0, Skipped: 0, Time elapsed: 0.252 sec
Forking command line: /bin/sh -c cd <https://builds.apache.org/job/HBase-0.92-security/ws/trunk> && /home/hudson/tools/java/jdk1.6.0_27-32/jre/bin/java -enableassertions -Xmx1400m -Djava.security.egd=file:/dev/./urandom -jar <https://builds.apache.org/job/HBase-0.92-security/ws/trunk/target/surefire/surefirebooter6374960516183666091.jar> <https://builds.apache.org/job/HBase-0.92-security/ws/trunk/target/surefire/surefire8333696333882570589tmp> <https://builds.apache.org/job/HBase-0.92-security/ws/trunk/target/surefire/surefire4874116710976796616tmp>
Running org.apache.hadoop.hbase.master.TestCatalogJanitor
Tests run: 4, Failures: 0, Errors: 0, Skipped: 0, Time elapsed: 7.353 sec
Forking command line: /bin/sh -c cd <https://builds.apache.org/job/HBase-0.92-security/ws/trunk> && /home/hudson/tools/java/jdk1.6.0_27-32/jre/bin/java -enableassertions -Xmx1400m -Djava.security.egd=file:/dev/./urandom -jar <https://builds.apache.org/job/HBase-0.92-security/ws/trunk/target/surefire/surefirebooter1162670442218968908.jar> <https://builds.apache.org/job/HBase-0.92-security/ws/trunk/target/surefire/surefire8229144258721532557tmp> <https://builds.apache.org/job/HBase-0.92-security/ws/trunk/target/surefire/surefire7112688119853610907tmp>
Running org.apache.hadoop.hbase.master.TestSplitLogManager
Tests run: 12, Failures: 0, Errors: 0, Skipped: 0, Time elapsed: 17.547 sec
Forking command line: /bin/sh -c cd <https://builds.apache.org/job/HBase-0.92-security/ws/trunk> && /home/hudson/tools/java/jdk1.6.0_27-32/jre/bin/java -enableassertions -Xmx1400m -Djava.security.egd=file:/dev/./urandom -jar <https://builds.apache.org/job/HBase-0.92-security/ws/trunk/target/surefire/surefirebooter5574326920642611920.jar> <https://builds.apache.org/job/HBase-0.92-security/ws/trunk/target/surefire/surefire2350223347738605470tmp> <https://builds.apache.org/job/HBase-0.92-security/ws/trunk/target/surefire/surefire4489511603945390203tmp>
Running org.apache.hadoop.hbase.master.TestMasterRestartAfterDisablingTable
Tests run: 1, Failures: 0, Errors: 0, Skipped: 0, Time elapsed: 35.686 sec
Forking command line: /bin/sh -c cd <https://builds.apache.org/job/HBase-0.92-security/ws/trunk> && /home/hudson/tools/java/jdk1.6.0_27-32/jre/bin/java -enableassertions -Xmx1400m -Djava.security.egd=file:/dev/./urandom -jar <https://builds.apache.org/job/HBase-0.92-security/ws/trunk/target/surefire/surefirebooter6307881199284458963.jar> <https://builds.apache.org/job/HBase-0.92-security/ws/trunk/target/surefire/surefire1958155579539048532tmp> <https://builds.apache.org/job/HBase-0.92-security/ws/trunk/target/surefire/surefire8611551049814742347tmp>
Running org.apache.hadoop.hbase.master.TestDistributedLogSplitting
Tests run: 4, Failures: 0, Errors: 0, Skipped: 0, Time elapsed: 201.971 sec
Forking command line: /bin/sh -c cd <https://builds.apache.org/job/HBase-0.92-security/ws/trunk> && /home/hudson/tools/java/jdk1.6.0_27-32/jre/bin/java -enableassertions -Xmx1400m -Djava.security.egd=file:/dev/./urandom -jar <https://builds.apache.org/job/HBase-0.92-security/ws/trunk/target/surefire/surefirebooter2128426461129297532.jar> <https://builds.apache.org/job/HBase-0.92-security/ws/trunk/target/surefire/surefire8568866218758424007tmp> <https://builds.apache.org/job/HBase-0.92-security/ws/trunk/target/surefire/surefire2784784723660337866tmp>
Running org.apache.hadoop.hbase.master.TestDefaultLoadBalancer
Tests run: 4, Failures: 0, Errors: 0, Skipped: 0, Time elapsed: 1.489 sec
Forking command line: /bin/sh -c cd <https://builds.apache.org/job/HBase-0.92-security/ws/trunk> && /home/hudson/tools/java/jdk1.6.0_27-32/jre/bin/java -enableassertions -Xmx1400m -Djava.security.egd=file:/dev/./urandom -jar <https://builds.apache.org/job/HBase-0.92-security/ws/trunk/target/surefire/surefirebooter5145541088791698335.jar> <https://builds.apache.org/job/HBase-0.92-security/ws/trunk/target/surefire/surefire5091962095461142808tmp> <https://builds.apache.org/job/HBase-0.92-security/ws/trunk/target/surefire/surefire8969536681940737434tmp>
Running org.apache.hadoop.hbase.master.TestMasterStatusServlet
Tests run: 5, Failures: 0, Errors: 0, Skipped: 0, Time elapsed: 1.024 sec
Forking command line: /bin/sh -c cd <https://builds.apache.org/job/HBase-0.92-security/ws/trunk> && /home/hudson/tools/java/jdk1.6.0_27-32/jre/bin/java -enableassertions -Xmx1400m -Djava.security.egd=file:/dev/./urandom -jar <https://builds.apache.org/job/HBase-0.92-security/ws/trunk/target/surefire/surefirebooter4660901800099578512.jar> <https://builds.apache.org/job/HBase-0.92-security/ws/trunk/target/surefire/surefire7631123694362015258tmp> <https://builds.apache.org/job/HBase-0.92-security/ws/trunk/target/surefire/surefire8429653915910281658tmp>
Running org.apache.hadoop.hbase.master.TestHMasterRPCException
Tests run: 1, Failures: 0, Errors: 0, Skipped: 0, Time elapsed: 1.504 sec
Forking command line: /bin/sh -c cd <https://builds.apache.org/job/HBase-0.92-security/ws/trunk> && /home/hudson/tools/java/jdk1.6.0_27-32/jre/bin/java -enableassertions -Xmx1400m -Djava.security.egd=file:/dev/./urandom -jar <https://builds.apache.org/job/HBase-0.92-security/ws/trunk/target/surefire/surefirebooter4651606180252459617.jar> <https://builds.apache.org/job/HBase-0.92-security/ws/trunk/target/surefire/surefire446356983965362713tmp> <https://builds.apache.org/job/HBase-0.92-security/ws/trunk/target/surefire/surefire5465858247131154329tmp>
Running org.apache.hadoop.hbase.master.TestMasterFailover
Tests run: 4, Failures: 0, Errors: 0, Skipped: 0, Time elapsed: 103.509 sec
Forking command line: /bin/sh -c cd <https://builds.apache.org/job/HBase-0.92-security/ws/trunk> && /home/hudson/tools/java/jdk1.6.0_27-32/jre/bin/java -enableassertions -Xmx1400m -Djava.security.egd=file:/dev/./urandom -jar <https://builds.apache.org/job/HBase-0.92-security/ws/trunk/target/surefire/surefirebooter8068194667334666385.jar> <https://builds.apache.org/job/HBase-0.92-security/ws/trunk/target/surefire/surefire7308743903946750874tmp> <https://builds.apache.org/job/HBase-0.92-security/ws/trunk/target/surefire/surefire7827791713752927633tmp>
Running org.apache.hadoop.hbase.master.TestMasterZKSessionRecovery
Tests run: 2, Failures: 0, Errors: 0, Skipped: 0, Time elapsed: 36.61 sec
Forking command line: /bin/sh -c cd <https://builds.apache.org/job/HBase-0.92-security/ws/trunk> && /home/hudson/tools/java/jdk1.6.0_27-32/jre/bin/java -enableassertions -Xmx1400m -Djava.security.egd=file:/dev/./urandom -jar <https://builds.apache.org/job/HBase-0.92-security/ws/trunk/target/surefire/surefirebooter859122405274500808.jar> <https://builds.apache.org/job/HBase-0.92-security/ws/trunk/target/surefire/surefire4924374669658964663tmp> <https://builds.apache.org/job/HBase-0.92-security/ws/trunk/target/surefire/surefire5192441853997270914tmp>
Running org.apache.hadoop.hbase.master.TestRestartCluster
Tests run: 2, Failures: 0, Errors: 0, Skipped: 0, Time elapsed: 59.283 sec
Forking command line: /bin/sh -c cd <https://builds.apache.org/job/HBase-0.92-security/ws/trunk> && /home/hudson/tools/java/jdk1.6.0_27-32/jre/bin/java -enableassertions -Xmx1400m -Djava.security.egd=file:/dev/./urandom -jar <https://builds.apache.org/job/HBase-0.92-security/ws/trunk/target/surefire/surefirebooter407520085713630050.jar> <https://builds.apache.org/job/HBase-0.92-security/ws/trunk/target/surefire/surefire8583643476812552461tmp> <https://builds.apache.org/job/HBase-0.92-security/ws/trunk/target/surefire/surefire5442213690208810739tmp>
Running org.apache.hadoop.hbase.migration.TestMigrationFrom090To092
Tests run: 1, Failures: 0, Errors: 0, Skipped: 0, Time elapsed: 0.281 sec
Forking command line: /bin/sh -c cd <https://builds.apache.org/job/HBase-0.92-security/ws/trunk> && /home/hudson/tools/java/jdk1.6.0_27-32/jre/bin/java -enableassertions -Xmx1400m -Djava.security.egd=file:/dev/./urandom -jar <https://builds.apache.org/job/HBase-0.92-security/ws/trunk/target/surefire/surefirebooter4382812607390524199.jar> <https://builds.apache.org/job/HBase-0.92-security/ws/trunk/target/surefire/surefire2645078590464602680tmp> <https://builds.apache.org/job/HBase-0.92-security/ws/trunk/target/surefire/surefire7409117964453599950tmp>
Running org.apache.hadoop.hbase.TestRegionRebalancing
Tests run: 1, Failures: 0, Errors: 0, Skipped: 0, Time elapsed: 57.358 sec
Forking command line: /bin/sh -c cd <https://builds.apache.org/job/HBase-0.92-security/ws/trunk> && /home/hudson/tools/java/jdk1.6.0_27-32/jre/bin/java -enableassertions -Xmx1400m -Djava.security.egd=file:/dev/./urandom -jar <https://builds.apache.org/job/HBase-0.92-security/ws/trunk/target/surefire/surefirebooter4262280494143178825.jar> <https://builds.apache.org/job/HBase-0.92-security/ws/trunk/target/surefire/surefire5772962636829870990tmp> <https://builds.apache.org/job/HBase-0.92-security/ws/trunk/target/surefire/surefire6954039183223619841tmp>
Running org.apache.hadoop.hbase.avro.TestAvroUtil
Tests run: 1, Failures: 0, Errors: 0, Skipped: 0, Time elapsed: 0.7 sec
Forking command line: /bin/sh -c cd <https://builds.apache.org/job/HBase-0.92-security/ws/trunk> && /home/hudson/tools/java/jdk1.6.0_27-32/jre/bin/java -enableassertions -Xmx1400m -Djava.security.egd=file:/dev/./urandom -jar <https://builds.apache.org/job/HBase-0.92-security/ws/trunk/target/surefire/surefirebooter3249837686707313420.jar> <https://builds.apache.org/job/HBase-0.92-security/ws/trunk/target/surefire/surefire801344843495360805tmp> <https://builds.apache.org/job/HBase-0.92-security/ws/trunk/target/surefire/surefire1822482692782082264tmp>
Running org.apache.hadoop.hbase.avro.TestAvroServer
Tests run: 3, Failures: 0, Errors: 0, Skipped: 0, Time elapsed: 39.491 sec
Forking command line: /bin/sh -c cd <https://builds.apache.org/job/HBase-0.92-security/ws/trunk> && /home/hudson/tools/java/jdk1.6.0_27-32/jre/bin/java -enableassertions -Xmx1400m -Djava.security.egd=file:/dev/./urandom -jar <https://builds.apache.org/job/HBase-0.92-security/ws/trunk/target/surefire/surefirebooter5943215049754224641.jar> <https://builds.apache.org/job/HBase-0.92-security/ws/trunk/target/surefire/surefire408934303234849131tmp> <https://builds.apache.org/job/HBase-0.92-security/ws/trunk/target/surefire/surefire4400179688243320816tmp>
Running org.apache.hadoop.hbase.TestAcidGuarantees
Tests run: 3, Failures: 0, Errors: 0, Skipped: 0, Time elapsed: 135.872 sec
Forking command line: /bin/sh -c cd <https://builds.apache.org/job/HBase-0.92-security/ws/trunk> && /home/hudson/tools/java/jdk1.6.0_27-32/jre/bin/java -enableassertions -Xmx1400m -Djava.security.egd=file:/dev/./urandom -jar <https://builds.apache.org/job/HBase-0.92-security/ws/trunk/target/surefire/surefirebooter511751331558398883.jar> <https://builds.apache.org/job/HBase-0.92-security/ws/trunk/target/surefire/surefire4539303990183841182tmp> <https://builds.apache.org/job/HBase-0.92-security/ws/trunk/target/surefire/surefire8391724866577785028tmp>
Running org.apache.hadoop.hbase.TestHRegionLocation
Tests run: 3, Failures: 0, Errors: 0, Skipped: 0, Time elapsed: 0.144 sec
Forking command line: /bin/sh -c cd <https://builds.apache.org/job/HBase-0.92-security/ws/trunk> && /home/hudson/tools/java/jdk1.6.0_27-32/jre/bin/java -enableassertions -Xmx1400m -Djava.security.egd=file:/dev/./urandom -jar <https://builds.apache.org/job/HBase-0.92-security/ws/trunk/target/surefire/surefirebooter5890302262932509552.jar> <https://builds.apache.org/job/HBase-0.92-security/ws/trunk/target/surefire/surefire5133010286902355700tmp> <https://builds.apache.org/job/HBase-0.92-security/ws/trunk/target/surefire/surefire8785221699472569030tmp>
Running org.apache.hadoop.hbase.TestZooKeeper
Tests run: 7, Failures: 0, Errors: 0, Skipped: 0, Time elapsed: 89.62 sec
Forking command line: /bin/sh -c cd <https://builds.apache.org/job/HBase-0.92-security/ws/trunk> && /home/hudson/tools/java/jdk1.6.0_27-32/jre/bin/java -enableassertions -Xmx1400m -Djava.security.egd=file:/dev/./urandom -jar <https://builds.apache.org/job/HBase-0.92-security/ws/trunk/target/surefire/surefirebooter6852574130497449575.jar> <https://builds.apache.org/job/HBase-0.92-security/ws/trunk/target/surefire/surefire6560393842011022777tmp> <https://builds.apache.org/job/HBase-0.92-security/ws/trunk/target/surefire/surefire7583192188749118260tmp>
Running org.apache.hadoop.hbase.TestCompare
Tests run: 1, Failures: 0, Errors: 0, Skipped: 0, Time elapsed: 0.258 sec
Forking command line: /bin/sh -c cd <https://builds.apache.org/job/HBase-0.92-security/ws/trunk> && /home/hudson/tools/java/jdk1.6.0_27-32/jre/bin/java -enableassertions -Xmx1400m -Djava.security.egd=file:/dev/./urandom -jar <https://builds.apache.org/job/HBase-0.92-security/ws/trunk/target/surefire/surefirebooter3931990722831882156.jar> <https://builds.apache.org/job/HBase-0.92-security/ws/trunk/target/surefire/surefire852480439832328375tmp> <https://builds.apache.org/job/HBase-0.92-security/ws/trunk/target/surefire/surefire8767914542958063561tmp>
Running org.apache.hadoop.hbase.ipc.TestDelayedRpc
Tests run: 4, Failures: 0, Errors: 0, Skipped: 0, Time elapsed: 2.36 sec
Forking command line: /bin/sh -c cd <https://builds.apache.org/job/HBase-0.92-security/ws/trunk> && /home/hudson/tools/java/jdk1.6.0_27-32/jre/bin/java -enableassertions -Xmx1400m -Djava.security.egd=file:/dev/./urandom -jar <https://builds.apache.org/job/HBase-0.92-security/ws/trunk/target/surefire/surefirebooter1391766822113552733.jar> <https://builds.apache.org/job/HBase-0.92-security/ws/trunk/target/surefire/surefire3385429544402476578tmp> <https://builds.apache.org/job/HBase-0.92-security/ws/trunk/target/surefire/surefire7010220684747582986tmp>
Running org.apache.hadoop.hbase.TestFSTableDescriptorForceCreation
Tests run: 3, Failures: 0, Errors: 0, Skipped: 0, Time elapsed: 0.668 sec
Forking command line: /bin/sh -c cd <https://builds.apache.org/job/HBase-0.92-security/ws/trunk> && /home/hudson/tools/java/jdk1.6.0_27-32/jre/bin/java -enableassertions -Xmx1400m -Djava.security.egd=file:/dev/./urandom -jar <https://builds.apache.org/job/HBase-0.92-security/ws/trunk/target/surefire/surefirebooter5161958290645347339.jar> <https://builds.apache.org/job/HBase-0.92-security/ws/trunk/target/surefire/surefire1171704562611752827tmp> <https://builds.apache.org/job/HBase-0.92-security/ws/trunk/target/surefire/surefire1228603338137493306tmp>
Running org.apache.hadoop.hbase.TestInfoServers
Tests run: 2, Failures: 0, Errors: 0, Skipped: 0, Time elapsed: 22.77 sec

Results :

Failed tests:   testResetZooKeeperSession(org.apache.hadoop.hbase.replication.TestReplicationPeer): ReplicationPeer ZooKeeper session was not properly expired.

Tests run: 1105, Failures: 1, Errors: 0, Skipped: 8

[INFO] ------------------------------------------------------------------------
[INFO] BUILD FAILURE
[INFO] ------------------------------------------------------------------------
[INFO] Total time: 2:29:03.586s
[INFO] Finished at: Mon Jan 16 23:45:14 UTC 2012
[INFO] Final Memory: 29M/727M
[INFO] ------------------------------------------------------------------------
[ERROR] Failed to execute goal org.apache.maven.plugins:maven-surefire-plugin:2.10:test (default-test) on project hbase: Failure or timeout -> [Help 1]
org.apache.maven.lifecycle.LifecycleExecutionException: Failed to execute goal org.apache.maven.plugins:maven-surefire-plugin:2.10:test (default-test) on project hbase: Failure or timeout
	at org.apache.maven.lifecycle.internal.MojoExecutor.execute(MojoExecutor.java:217)
	at org.apache.maven.lifecycle.internal.MojoExecutor.execute(MojoExecutor.java:153)
	at org.apache.maven.lifecycle.internal.MojoExecutor.execute(MojoExecutor.java:145)
	at org.apache.maven.lifecycle.internal.MojoExecutor.executeForkedExecutions(MojoExecutor.java:365)
	at org.apache.maven.lifecycle.internal.MojoExecutor.execute(MojoExecutor.java:199)
	at org.apache.maven.lifecycle.internal.MojoExecutor.execute(MojoExecutor.java:153)
	at org.apache.maven.lifecycle.internal.MojoExecutor.execute(MojoExecutor.java:145)
	at org.apache.maven.lifecycle.internal.LifecycleModuleBuilder.buildProject(LifecycleModuleBuilder.java:84)
	at org.apache.maven.lifecycle.internal.LifecycleModuleBuilder.buildProject(LifecycleModuleBuilder.java:59)
	at org.apache.maven.lifecycle.internal.LifecycleStarter.singleThreadedBuild(LifecycleStarter.java:183)
	at org.apache.maven.lifecycle.internal.LifecycleStarter.execute(LifecycleStarter.java:161)
	at org.apache.maven.DefaultMaven.doExecute(DefaultMaven.java:319)
	at org.apache.maven.DefaultMaven.execute(DefaultMaven.java:156)
	at org.apache.maven.cli.MavenCli.execute(MavenCli.java:537)
	at org.apache.maven.cli.MavenCli.doMain(MavenCli.java:196)
	at org.apache.maven.cli.MavenCli.main(MavenCli.java:141)
	at sun.reflect.NativeMethodAccessorImpl.invoke0(Native Method)
	at sun.reflect.NativeMethodAccessorImpl.invoke(NativeMethodAccessorImpl.java:39)
	at sun.reflect.DelegatingMethodAccessorImpl.invoke(DelegatingMethodAccessorImpl.java:25)
	at java.lang.reflect.Method.invoke(Method.java:597)
	at org.codehaus.plexus.classworlds.launcher.Launcher.launchEnhanced(Launcher.java:290)
	at org.codehaus.plexus.classworlds.launcher.Launcher.launch(Launcher.java:230)
	at org.codehaus.plexus.classworlds.launcher.Launcher.mainWithExitCode(Launcher.java:409)
	at org.codehaus.plexus.classworlds.launcher.Launcher.main(Launcher.java:352)
Caused by: org.apache.maven.plugin.MojoExecutionException: Failure or timeout
	at org.apache.maven.plugin.surefire.SurefirePlugin.assertNoFailureOrTimeout(SurefirePlugin.java:633)
	at org.apache.maven.plugin.surefire.SurefirePlugin.handleSummary(SurefirePlugin.java:614)
	at org.apache.maven.plugin.surefire.AbstractSurefireMojo.executeAfterPreconditionsChecked(AbstractSurefireMojo.java:137)
	at org.apache.maven.plugin.surefire.AbstractSurefireMojo.execute(AbstractSurefireMojo.java:98)
	at org.apache.maven.plugin.DefaultBuildPluginManager.executeMojo(DefaultBuildPluginManager.java:101)
	at org.apache.maven.lifecycle.internal.MojoExecutor.execute(MojoExecutor.java:209)
	... 23 more
[ERROR] 
[ERROR] 
[ERROR] For more information about the errors and possible solutions, please read the following articles:
[ERROR] [Help 1] http://cwiki.apache.org/confluence/display/MAVEN/MojoExecutionException
Build step 'Invoke top-level Maven targets' marked build as failure
[locks-and-latches] Releasing all the locks
[locks-and-latches] All the locks released
Archiving artifacts
Recording test results


Mime
View raw message