hbase-dev mailing list archives

Site index · List index
Message view « Date » · « Thread »
Top « Date » · « Thread »
From Apache Jenkins Server <jenk...@builds.apache.org>
Subject Build failed in Jenkins: HBase-0.92-security #89
Date Thu, 26 Jan 2012 12:35:28 GMT
See <https://builds.apache.org/job/HBase-0.92-security/89/changes>

Changes:

[stack] HBASE-5278 HBase shell script refers to removed 'migrate' functionality

[tedyu] HBASE-5231 revert - need to add unit test for per table load balancing

------------------------------------------
[...truncated 6726 lines...]
Forking command line: /bin/sh -c cd /x1/jenkins/jenkins-slave/workspace/HBase-0.92-security/trunk
&& /x1/jenkins/tools/java/jdk1.6.0_27-32/jre/bin/java -enableassertions -Xmx1400m
-Djava.security.egd=file:/dev/./urandom -jar /x1/jenkins/jenkins-slave/workspace/HBase-0.92-security/trunk/target/surefire/surefirebooter3946946334494617161.jar
/x1/jenkins/jenkins-slave/workspace/HBase-0.92-security/trunk/target/surefire/surefire255923613209972994tmp
/x1/jenkins/jenkins-slave/workspace/HBase-0.92-security/trunk/target/surefire/surefire1633776764792219611tmp
Running org.apache.hadoop.hbase.rest.TestStatusResource
Tests run: 2, Failures: 0, Errors: 0, Skipped: 0, Time elapsed: 17.111 sec
Forking command line: /bin/sh -c cd /x1/jenkins/jenkins-slave/workspace/HBase-0.92-security/trunk
&& /x1/jenkins/tools/java/jdk1.6.0_27-32/jre/bin/java -enableassertions -Xmx1400m
-Djava.security.egd=file:/dev/./urandom -jar /x1/jenkins/jenkins-slave/workspace/HBase-0.92-security/trunk/target/surefire/surefirebooter366308710420343813.jar
/x1/jenkins/jenkins-slave/workspace/HBase-0.92-security/trunk/target/surefire/surefire5867805089088692043tmp
/x1/jenkins/jenkins-slave/workspace/HBase-0.92-security/trunk/target/surefire/surefire4511974824250276272tmp
Running org.apache.hadoop.hbase.rest.TestScannersWithFilters
Tests run: 10, Failures: 0, Errors: 0, Skipped: 0, Time elapsed: 22.297 sec
Forking command line: /bin/sh -c cd /x1/jenkins/jenkins-slave/workspace/HBase-0.92-security/trunk
&& /x1/jenkins/tools/java/jdk1.6.0_27-32/jre/bin/java -enableassertions -Xmx1400m
-Djava.security.egd=file:/dev/./urandom -jar /x1/jenkins/jenkins-slave/workspace/HBase-0.92-security/trunk/target/surefire/surefirebooter3246161577430178181.jar
/x1/jenkins/jenkins-slave/workspace/HBase-0.92-security/trunk/target/surefire/surefire4582794383753070891tmp
/x1/jenkins/jenkins-slave/workspace/HBase-0.92-security/trunk/target/surefire/surefire1917829632706953575tmp
Running org.apache.hadoop.hbase.metrics.TestMetricsMBeanBase
Tests run: 2, Failures: 0, Errors: 0, Skipped: 0, Time elapsed: 1.101 sec
Forking command line: /bin/sh -c cd /x1/jenkins/jenkins-slave/workspace/HBase-0.92-security/trunk
&& /x1/jenkins/tools/java/jdk1.6.0_27-32/jre/bin/java -enableassertions -Xmx1400m
-Djava.security.egd=file:/dev/./urandom -jar /x1/jenkins/jenkins-slave/workspace/HBase-0.92-security/trunk/target/surefire/surefirebooter5038078789044670088.jar
/x1/jenkins/jenkins-slave/workspace/HBase-0.92-security/trunk/target/surefire/surefire7861731000373815350tmp
/x1/jenkins/jenkins-slave/workspace/HBase-0.92-security/trunk/target/surefire/surefire5725824691795969159tmp
Running org.apache.hadoop.hbase.io.hfile.TestHFileWriterV2
Tests run: 1, Failures: 0, Errors: 0, Skipped: 0, Time elapsed: 0.742 sec
Forking command line: /bin/sh -c cd /x1/jenkins/jenkins-slave/workspace/HBase-0.92-security/trunk
&& /x1/jenkins/tools/java/jdk1.6.0_27-32/jre/bin/java -enableassertions -Xmx1400m
-Djava.security.egd=file:/dev/./urandom -jar /x1/jenkins/jenkins-slave/workspace/HBase-0.92-security/trunk/target/surefire/surefirebooter7111863798310890449.jar
/x1/jenkins/jenkins-slave/workspace/HBase-0.92-security/trunk/target/surefire/surefire946491286378692450tmp
/x1/jenkins/jenkins-slave/workspace/HBase-0.92-security/trunk/target/surefire/surefire5602965003826651194tmp
Running org.apache.hadoop.hbase.io.hfile.TestHFile
Tests run: 6, Failures: 0, Errors: 0, Skipped: 0, Time elapsed: 0.637 sec
Forking command line: /bin/sh -c cd /x1/jenkins/jenkins-slave/workspace/HBase-0.92-security/trunk
&& /x1/jenkins/tools/java/jdk1.6.0_27-32/jre/bin/java -enableassertions -Xmx1400m
-Djava.security.egd=file:/dev/./urandom -jar /x1/jenkins/jenkins-slave/workspace/HBase-0.92-security/trunk/target/surefire/surefirebooter5417956930045091817.jar
/x1/jenkins/jenkins-slave/workspace/HBase-0.92-security/trunk/target/surefire/surefire8125026878156378861tmp
/x1/jenkins/jenkins-slave/workspace/HBase-0.92-security/trunk/target/surefire/surefire7162910467892852438tmp
Running org.apache.hadoop.hbase.io.hfile.TestHFileBlockIndex
Tests run: 10, Failures: 0, Errors: 0, Skipped: 0, Time elapsed: 7.081 sec
Forking command line: /bin/sh -c cd /x1/jenkins/jenkins-slave/workspace/HBase-0.92-security/trunk
&& /x1/jenkins/tools/java/jdk1.6.0_27-32/jre/bin/java -enableassertions -Xmx1400m
-Djava.security.egd=file:/dev/./urandom -jar /x1/jenkins/jenkins-slave/workspace/HBase-0.92-security/trunk/target/surefire/surefirebooter3144733847612612839.jar
/x1/jenkins/jenkins-slave/workspace/HBase-0.92-security/trunk/target/surefire/surefire4648713838437445063tmp
/x1/jenkins/jenkins-slave/workspace/HBase-0.92-security/trunk/target/surefire/surefire6521747932350305109tmp
Running org.apache.hadoop.hbase.io.hfile.TestHFileSeek
Tests run: 1, Failures: 0, Errors: 0, Skipped: 0, Time elapsed: 3.945 sec
Forking command line: /bin/sh -c cd /x1/jenkins/jenkins-slave/workspace/HBase-0.92-security/trunk
&& /x1/jenkins/tools/java/jdk1.6.0_27-32/jre/bin/java -enableassertions -Xmx1400m
-Djava.security.egd=file:/dev/./urandom -jar /x1/jenkins/jenkins-slave/workspace/HBase-0.92-security/trunk/target/surefire/surefirebooter1481384792524580510.jar
/x1/jenkins/jenkins-slave/workspace/HBase-0.92-security/trunk/target/surefire/surefire1960625876838939126tmp
/x1/jenkins/jenkins-slave/workspace/HBase-0.92-security/trunk/target/surefire/surefire1244199213476621988tmp
Running org.apache.hadoop.hbase.io.hfile.TestLruBlockCache
Tests run: 7, Failures: 0, Errors: 0, Skipped: 0, Time elapsed: 0.324 sec
Forking command line: /bin/sh -c cd /x1/jenkins/jenkins-slave/workspace/HBase-0.92-security/trunk
&& /x1/jenkins/tools/java/jdk1.6.0_27-32/jre/bin/java -enableassertions -Xmx1400m
-Djava.security.egd=file:/dev/./urandom -jar /x1/jenkins/jenkins-slave/workspace/HBase-0.92-security/trunk/target/surefire/surefirebooter7901159395939785567.jar
/x1/jenkins/jenkins-slave/workspace/HBase-0.92-security/trunk/target/surefire/surefire1207191622554520603tmp
/x1/jenkins/jenkins-slave/workspace/HBase-0.92-security/trunk/target/surefire/surefire7610219424474578209tmp
Running org.apache.hadoop.hbase.io.hfile.TestFixedFileTrailer
Tests run: 2, Failures: 0, Errors: 0, Skipped: 0, Time elapsed: 0.436 sec
Forking command line: /bin/sh -c cd /x1/jenkins/jenkins-slave/workspace/HBase-0.92-security/trunk
&& /x1/jenkins/tools/java/jdk1.6.0_27-32/jre/bin/java -enableassertions -Xmx1400m
-Djava.security.egd=file:/dev/./urandom -jar /x1/jenkins/jenkins-slave/workspace/HBase-0.92-security/trunk/target/surefire/surefirebooter1337754867994426179.jar
/x1/jenkins/jenkins-slave/workspace/HBase-0.92-security/trunk/target/surefire/surefire456363769040636396tmp
/x1/jenkins/jenkins-slave/workspace/HBase-0.92-security/trunk/target/surefire/surefire6944960664004356741tmp
Running org.apache.hadoop.hbase.io.hfile.TestCachedBlockQueue
Tests run: 2, Failures: 0, Errors: 0, Skipped: 0, Time elapsed: 0.088 sec
Forking command line: /bin/sh -c cd /x1/jenkins/jenkins-slave/workspace/HBase-0.92-security/trunk
&& /x1/jenkins/tools/java/jdk1.6.0_27-32/jre/bin/java -enableassertions -Xmx1400m
-Djava.security.egd=file:/dev/./urandom -jar /x1/jenkins/jenkins-slave/workspace/HBase-0.92-security/trunk/target/surefire/surefirebooter2329777016789666642.jar
/x1/jenkins/jenkins-slave/workspace/HBase-0.92-security/trunk/target/surefire/surefire4657375350194251263tmp
/x1/jenkins/jenkins-slave/workspace/HBase-0.92-security/trunk/target/surefire/surefire354763347429124388tmp
Running org.apache.hadoop.hbase.io.hfile.TestHFilePerformance
Tests run: 1, Failures: 0, Errors: 0, Skipped: 0, Time elapsed: 3.986 sec
Forking command line: /bin/sh -c cd /x1/jenkins/jenkins-slave/workspace/HBase-0.92-security/trunk
&& /x1/jenkins/tools/java/jdk1.6.0_27-32/jre/bin/java -enableassertions -Xmx1400m
-Djava.security.egd=file:/dev/./urandom -jar /x1/jenkins/jenkins-slave/workspace/HBase-0.92-security/trunk/target/surefire/surefirebooter4440725208213933686.jar
/x1/jenkins/jenkins-slave/workspace/HBase-0.92-security/trunk/target/surefire/surefire5392797693609598391tmp
/x1/jenkins/jenkins-slave/workspace/HBase-0.92-security/trunk/target/surefire/surefire1743473929953680778tmp
Running org.apache.hadoop.hbase.io.hfile.TestCacheOnWrite
Tests run: 6, Failures: 0, Errors: 0, Skipped: 0, Time elapsed: 5.467 sec
Forking command line: /bin/sh -c cd /x1/jenkins/jenkins-slave/workspace/HBase-0.92-security/trunk
&& /x1/jenkins/tools/java/jdk1.6.0_27-32/jre/bin/java -enableassertions -Xmx1400m
-Djava.security.egd=file:/dev/./urandom -jar /x1/jenkins/jenkins-slave/workspace/HBase-0.92-security/trunk/target/surefire/surefirebooter1633077750719864236.jar
/x1/jenkins/jenkins-slave/workspace/HBase-0.92-security/trunk/target/surefire/surefire2078282581816830882tmp
/x1/jenkins/jenkins-slave/workspace/HBase-0.92-security/trunk/target/surefire/surefire3816619140270972510tmp
Running org.apache.hadoop.hbase.io.hfile.TestReseekTo
Tests run: 1, Failures: 0, Errors: 0, Skipped: 0, Time elapsed: 0.512 sec
Forking command line: /bin/sh -c cd /x1/jenkins/jenkins-slave/workspace/HBase-0.92-security/trunk
&& /x1/jenkins/tools/java/jdk1.6.0_27-32/jre/bin/java -enableassertions -Xmx1400m
-Djava.security.egd=file:/dev/./urandom -jar /x1/jenkins/jenkins-slave/workspace/HBase-0.92-security/trunk/target/surefire/surefirebooter2447492416146700922.jar
/x1/jenkins/jenkins-slave/workspace/HBase-0.92-security/trunk/target/surefire/surefire1775085647135702254tmp
/x1/jenkins/jenkins-slave/workspace/HBase-0.92-security/trunk/target/surefire/surefire1048670772144652799tmp
Running org.apache.hadoop.hbase.io.hfile.TestSeekTo
Tests run: 3, Failures: 0, Errors: 0, Skipped: 0, Time elapsed: 0.508 sec
Forking command line: /bin/sh -c cd /x1/jenkins/jenkins-slave/workspace/HBase-0.92-security/trunk
&& /x1/jenkins/tools/java/jdk1.6.0_27-32/jre/bin/java -enableassertions -Xmx1400m
-Djava.security.egd=file:/dev/./urandom -jar /x1/jenkins/jenkins-slave/workspace/HBase-0.92-security/trunk/target/surefire/surefirebooter8507907296133383025.jar
/x1/jenkins/jenkins-slave/workspace/HBase-0.92-security/trunk/target/surefire/surefire1749470793892820517tmp
/x1/jenkins/jenkins-slave/workspace/HBase-0.92-security/trunk/target/surefire/surefire4917326754449592019tmp
Running org.apache.hadoop.hbase.io.hfile.TestBlockCacheColumnFamilySummary
Tests run: 4, Failures: 0, Errors: 0, Skipped: 0, Time elapsed: 0.044 sec
Forking command line: /bin/sh -c cd /x1/jenkins/jenkins-slave/workspace/HBase-0.92-security/trunk
&& /x1/jenkins/tools/java/jdk1.6.0_27-32/jre/bin/java -enableassertions -Xmx1400m
-Djava.security.egd=file:/dev/./urandom -jar /x1/jenkins/jenkins-slave/workspace/HBase-0.92-security/trunk/target/surefire/surefirebooter5055323722640242926.jar
/x1/jenkins/jenkins-slave/workspace/HBase-0.92-security/trunk/target/surefire/surefire2740793748678903494tmp
/x1/jenkins/jenkins-slave/workspace/HBase-0.92-security/trunk/target/surefire/surefire712160628313540288tmp
Running org.apache.hadoop.hbase.io.hfile.TestHFileBlock
Tests run: 7, Failures: 0, Errors: 0, Skipped: 0, Time elapsed: 23.799 sec
Forking command line: /bin/sh -c cd /x1/jenkins/jenkins-slave/workspace/HBase-0.92-security/trunk
&& /x1/jenkins/tools/java/jdk1.6.0_27-32/jre/bin/java -enableassertions -Xmx1400m
-Djava.security.egd=file:/dev/./urandom -jar /x1/jenkins/jenkins-slave/workspace/HBase-0.92-security/trunk/target/surefire/surefirebooter1788331560049294200.jar
/x1/jenkins/jenkins-slave/workspace/HBase-0.92-security/trunk/target/surefire/surefire1035039246970681963tmp
/x1/jenkins/jenkins-slave/workspace/HBase-0.92-security/trunk/target/surefire/surefire4800483363372422409tmp
Running org.apache.hadoop.hbase.io.hfile.slab.TestSlabCache
Tests run: 7, Failures: 0, Errors: 0, Skipped: 0, Time elapsed: 15.285 sec
Forking command line: /bin/sh -c cd /x1/jenkins/jenkins-slave/workspace/HBase-0.92-security/trunk
&& /x1/jenkins/tools/java/jdk1.6.0_27-32/jre/bin/java -enableassertions -Xmx1400m
-Djava.security.egd=file:/dev/./urandom -jar /x1/jenkins/jenkins-slave/workspace/HBase-0.92-security/trunk/target/surefire/surefirebooter567496126879763680.jar
/x1/jenkins/jenkins-slave/workspace/HBase-0.92-security/trunk/target/surefire/surefire3915609674996498406tmp
/x1/jenkins/jenkins-slave/workspace/HBase-0.92-security/trunk/target/surefire/surefire439867004585179302tmp
Running org.apache.hadoop.hbase.io.hfile.slab.TestSingleSizeCache
Tests run: 5, Failures: 0, Errors: 0, Skipped: 0, Time elapsed: 19.966 sec
Forking command line: /bin/sh -c cd /x1/jenkins/jenkins-slave/workspace/HBase-0.92-security/trunk
&& /x1/jenkins/tools/java/jdk1.6.0_27-32/jre/bin/java -enableassertions -Xmx1400m
-Djava.security.egd=file:/dev/./urandom -jar /x1/jenkins/jenkins-slave/workspace/HBase-0.92-security/trunk/target/surefire/surefirebooter6915063376521432421.jar
/x1/jenkins/jenkins-slave/workspace/HBase-0.92-security/trunk/target/surefire/surefire7703845125532971784tmp
/x1/jenkins/jenkins-slave/workspace/HBase-0.92-security/trunk/target/surefire/surefire3235131784220250912tmp
Running org.apache.hadoop.hbase.io.hfile.slab.TestSlab
Tests run: 1, Failures: 0, Errors: 0, Skipped: 0, Time elapsed: 0.113 sec
Forking command line: /bin/sh -c cd /x1/jenkins/jenkins-slave/workspace/HBase-0.92-security/trunk
&& /x1/jenkins/tools/java/jdk1.6.0_27-32/jre/bin/java -enableassertions -Xmx1400m
-Djava.security.egd=file:/dev/./urandom -jar /x1/jenkins/jenkins-slave/workspace/HBase-0.92-security/trunk/target/surefire/surefirebooter6335441545793373142.jar
/x1/jenkins/jenkins-slave/workspace/HBase-0.92-security/trunk/target/surefire/surefire7233278372792952080tmp
/x1/jenkins/jenkins-slave/workspace/HBase-0.92-security/trunk/target/surefire/surefire115577878595726074tmp
Running org.apache.hadoop.hbase.io.hfile.TestHFileReaderV1
Tests run: 1, Failures: 0, Errors: 0, Skipped: 0, Time elapsed: 0.534 sec
Forking command line: /bin/sh -c cd /x1/jenkins/jenkins-slave/workspace/HBase-0.92-security/trunk
&& /x1/jenkins/tools/java/jdk1.6.0_27-32/jre/bin/java -enableassertions -Xmx1400m
-Djava.security.egd=file:/dev/./urandom -jar /x1/jenkins/jenkins-slave/workspace/HBase-0.92-security/trunk/target/surefire/surefirebooter1173082195188906066.jar
/x1/jenkins/jenkins-slave/workspace/HBase-0.92-security/trunk/target/surefire/surefire3261289630901631818tmp
/x1/jenkins/jenkins-slave/workspace/HBase-0.92-security/trunk/target/surefire/surefire4469785209056768847tmp
Running org.apache.hadoop.hbase.io.TestHalfStoreFileReader
Tests run: 1, Failures: 0, Errors: 0, Skipped: 0, Time elapsed: 0.533 sec
Forking command line: /bin/sh -c cd /x1/jenkins/jenkins-slave/workspace/HBase-0.92-security/trunk
&& /x1/jenkins/tools/java/jdk1.6.0_27-32/jre/bin/java -enableassertions -Xmx1400m
-Djava.security.egd=file:/dev/./urandom -jar /x1/jenkins/jenkins-slave/workspace/HBase-0.92-security/trunk/target/surefire/surefirebooter6667026097896532596.jar
/x1/jenkins/jenkins-slave/workspace/HBase-0.92-security/trunk/target/surefire/surefire188254060004961878tmp
/x1/jenkins/jenkins-slave/workspace/HBase-0.92-security/trunk/target/surefire/surefire1258996367318130970tmp
Running org.apache.hadoop.hbase.io.TestHbaseObjectWritable
Tests run: 4, Failures: 0, Errors: 0, Skipped: 0, Time elapsed: 0.352 sec
Forking command line: /bin/sh -c cd /x1/jenkins/jenkins-slave/workspace/HBase-0.92-security/trunk
&& /x1/jenkins/tools/java/jdk1.6.0_27-32/jre/bin/java -enableassertions -Xmx1400m
-Djava.security.egd=file:/dev/./urandom -jar /x1/jenkins/jenkins-slave/workspace/HBase-0.92-security/trunk/target/surefire/surefirebooter1293398411289312555.jar
/x1/jenkins/jenkins-slave/workspace/HBase-0.92-security/trunk/target/surefire/surefire4426068623627621718tmp
/x1/jenkins/jenkins-slave/workspace/HBase-0.92-security/trunk/target/surefire/surefire8434102172450129663tmp
Running org.apache.hadoop.hbase.io.TestImmutableBytesWritable
Tests run: 3, Failures: 0, Errors: 0, Skipped: 0, Time elapsed: 0.083 sec
Forking command line: /bin/sh -c cd /x1/jenkins/jenkins-slave/workspace/HBase-0.92-security/trunk
&& /x1/jenkins/tools/java/jdk1.6.0_27-32/jre/bin/java -enableassertions -Xmx1400m
-Djava.security.egd=file:/dev/./urandom -jar /x1/jenkins/jenkins-slave/workspace/HBase-0.92-security/trunk/target/surefire/surefirebooter7923931910071053075.jar
/x1/jenkins/jenkins-slave/workspace/HBase-0.92-security/trunk/target/surefire/surefire983359600322220496tmp
/x1/jenkins/jenkins-slave/workspace/HBase-0.92-security/trunk/target/surefire/surefire3583221907245801957tmp
Running org.apache.hadoop.hbase.io.TestHeapSize
Tests run: 2, Failures: 0, Errors: 0, Skipped: 0, Time elapsed: 0.131 sec
Forking command line: /bin/sh -c cd /x1/jenkins/jenkins-slave/workspace/HBase-0.92-security/trunk
&& /x1/jenkins/tools/java/jdk1.6.0_27-32/jre/bin/java -enableassertions -Xmx1400m
-Djava.security.egd=file:/dev/./urandom -jar /x1/jenkins/jenkins-slave/workspace/HBase-0.92-security/trunk/target/surefire/surefirebooter1710197748196370895.jar
/x1/jenkins/jenkins-slave/workspace/HBase-0.92-security/trunk/target/surefire/surefire2139123610290549396tmp
/x1/jenkins/jenkins-slave/workspace/HBase-0.92-security/trunk/target/surefire/surefire2256514978399463150tmp
Running org.apache.hadoop.hbase.TestRegionRebalancing
Tests run: 1, Failures: 0, Errors: 0, Skipped: 0, Time elapsed: 47.822 sec
Forking command line: /bin/sh -c cd /x1/jenkins/jenkins-slave/workspace/HBase-0.92-security/trunk
&& /x1/jenkins/tools/java/jdk1.6.0_27-32/jre/bin/java -enableassertions -Xmx1400m
-Djava.security.egd=file:/dev/./urandom -jar /x1/jenkins/jenkins-slave/workspace/HBase-0.92-security/trunk/target/surefire/surefirebooter502374218358568302.jar
/x1/jenkins/jenkins-slave/workspace/HBase-0.92-security/trunk/target/surefire/surefire6987630913192321673tmp
/x1/jenkins/jenkins-slave/workspace/HBase-0.92-security/trunk/target/surefire/surefire7068614287029360225tmp
Running org.apache.hadoop.hbase.mapred.TestTableInputFormat
Tests run: 6, Failures: 0, Errors: 0, Skipped: 0, Time elapsed: 26.681 sec
Forking command line: /bin/sh -c cd /x1/jenkins/jenkins-slave/workspace/HBase-0.92-security/trunk
&& /x1/jenkins/tools/java/jdk1.6.0_27-32/jre/bin/java -enableassertions -Xmx1400m
-Djava.security.egd=file:/dev/./urandom -jar /x1/jenkins/jenkins-slave/workspace/HBase-0.92-security/trunk/target/surefire/surefirebooter2203558885102255865.jar
/x1/jenkins/jenkins-slave/workspace/HBase-0.92-security/trunk/target/surefire/surefire6879987441986288827tmp
/x1/jenkins/jenkins-slave/workspace/HBase-0.92-security/trunk/target/surefire/surefire530906042248884371tmp
Running org.apache.hadoop.hbase.mapred.TestTableMapReduce
Tests run: 1, Failures: 0, Errors: 0, Skipped: 0, Time elapsed: 67.931 sec
Forking command line: /bin/sh -c cd /x1/jenkins/jenkins-slave/workspace/HBase-0.92-security/trunk
&& /x1/jenkins/tools/java/jdk1.6.0_27-32/jre/bin/java -enableassertions -Xmx1400m
-Djava.security.egd=file:/dev/./urandom -jar /x1/jenkins/jenkins-slave/workspace/HBase-0.92-security/trunk/target/surefire/surefirebooter6211807549393641481.jar
/x1/jenkins/jenkins-slave/workspace/HBase-0.92-security/trunk/target/surefire/surefire7050341569909448325tmp
/x1/jenkins/jenkins-slave/workspace/HBase-0.92-security/trunk/target/surefire/surefire8106572279662788556tmp
Running org.apache.hadoop.hbase.replication.regionserver.TestReplicationSink
Tests run: 5, Failures: 0, Errors: 0, Skipped: 0, Time elapsed: 22.944 sec
Forking command line: /bin/sh -c cd /x1/jenkins/jenkins-slave/workspace/HBase-0.92-security/trunk
&& /x1/jenkins/tools/java/jdk1.6.0_27-32/jre/bin/java -enableassertions -Xmx1400m
-Djava.security.egd=file:/dev/./urandom -jar /x1/jenkins/jenkins-slave/workspace/HBase-0.92-security/trunk/target/surefire/surefirebooter8497225748817085341.jar
/x1/jenkins/jenkins-slave/workspace/HBase-0.92-security/trunk/target/surefire/surefire7668151566632303943tmp
/x1/jenkins/jenkins-slave/workspace/HBase-0.92-security/trunk/target/surefire/surefire7190256930513026994tmp
Running org.apache.hadoop.hbase.replication.regionserver.TestReplicationSourceManager
Tests run: 1, Failures: 0, Errors: 0, Skipped: 0, Time elapsed: 0.793 sec
Forking command line: /bin/sh -c cd /x1/jenkins/jenkins-slave/workspace/HBase-0.92-security/trunk
&& /x1/jenkins/tools/java/jdk1.6.0_27-32/jre/bin/java -enableassertions -Xmx1400m
-Djava.security.egd=file:/dev/./urandom -jar /x1/jenkins/jenkins-slave/workspace/HBase-0.92-security/trunk/target/surefire/surefirebooter4084281454861716588.jar
/x1/jenkins/jenkins-slave/workspace/HBase-0.92-security/trunk/target/surefire/surefire778203184616827891tmp
/x1/jenkins/jenkins-slave/workspace/HBase-0.92-security/trunk/target/surefire/surefire6449171957915313438tmp
Running org.apache.hadoop.hbase.replication.TestReplicationSource
Tests run: 1, Failures: 0, Errors: 0, Skipped: 0, Time elapsed: 1.778 sec
Forking command line: /bin/sh -c cd /x1/jenkins/jenkins-slave/workspace/HBase-0.92-security/trunk
&& /x1/jenkins/tools/java/jdk1.6.0_27-32/jre/bin/java -enableassertions -Xmx1400m
-Djava.security.egd=file:/dev/./urandom -jar /x1/jenkins/jenkins-slave/workspace/HBase-0.92-security/trunk/target/surefire/surefirebooter6129287757664012165.jar
/x1/jenkins/jenkins-slave/workspace/HBase-0.92-security/trunk/target/surefire/surefire2803744636303135471tmp
/x1/jenkins/jenkins-slave/workspace/HBase-0.92-security/trunk/target/surefire/surefire2366254215729990133tmp
Running org.apache.hadoop.hbase.replication.TestReplication
Tests run: 8, Failures: 0, Errors: 0, Skipped: 0, Time elapsed: 122.52 sec
Forking command line: /bin/sh -c cd /x1/jenkins/jenkins-slave/workspace/HBase-0.92-security/trunk
&& /x1/jenkins/tools/java/jdk1.6.0_27-32/jre/bin/java -enableassertions -Xmx1400m
-Djava.security.egd=file:/dev/./urandom -jar /x1/jenkins/jenkins-slave/workspace/HBase-0.92-security/trunk/target/surefire/surefirebooter3489492701390823212.jar
/x1/jenkins/jenkins-slave/workspace/HBase-0.92-security/trunk/target/surefire/surefire8030954443378675881tmp
/x1/jenkins/jenkins-slave/workspace/HBase-0.92-security/trunk/target/surefire/surefire6944432648603752553tmp
Running org.apache.hadoop.hbase.replication.TestReplicationPeer
Tests run: 1, Failures: 0, Errors: 0, Skipped: 0, Time elapsed: 25.427 sec
Forking command line: /bin/sh -c cd /x1/jenkins/jenkins-slave/workspace/HBase-0.92-security/trunk
&& /x1/jenkins/tools/java/jdk1.6.0_27-32/jre/bin/java -enableassertions -Xmx1400m
-Djava.security.egd=file:/dev/./urandom -jar /x1/jenkins/jenkins-slave/workspace/HBase-0.92-security/trunk/target/surefire/surefirebooter2164750886196968123.jar
/x1/jenkins/jenkins-slave/workspace/HBase-0.92-security/trunk/target/surefire/surefire256957071035539897tmp
/x1/jenkins/jenkins-slave/workspace/HBase-0.92-security/trunk/target/surefire/surefire3505058607742105469tmp
Running org.apache.hadoop.hbase.replication.TestMultiSlaveReplication
Tests run: 1, Failures: 0, Errors: 0, Skipped: 0, Time elapsed: 58.283 sec
Forking command line: /bin/sh -c cd /x1/jenkins/jenkins-slave/workspace/HBase-0.92-security/trunk
&& /x1/jenkins/tools/java/jdk1.6.0_27-32/jre/bin/java -enableassertions -Xmx1400m
-Djava.security.egd=file:/dev/./urandom -jar /x1/jenkins/jenkins-slave/workspace/HBase-0.92-security/trunk/target/surefire/surefirebooter5821264082481858383.jar
/x1/jenkins/jenkins-slave/workspace/HBase-0.92-security/trunk/target/surefire/surefire2013353479169545792tmp
/x1/jenkins/jenkins-slave/workspace/HBase-0.92-security/trunk/target/surefire/surefire2778381831553663103tmp
Running org.apache.hadoop.hbase.replication.TestMasterReplication
Tests run: 2, Failures: 0, Errors: 0, Skipped: 0, Time elapsed: 88.152 sec
Forking command line: /bin/sh -c cd /x1/jenkins/jenkins-slave/workspace/HBase-0.92-security/trunk
&& /x1/jenkins/tools/java/jdk1.6.0_27-32/jre/bin/java -enableassertions -Xmx1400m
-Djava.security.egd=file:/dev/./urandom -jar /x1/jenkins/jenkins-slave/workspace/HBase-0.92-security/trunk/target/surefire/surefirebooter6694521400655507901.jar
/x1/jenkins/jenkins-slave/workspace/HBase-0.92-security/trunk/target/surefire/surefire4755636031859950711tmp
/x1/jenkins/jenkins-slave/workspace/HBase-0.92-security/trunk/target/surefire/surefire1913065427534294082tmp
Running org.apache.hadoop.hbase.util.TestHBaseFsckComparator
Tests run: 7, Failures: 0, Errors: 0, Skipped: 0, Time elapsed: 0.129 sec
Forking command line: /bin/sh -c cd /x1/jenkins/jenkins-slave/workspace/HBase-0.92-security/trunk
&& /x1/jenkins/tools/java/jdk1.6.0_27-32/jre/bin/java -enableassertions -Xmx1400m
-Djava.security.egd=file:/dev/./urandom -jar /x1/jenkins/jenkins-slave/workspace/HBase-0.92-security/trunk/target/surefire/surefirebooter4927115794040903160.jar
/x1/jenkins/jenkins-slave/workspace/HBase-0.92-security/trunk/target/surefire/surefire7621030515610805529tmp
/x1/jenkins/jenkins-slave/workspace/HBase-0.92-security/trunk/target/surefire/surefire6909823379114012015tmp
Running org.apache.hadoop.hbase.util.TestMergeTool
Tests run: 1, Failures: 0, Errors: 0, Skipped: 0, Time elapsed: 337.004 sec
Forking command line: /bin/sh -c cd /x1/jenkins/jenkins-slave/workspace/HBase-0.92-security/trunk
&& /x1/jenkins/tools/java/jdk1.6.0_27-32/jre/bin/java -enableassertions -Xmx1400m
-Djava.security.egd=file:/dev/./urandom -jar /x1/jenkins/jenkins-slave/workspace/HBase-0.92-security/trunk/target/surefire/surefirebooter8599726525015784862.jar
/x1/jenkins/jenkins-slave/workspace/HBase-0.92-security/trunk/target/surefire/surefire1526595846259866827tmp
/x1/jenkins/jenkins-slave/workspace/HBase-0.92-security/trunk/target/surefire/surefire339603302971644725tmp
Running org.apache.hadoop.hbase.util.TestFSTableDescriptors
Tests run: 10, Failures: 0, Errors: 0, Skipped: 0, Time elapsed: 0.788 sec
Forking command line: /bin/sh -c cd /x1/jenkins/jenkins-slave/workspace/HBase-0.92-security/trunk
&& /x1/jenkins/tools/java/jdk1.6.0_27-32/jre/bin/java -enableassertions -Xmx1400m
-Djava.security.egd=file:/dev/./urandom -jar /x1/jenkins/jenkins-slave/workspace/HBase-0.92-security/trunk/target/surefire/surefirebooter4976176022117253459.jar
/x1/jenkins/jenkins-slave/workspace/HBase-0.92-security/trunk/target/surefire/surefire2956890474870818119tmp
/x1/jenkins/jenkins-slave/workspace/HBase-0.92-security/trunk/target/surefire/surefire5969618899664662376tmp
Running org.apache.hadoop.hbase.util.TestIdLock
Tests run: 1, Failures: 0, Errors: 0, Skipped: 0, Time elapsed: 15.245 sec
Forking command line: /bin/sh -c cd /x1/jenkins/jenkins-slave/workspace/HBase-0.92-security/trunk
&& /x1/jenkins/tools/java/jdk1.6.0_27-32/jre/bin/java -enableassertions -Xmx1400m
-Djava.security.egd=file:/dev/./urandom -jar /x1/jenkins/jenkins-slave/workspace/HBase-0.92-security/trunk/target/surefire/surefirebooter400877032374246109.jar
/x1/jenkins/jenkins-slave/workspace/HBase-0.92-security/trunk/target/surefire/surefire8913797702770929001tmp
/x1/jenkins/jenkins-slave/workspace/HBase-0.92-security/trunk/target/surefire/surefire8985370057175828126tmp
Running org.apache.hadoop.hbase.util.TestCompressionTest
Tests run: 1, Failures: 0, Errors: 0, Skipped: 0, Time elapsed: 0.293 sec
Forking command line: /bin/sh -c cd /x1/jenkins/jenkins-slave/workspace/HBase-0.92-security/trunk
&& /x1/jenkins/tools/java/jdk1.6.0_27-32/jre/bin/java -enableassertions -Xmx1400m
-Djava.security.egd=file:/dev/./urandom -jar /x1/jenkins/jenkins-slave/workspace/HBase-0.92-security/trunk/target/surefire/surefirebooter6445794060678716423.jar
/x1/jenkins/jenkins-slave/workspace/HBase-0.92-security/trunk/target/surefire/surefire8176832524365359492tmp
/x1/jenkins/jenkins-slave/workspace/HBase-0.92-security/trunk/target/surefire/surefire627026470270353126tmp
Running org.apache.hadoop.hbase.util.TestBytes
Tests run: 13, Failures: 0, Errors: 0, Skipped: 0, Time elapsed: 0.091 sec
Forking command line: /bin/sh -c cd /x1/jenkins/jenkins-slave/workspace/HBase-0.92-security/trunk
&& /x1/jenkins/tools/java/jdk1.6.0_27-32/jre/bin/java -enableassertions -Xmx1400m
-Djava.security.egd=file:/dev/./urandom -jar /x1/jenkins/jenkins-slave/workspace/HBase-0.92-security/trunk/target/surefire/surefirebooter7380355450166753745.jar
/x1/jenkins/jenkins-slave/workspace/HBase-0.92-security/trunk/target/surefire/surefire7397898829214548855tmp
/x1/jenkins/jenkins-slave/workspace/HBase-0.92-security/trunk/target/surefire/surefire1658931406376222833tmp
Running org.apache.hadoop.hbase.util.TestSortedCopyOnWriteSet
Tests run: 2, Failures: 0, Errors: 0, Skipped: 0, Time elapsed: 0.05 sec
Forking command line: /bin/sh -c cd /x1/jenkins/jenkins-slave/workspace/HBase-0.92-security/trunk
&& /x1/jenkins/tools/java/jdk1.6.0_27-32/jre/bin/java -enableassertions -Xmx1400m
-Djava.security.egd=file:/dev/./urandom -jar /x1/jenkins/jenkins-slave/workspace/HBase-0.92-security/trunk/target/surefire/surefirebooter1628132812357776125.jar
/x1/jenkins/jenkins-slave/workspace/HBase-0.92-security/trunk/target/surefire/surefire610396721840600108tmp
/x1/jenkins/jenkins-slave/workspace/HBase-0.92-security/trunk/target/surefire/surefire8782900234754976797tmp
Running org.apache.hadoop.hbase.util.TestEnvironmentEdgeManager
Tests run: 2, Failures: 0, Errors: 0, Skipped: 0, Time elapsed: 0.172 sec
Forking command line: /bin/sh -c cd /x1/jenkins/jenkins-slave/workspace/HBase-0.92-security/trunk
&& /x1/jenkins/tools/java/jdk1.6.0_27-32/jre/bin/java -enableassertions -Xmx1400m
-Djava.security.egd=file:/dev/./urandom -jar /x1/jenkins/jenkins-slave/workspace/HBase-0.92-security/trunk/target/surefire/surefirebooter6196831760796915135.jar
/x1/jenkins/jenkins-slave/workspace/HBase-0.92-security/trunk/target/surefire/surefire750128205244243347tmp
/x1/jenkins/jenkins-slave/workspace/HBase-0.92-security/trunk/target/surefire/surefire6554213923749530932tmp
Running org.apache.hadoop.hbase.util.TestKeying
Tests run: 1, Failures: 0, Errors: 0, Skipped: 0, Time elapsed: 0.029 sec
Forking command line: /bin/sh -c cd /x1/jenkins/jenkins-slave/workspace/HBase-0.92-security/trunk
&& /x1/jenkins/tools/java/jdk1.6.0_27-32/jre/bin/java -enableassertions -Xmx1400m
-Djava.security.egd=file:/dev/./urandom -jar /x1/jenkins/jenkins-slave/workspace/HBase-0.92-security/trunk/target/surefire/surefirebooter7846190100406642742.jar
/x1/jenkins/jenkins-slave/workspace/HBase-0.92-security/trunk/target/surefire/surefire4956440871166027916tmp
/x1/jenkins/jenkins-slave/workspace/HBase-0.92-security/trunk/target/surefire/surefire2605469979842274197tmp
Running org.apache.hadoop.hbase.util.TestByteBloomFilter
Tests run: 5, Failures: 0, Errors: 0, Skipped: 0, Time elapsed: 0.861 sec
Forking command line: /bin/sh -c cd /x1/jenkins/jenkins-slave/workspace/HBase-0.92-security/trunk
&& /x1/jenkins/tools/java/jdk1.6.0_27-32/jre/bin/java -enableassertions -Xmx1400m
-Djava.security.egd=file:/dev/./urandom -jar /x1/jenkins/jenkins-slave/workspace/HBase-0.92-security/trunk/target/surefire/surefirebooter7465718834222300153.jar
/x1/jenkins/jenkins-slave/workspace/HBase-0.92-security/trunk/target/surefire/surefire5796159369864245773tmp
/x1/jenkins/jenkins-slave/workspace/HBase-0.92-security/trunk/target/surefire/surefire3216777771140388906tmp
Running org.apache.hadoop.hbase.util.TestRootPath
Tests run: 1, Failures: 0, Errors: 0, Skipped: 0, Time elapsed: 0.096 sec
Forking command line: /bin/sh -c cd /x1/jenkins/jenkins-slave/workspace/HBase-0.92-security/trunk
&& /x1/jenkins/tools/java/jdk1.6.0_27-32/jre/bin/java -enableassertions -Xmx1400m
-Djava.security.egd=file:/dev/./urandom -jar /x1/jenkins/jenkins-slave/workspace/HBase-0.92-security/trunk/target/surefire/surefirebooter2668159878843348287.jar
/x1/jenkins/jenkins-slave/workspace/HBase-0.92-security/trunk/target/surefire/surefire4923281586524159370tmp
/x1/jenkins/jenkins-slave/workspace/HBase-0.92-security/trunk/target/surefire/surefire1226830143533589856tmp
Running org.apache.hadoop.hbase.util.TestMergeTable
Tests run: 1, Failures: 0, Errors: 0, Skipped: 0, Time elapsed: 30.155 sec
Forking command line: /bin/sh -c cd /x1/jenkins/jenkins-slave/workspace/HBase-0.92-security/trunk
&& /x1/jenkins/tools/java/jdk1.6.0_27-32/jre/bin/java -enableassertions -Xmx1400m
-Djava.security.egd=file:/dev/./urandom -jar /x1/jenkins/jenkins-slave/workspace/HBase-0.92-security/trunk/target/surefire/surefirebooter6558962752575084707.jar
/x1/jenkins/jenkins-slave/workspace/HBase-0.92-security/trunk/target/surefire/surefire4535294274290597667tmp
/x1/jenkins/jenkins-slave/workspace/HBase-0.92-security/trunk/target/surefire/surefire326875325857621989tmp
Running org.apache.hadoop.hbase.util.TestHBaseFsck
Tests run: 6, Failures: 0, Errors: 0, Skipped: 0, Time elapsed: 42.746 sec
Forking command line: /bin/sh -c cd /x1/jenkins/jenkins-slave/workspace/HBase-0.92-security/trunk
&& /x1/jenkins/tools/java/jdk1.6.0_27-32/jre/bin/java -enableassertions -Xmx1400m
-Djava.security.egd=file:/dev/./urandom -jar /x1/jenkins/jenkins-slave/workspace/HBase-0.92-security/trunk/target/surefire/surefirebooter8062115390849222169.jar
/x1/jenkins/jenkins-slave/workspace/HBase-0.92-security/trunk/target/surefire/surefire6368136631736941154tmp
/x1/jenkins/jenkins-slave/workspace/HBase-0.92-security/trunk/target/surefire/surefire7736028661755796032tmp
Running org.apache.hadoop.hbase.util.TestFSUtils
Tests run: 2, Failures: 0, Errors: 0, Skipped: 0, Time elapsed: 19.95 sec
Forking command line: /bin/sh -c cd /x1/jenkins/jenkins-slave/workspace/HBase-0.92-security/trunk
&& /x1/jenkins/tools/java/jdk1.6.0_27-32/jre/bin/java -enableassertions -Xmx1400m
-Djava.security.egd=file:/dev/./urandom -jar /x1/jenkins/jenkins-slave/workspace/HBase-0.92-security/trunk/target/surefire/surefirebooter7946648432342587272.jar
/x1/jenkins/jenkins-slave/workspace/HBase-0.92-security/trunk/target/surefire/surefire6263191886683404513tmp
/x1/jenkins/jenkins-slave/workspace/HBase-0.92-security/trunk/target/surefire/surefire1839040106593390325tmp
Running org.apache.hadoop.hbase.util.TestPoolMap
Tests run: 9, Failures: 0, Errors: 0, Skipped: 0, Time elapsed: 0.036 sec
Forking command line: /bin/sh -c cd /x1/jenkins/jenkins-slave/workspace/HBase-0.92-security/trunk
&& /x1/jenkins/tools/java/jdk1.6.0_27-32/jre/bin/java -enableassertions -Xmx1400m
-Djava.security.egd=file:/dev/./urandom -jar /x1/jenkins/jenkins-slave/workspace/HBase-0.92-security/trunk/target/surefire/surefirebooter6255053076622278253.jar
/x1/jenkins/jenkins-slave/workspace/HBase-0.92-security/trunk/target/surefire/surefire208419666166555261tmp
/x1/jenkins/jenkins-slave/workspace/HBase-0.92-security/trunk/target/surefire/surefire8056962131591901148tmp
Running org.apache.hadoop.hbase.util.TestBase64
Tests run: 1, Failures: 0, Errors: 0, Skipped: 0, Time elapsed: 0.078 sec
Forking command line: /bin/sh -c cd /x1/jenkins/jenkins-slave/workspace/HBase-0.92-security/trunk
&& /x1/jenkins/tools/java/jdk1.6.0_27-32/jre/bin/java -enableassertions -Xmx1400m
-Djava.security.egd=file:/dev/./urandom -jar /x1/jenkins/jenkins-slave/workspace/HBase-0.92-security/trunk/target/surefire/surefirebooter1588168113488467868.jar
/x1/jenkins/jenkins-slave/workspace/HBase-0.92-security/trunk/target/surefire/surefire6845431055037340826tmp
/x1/jenkins/jenkins-slave/workspace/HBase-0.92-security/trunk/target/surefire/surefire5488434123133291415tmp
Running org.apache.hadoop.hbase.util.hbck.TestOfflineMetaRebuildBase
Tests run: 1, Failures: 0, Errors: 0, Skipped: 0, Time elapsed: 34.033 sec
Forking command line: /bin/sh -c cd /x1/jenkins/jenkins-slave/workspace/HBase-0.92-security/trunk
&& /x1/jenkins/tools/java/jdk1.6.0_27-32/jre/bin/java -enableassertions -Xmx1400m
-Djava.security.egd=file:/dev/./urandom -jar /x1/jenkins/jenkins-slave/workspace/HBase-0.92-security/trunk/target/surefire/surefirebooter6335459357064428867.jar
/x1/jenkins/jenkins-slave/workspace/HBase-0.92-security/trunk/target/surefire/surefire3951181145804847629tmp
/x1/jenkins/jenkins-slave/workspace/HBase-0.92-security/trunk/target/surefire/surefire5641075368769141943tmp
Running org.apache.hadoop.hbase.util.hbck.TestOfflineMetaRebuildOverlap
Tests run: 1, Failures: 0, Errors: 0, Skipped: 0, Time elapsed: 31.03 sec
Forking command line: /bin/sh -c cd /x1/jenkins/jenkins-slave/workspace/HBase-0.92-security/trunk
&& /x1/jenkins/tools/java/jdk1.6.0_27-32/jre/bin/java -enableassertions -Xmx1400m
-Djava.security.egd=file:/dev/./urandom -jar /x1/jenkins/jenkins-slave/workspace/HBase-0.92-security/trunk/target/surefire/surefirebooter5660041839309140969.jar
/x1/jenkins/jenkins-slave/workspace/HBase-0.92-security/trunk/target/surefire/surefire7302290564405647521tmp
/x1/jenkins/jenkins-slave/workspace/HBase-0.92-security/trunk/target/surefire/surefire8738061208641268597tmp
Running org.apache.hadoop.hbase.util.hbck.TestOfflineMetaRebuildHole
Tests run: 1, Failures: 0, Errors: 0, Skipped: 0, Time elapsed: 31.754 sec
Forking command line: /bin/sh -c cd /x1/jenkins/jenkins-slave/workspace/HBase-0.92-security/trunk
&& /x1/jenkins/tools/java/jdk1.6.0_27-32/jre/bin/java -enableassertions -Xmx1400m
-Djava.security.egd=file:/dev/./urandom -jar /x1/jenkins/jenkins-slave/workspace/HBase-0.92-security/trunk/target/surefire/surefirebooter93132834560122808.jar
/x1/jenkins/jenkins-slave/workspace/HBase-0.92-security/trunk/target/surefire/surefire3062454601199610867tmp
/x1/jenkins/jenkins-slave/workspace/HBase-0.92-security/trunk/target/surefire/surefire3083092737344882779tmp
Running org.apache.hadoop.hbase.util.TestDefaultEnvironmentEdge
Tests run: 1, Failures: 0, Errors: 0, Skipped: 0, Time elapsed: 0.044 sec
Forking command line: /bin/sh -c cd /x1/jenkins/jenkins-slave/workspace/HBase-0.92-security/trunk
&& /x1/jenkins/tools/java/jdk1.6.0_27-32/jre/bin/java -enableassertions -Xmx1400m
-Djava.security.egd=file:/dev/./urandom -jar /x1/jenkins/jenkins-slave/workspace/HBase-0.92-security/trunk/target/surefire/surefirebooter8540120412267958086.jar
/x1/jenkins/jenkins-slave/workspace/HBase-0.92-security/trunk/target/surefire/surefire5044681764912743251tmp
/x1/jenkins/jenkins-slave/workspace/HBase-0.92-security/trunk/target/surefire/surefire7111479203656566426tmp
Running org.apache.hadoop.hbase.util.TestIncrementingEnvironmentEdge
Tests run: 1, Failures: 0, Errors: 0, Skipped: 0, Time elapsed: 0.043 sec
Forking command line: /bin/sh -c cd /x1/jenkins/jenkins-slave/workspace/HBase-0.92-security/trunk
&& /x1/jenkins/tools/java/jdk1.6.0_27-32/jre/bin/java -enableassertions -Xmx1400m
-Djava.security.egd=file:/dev/./urandom -jar /x1/jenkins/jenkins-slave/workspace/HBase-0.92-security/trunk/target/surefire/surefirebooter8460546008196697054.jar
/x1/jenkins/jenkins-slave/workspace/HBase-0.92-security/trunk/target/surefire/surefire7340140774986851247tmp
/x1/jenkins/jenkins-slave/workspace/HBase-0.92-security/trunk/target/surefire/surefire3454811372883177846tmp
Running org.apache.hadoop.hbase.util.TestRegionSplitCalculator
Tests run: 14, Failures: 0, Errors: 0, Skipped: 0, Time elapsed: 0.151 sec
Forking command line: /bin/sh -c cd /x1/jenkins/jenkins-slave/workspace/HBase-0.92-security/trunk
&& /x1/jenkins/tools/java/jdk1.6.0_27-32/jre/bin/java -enableassertions -Xmx1400m
-Djava.security.egd=file:/dev/./urandom -jar /x1/jenkins/jenkins-slave/workspace/HBase-0.92-security/trunk/target/surefire/surefirebooter8603085424607055739.jar
/x1/jenkins/jenkins-slave/workspace/HBase-0.92-security/trunk/target/surefire/surefire4641752947509556712tmp
/x1/jenkins/jenkins-slave/workspace/HBase-0.92-security/trunk/target/surefire/surefire6056452653169473708tmp
Running org.apache.hadoop.hbase.TestHRegionLocation
Tests run: 3, Failures: 0, Errors: 0, Skipped: 0, Time elapsed: 0.126 sec
Forking command line: /bin/sh -c cd /x1/jenkins/jenkins-slave/workspace/HBase-0.92-security/trunk
&& /x1/jenkins/tools/java/jdk1.6.0_27-32/jre/bin/java -enableassertions -Xmx1400m
-Djava.security.egd=file:/dev/./urandom -jar /x1/jenkins/jenkins-slave/workspace/HBase-0.92-security/trunk/target/surefire/surefirebooter8993892954696497270.jar
/x1/jenkins/jenkins-slave/workspace/HBase-0.92-security/trunk/target/surefire/surefire2854285151626151387tmp
/x1/jenkins/jenkins-slave/workspace/HBase-0.92-security/trunk/target/surefire/surefire5501031862847750731tmp
Running org.apache.hadoop.hbase.migration.TestMigrationFrom090To092
Tests run: 1, Failures: 0, Errors: 0, Skipped: 0, Time elapsed: 0.206 sec
Forking command line: /bin/sh -c cd /x1/jenkins/jenkins-slave/workspace/HBase-0.92-security/trunk
&& /x1/jenkins/tools/java/jdk1.6.0_27-32/jre/bin/java -enableassertions -Xmx1400m
-Djava.security.egd=file:/dev/./urandom -jar /x1/jenkins/jenkins-slave/workspace/HBase-0.92-security/trunk/target/surefire/surefirebooter610262406543685604.jar
/x1/jenkins/jenkins-slave/workspace/HBase-0.92-security/trunk/target/surefire/surefire4876781817236440548tmp
/x1/jenkins/jenkins-slave/workspace/HBase-0.92-security/trunk/target/surefire/surefire1256963957808511315tmp
Running org.apache.hadoop.hbase.TestCompare
Tests run: 1, Failures: 0, Errors: 0, Skipped: 0, Time elapsed: 0.177 sec
Forking command line: /bin/sh -c cd /x1/jenkins/jenkins-slave/workspace/HBase-0.92-security/trunk
&& /x1/jenkins/tools/java/jdk1.6.0_27-32/jre/bin/java -enableassertions -Xmx1400m
-Djava.security.egd=file:/dev/./urandom -jar /x1/jenkins/jenkins-slave/workspace/HBase-0.92-security/trunk/target/surefire/surefirebooter5574396741353069791.jar
/x1/jenkins/jenkins-slave/workspace/HBase-0.92-security/trunk/target/surefire/surefire7274571727261169767tmp
/x1/jenkins/jenkins-slave/workspace/HBase-0.92-security/trunk/target/surefire/surefire1842815947514568737tmp
Running org.apache.hadoop.hbase.TestInfoServers
Tests run: 2, Failures: 0, Errors: 0, Skipped: 0, Time elapsed: 16.09 sec
Forking command line: /bin/sh -c cd /x1/jenkins/jenkins-slave/workspace/HBase-0.92-security/trunk
&& /x1/jenkins/tools/java/jdk1.6.0_27-32/jre/bin/java -enableassertions -Xmx1400m
-Djava.security.egd=file:/dev/./urandom -jar /x1/jenkins/jenkins-slave/workspace/HBase-0.92-security/trunk/target/surefire/surefirebooter8227627831015290734.jar
/x1/jenkins/jenkins-slave/workspace/HBase-0.92-security/trunk/target/surefire/surefire696335901655254816tmp
/x1/jenkins/jenkins-slave/workspace/HBase-0.92-security/trunk/target/surefire/surefire3973565979715716424tmp
Running org.apache.hadoop.hbase.TestHServerAddress
Tests run: 6, Failures: 0, Errors: 0, Skipped: 0, Time elapsed: 0.051 sec
Forking command line: /bin/sh -c cd /x1/jenkins/jenkins-slave/workspace/HBase-0.92-security/trunk
&& /x1/jenkins/tools/java/jdk1.6.0_27-32/jre/bin/java -enableassertions -Xmx1400m
-Djava.security.egd=file:/dev/./urandom -jar /x1/jenkins/jenkins-slave/workspace/HBase-0.92-security/trunk/target/surefire/surefirebooter6970090905292933063.jar
/x1/jenkins/jenkins-slave/workspace/HBase-0.92-security/trunk/target/surefire/surefire6468753686040342645tmp
/x1/jenkins/jenkins-slave/workspace/HBase-0.92-security/trunk/target/surefire/surefire1865453508262004569tmp
Running org.apache.hadoop.hbase.TestServerName
Tests run: 4, Failures: 0, Errors: 0, Skipped: 0, Time elapsed: 0.111 sec

Results :

Tests in error: 
  testCheckHBaseAvailableClosesConnection(org.apache.hadoop.hbase.client.TestAdmin): An error
is preventing HBase from connecting to ZooKeeper
  testRetrying(org.apache.hadoop.hbase.catalog.TestMetaReaderEditor): test timed out after
180000 milliseconds
  testGetRegionsCatalogTables(org.apache.hadoop.hbase.catalog.TestMetaReaderEditor): Failed
after attempts=10, exceptions:
  testTableExists(org.apache.hadoop.hbase.catalog.TestMetaReaderEditor): Connection refused
  testGetRegion(org.apache.hadoop.hbase.catalog.TestMetaReaderEditor): Connection refused
  testScanMetaForTable(org.apache.hadoop.hbase.catalog.TestMetaReaderEditor): Failed after
attempts=10, exceptions:

Tests run: 1104, Failures: 0, Errors: 1, Skipped: 8

[INFO] ------------------------------------------------------------------------
[INFO] BUILD FAILURE
[INFO] ------------------------------------------------------------------------
[INFO] Total time: 2:04:24.734s
[INFO] Finished at: Thu Jan 26 12:35:11 UTC 2012
[INFO] Final Memory: 52M/706M
[INFO] ------------------------------------------------------------------------
[ERROR] Failed to execute goal org.apache.maven.plugins:maven-surefire-plugin:2.10:test (default-test)
on project hbase: Failure or timeout -> [Help 1]
org.apache.maven.lifecycle.LifecycleExecutionException: Failed to execute goal org.apache.maven.plugins:maven-surefire-plugin:2.10:test
(default-test) on project hbase: Failure or timeout
	at org.apache.maven.lifecycle.internal.MojoExecutor.execute(MojoExecutor.java:217)
	at org.apache.maven.lifecycle.internal.MojoExecutor.execute(MojoExecutor.java:153)
	at org.apache.maven.lifecycle.internal.MojoExecutor.execute(MojoExecutor.java:145)
	at org.apache.maven.lifecycle.internal.MojoExecutor.executeForkedExecutions(MojoExecutor.java:365)
	at org.apache.maven.lifecycle.internal.MojoExecutor.execute(MojoExecutor.java:199)
	at org.apache.maven.lifecycle.internal.MojoExecutor.execute(MojoExecutor.java:153)
	at org.apache.maven.lifecycle.internal.MojoExecutor.execute(MojoExecutor.java:145)
	at org.apache.maven.lifecycle.internal.LifecycleModuleBuilder.buildProject(LifecycleModuleBuilder.java:84)
	at org.apache.maven.lifecycle.internal.LifecycleModuleBuilder.buildProject(LifecycleModuleBuilder.java:59)
	at org.apache.maven.lifecycle.internal.LifecycleStarter.singleThreadedBuild(LifecycleStarter.java:183)
	at org.apache.maven.lifecycle.internal.LifecycleStarter.execute(LifecycleStarter.java:161)
	at org.apache.maven.DefaultMaven.doExecute(DefaultMaven.java:319)
	at org.apache.maven.DefaultMaven.execute(DefaultMaven.java:156)
	at org.apache.maven.cli.MavenCli.execute(MavenCli.java:537)
	at org.apache.maven.cli.MavenCli.doMain(MavenCli.java:196)
	at org.apache.maven.cli.MavenCli.main(MavenCli.java:141)
	at sun.reflect.NativeMethodAccessorImpl.invoke0(Native Method)
	at sun.reflect.NativeMethodAccessorImpl.invoke(NativeMethodAccessorImpl.java:39)
	at sun.reflect.DelegatingMethodAccessorImpl.invoke(DelegatingMethodAccessorImpl.java:25)
	at java.lang.reflect.Method.invoke(Method.java:597)
	at org.codehaus.plexus.classworlds.launcher.Launcher.launchEnhanced(Launcher.java:290)
	at org.codehaus.plexus.classworlds.launcher.Launcher.launch(Launcher.java:230)
	at org.codehaus.plexus.classworlds.launcher.Launcher.mainWithExitCode(Launcher.java:409)
	at org.codehaus.plexus.classworlds.launcher.Launcher.main(Launcher.java:352)
Caused by: org.apache.maven.plugin.MojoExecutionException: Failure or timeout
	at org.apache.maven.plugin.surefire.SurefirePlugin.assertNoFailureOrTimeout(SurefirePlugin.java:633)
	at org.apache.maven.plugin.surefire.SurefirePlugin.handleSummary(SurefirePlugin.java:614)
	at org.apache.maven.plugin.surefire.AbstractSurefireMojo.executeAfterPreconditionsChecked(AbstractSurefireMojo.java:137)
	at org.apache.maven.plugin.surefire.AbstractSurefireMojo.execute(AbstractSurefireMojo.java:98)
	at org.apache.maven.plugin.DefaultBuildPluginManager.executeMojo(DefaultBuildPluginManager.java:101)
	at org.apache.maven.lifecycle.internal.MojoExecutor.execute(MojoExecutor.java:209)
	... 23 more
[ERROR] 
[ERROR] 
[ERROR] For more information about the errors and possible solutions, please read the following
articles:
[ERROR] [Help 1] http://cwiki.apache.org/confluence/display/MAVEN/MojoExecutionException
Build step 'Invoke top-level Maven targets' marked build as failure
Archiving artifacts
Updating HBASE-5278
Updating HBASE-5231
Recording test results


Mime
View raw message