hbase-dev mailing list archives

Site index · List index
Message view « Date » · « Thread »
Top « Date » · « Thread »
From Apache Jenkins Server <jenk...@builds.apache.org>
Subject Build failed in Jenkins: HBase-0.92 #192
Date Fri, 16 Dec 2011 21:57:51 GMT
See <https://builds.apache.org/job/HBase-0.92/192/changes>

Changes:

[stack] HBASE-5001 Improve the performance of block cache keys

------------------------------------------
[...truncated 5675 lines...]
[ERROR] location: class org.apache.hadoop.hbase.io.hfile.DoubleBlockCache
[ERROR] 
[ERROR] <https://builds.apache.org/job/HBase-0.92/ws/trunk/src/main/java/org/apache/hadoop/hbase/io/hfile/DoubleBlockCache.java>:[113,28]
cannot find symbol
[ERROR] symbol  : class BlockCacheKey
[ERROR] location: class org.apache.hadoop.hbase.io.hfile.DoubleBlockCache
[ERROR] 
[ERROR] <https://builds.apache.org/job/HBase-0.92/ws/trunk/src/main/java/org/apache/hadoop/hbase/io/hfile/LruBlockCache.java>:[113,34]
cannot find symbol
[ERROR] symbol  : class BlockCacheKey
[ERROR] location: class org.apache.hadoop.hbase.io.hfile.LruBlockCache
[ERROR] 
[ERROR] <https://builds.apache.org/job/HBase-0.92/ws/trunk/src/main/java/org/apache/hadoop/hbase/io/hfile/LruBlockCache.java>:[265,25]
cannot find symbol
[ERROR] symbol  : class BlockCacheKey
[ERROR] location: class org.apache.hadoop.hbase.io.hfile.LruBlockCache
[ERROR] 
[ERROR] <https://builds.apache.org/job/HBase-0.92/ws/trunk/src/main/java/org/apache/hadoop/hbase/io/hfile/LruBlockCache.java>:[289,25]
cannot find symbol
[ERROR] symbol  : class BlockCacheKey
[ERROR] location: class org.apache.hadoop.hbase.io.hfile.LruBlockCache
[ERROR] 
[ERROR] <https://builds.apache.org/job/HBase-0.92/ws/trunk/src/main/java/org/apache/hadoop/hbase/io/hfile/LruBlockCache.java>:[298,28]
cannot find symbol
[ERROR] symbol  : class BlockCacheKey
[ERROR] location: class org.apache.hadoop.hbase.io.hfile.LruBlockCache
[ERROR] 
[ERROR] <https://builds.apache.org/job/HBase-0.92/ws/trunk/src/main/java/org/apache/hadoop/hbase/io/hfile/LruBlockCache.java>:[311,28]
cannot find symbol
[ERROR] symbol  : class BlockCacheKey
[ERROR] location: class org.apache.hadoop.hbase.io.hfile.LruBlockCache
[ERROR] 
[ERROR] <https://builds.apache.org/job/HBase-0.92/ws/trunk/src/main/java/org/apache/hadoop/hbase/io/hfile/slab/SlabCache.java>:[57,34]
cannot find symbol
[ERROR] symbol  : class BlockCacheKey
[ERROR] location: class org.apache.hadoop.hbase.io.hfile.slab.SlabCache
[ERROR] 
[ERROR] <https://builds.apache.org/job/HBase-0.92/ws/trunk/src/main/java/org/apache/hadoop/hbase/io/hfile/slab/SingleSizeCache.java>:[33,39]
cannot find symbol
[ERROR] symbol  : class BlockCacheKey
[ERROR] location: package org.apache.hadoop.hbase.io.hfile
[ERROR] 
[ERROR] <https://builds.apache.org/job/HBase-0.92/ws/trunk/src/main/java/org/apache/hadoop/hbase/io/hfile/slab/SlabCache.java>:[199,25]
cannot find symbol
[ERROR] symbol  : class BlockCacheKey
[ERROR] location: class org.apache.hadoop.hbase.io.hfile.slab.SlabCache
[ERROR] 
[ERROR] <https://builds.apache.org/job/HBase-0.92/ws/trunk/src/main/java/org/apache/hadoop/hbase/io/hfile/slab/SlabCache.java>:[223,25]
cannot find symbol
[ERROR] symbol  : class BlockCacheKey
[ERROR] location: class org.apache.hadoop.hbase.io.hfile.slab.SlabCache
[ERROR] 
[ERROR] <https://builds.apache.org/job/HBase-0.92/ws/trunk/src/main/java/org/apache/hadoop/hbase/io/hfile/slab/SlabCache.java>:[238,28]
cannot find symbol
[ERROR] symbol  : class BlockCacheKey
[ERROR] location: class org.apache.hadoop.hbase.io.hfile.slab.SlabCache
[ERROR] 
[ERROR] <https://builds.apache.org/job/HBase-0.92/ws/trunk/src/main/java/org/apache/hadoop/hbase/io/hfile/slab/SlabCache.java>:[259,28]
cannot find symbol
[ERROR] symbol  : class BlockCacheKey
[ERROR] location: class org.apache.hadoop.hbase.io.hfile.slab.SlabCache
[ERROR] 
[ERROR] <https://builds.apache.org/job/HBase-0.92/ws/trunk/src/main/java/org/apache/hadoop/hbase/io/hfile/slab/SlabCache.java>:[270,25]
cannot find symbol
[ERROR] symbol  : class BlockCacheKey
[ERROR] location: class org.apache.hadoop.hbase.io.hfile.slab.SlabCache
[ERROR] 
[ERROR] <https://builds.apache.org/job/HBase-0.92/ws/trunk/src/main/java/org/apache/hadoop/hbase/io/hfile/slab/SlabCache.java>:[276,26]
cannot find symbol
[ERROR] symbol  : class BlockCacheKey
[ERROR] location: class org.apache.hadoop.hbase.io.hfile.slab.SlabCache
[ERROR] 
[ERROR] <https://builds.apache.org/job/HBase-0.92/ws/trunk/src/main/java/org/apache/hadoop/hbase/io/hfile/slab/SlabItemActionWatcher.java>:[36,18]
cannot find symbol
[ERROR] symbol  : class BlockCacheKey
[ERROR] location: interface org.apache.hadoop.hbase.io.hfile.slab.SlabItemActionWatcher
[ERROR] 
[ERROR] <https://builds.apache.org/job/HBase-0.92/ws/trunk/src/main/java/org/apache/hadoop/hbase/io/hfile/slab/SlabItemActionWatcher.java>:[44,19]
cannot find symbol
[ERROR] symbol  : class BlockCacheKey
[ERROR] location: interface org.apache.hadoop.hbase.io.hfile.slab.SlabItemActionWatcher
[ERROR] 
[ERROR] <https://builds.apache.org/job/HBase-0.92/ws/trunk/src/main/java/org/apache/hadoop/hbase/io/hfile/CachedBlock.java>:[55,16]
cannot find symbol
[ERROR] symbol  : class BlockCacheKey
[ERROR] location: class org.apache.hadoop.hbase.io.hfile.CachedBlock
[ERROR] 
[ERROR] <https://builds.apache.org/job/HBase-0.92/ws/trunk/src/main/java/org/apache/hadoop/hbase/io/hfile/CachedBlock.java>:[61,21]
cannot find symbol
[ERROR] symbol  : class BlockCacheKey
[ERROR] location: class org.apache.hadoop.hbase.io.hfile.CachedBlock
[ERROR] 
[ERROR] <https://builds.apache.org/job/HBase-0.92/ws/trunk/src/main/java/org/apache/hadoop/hbase/io/hfile/CachedBlock.java>:[65,21]
cannot find symbol
[ERROR] symbol  : class BlockCacheKey
[ERROR] location: class org.apache.hadoop.hbase.io.hfile.CachedBlock
[ERROR] 
[ERROR] <https://builds.apache.org/job/HBase-0.92/ws/trunk/src/main/java/org/apache/hadoop/hbase/io/hfile/CachedBlock.java>:[102,9]
cannot find symbol
[ERROR] symbol  : class BlockCacheKey
[ERROR] location: class org.apache.hadoop.hbase.io.hfile.CachedBlock
[ERROR] 
[ERROR] <https://builds.apache.org/job/HBase-0.92/ws/trunk/src/main/java/org/apache/hadoop/hbase/io/hfile/slab/SingleSizeCache.java>:[57,30]
cannot find symbol
[ERROR] symbol  : class BlockCacheKey
[ERROR] location: class org.apache.hadoop.hbase.io.hfile.slab.SingleSizeCache
[ERROR] 
[ERROR] <https://builds.apache.org/job/HBase-0.92/ws/trunk/src/main/java/org/apache/hadoop/hbase/io/hfile/slab/SingleSizeCache.java>:[110,25]
cannot find symbol
[ERROR] symbol  : class BlockCacheKey
[ERROR] location: class org.apache.hadoop.hbase.io.hfile.slab.SingleSizeCache
[ERROR] 
[ERROR] <https://builds.apache.org/job/HBase-0.92/ws/trunk/src/main/java/org/apache/hadoop/hbase/io/hfile/slab/SingleSizeCache.java>:[142,28]
cannot find symbol
[ERROR] symbol  : class BlockCacheKey
[ERROR] location: class org.apache.hadoop.hbase.io.hfile.slab.SingleSizeCache
[ERROR] 
[ERROR] <https://builds.apache.org/job/HBase-0.92/ws/trunk/src/main/java/org/apache/hadoop/hbase/io/hfile/slab/SingleSizeCache.java>:[174,28]
cannot find symbol
[ERROR] symbol  : class BlockCacheKey
[ERROR] location: class org.apache.hadoop.hbase.io.hfile.slab.SingleSizeCache
[ERROR] 
[ERROR] <https://builds.apache.org/job/HBase-0.92/ws/trunk/src/main/java/org/apache/hadoop/hbase/io/hfile/slab/SingleSizeCache.java>:[185,26]
cannot find symbol
[ERROR] symbol  : class BlockCacheKey
[ERROR] location: class org.apache.hadoop.hbase.io.hfile.slab.SingleSizeCache
[ERROR] 
[ERROR] <https://builds.apache.org/job/HBase-0.92/ws/trunk/src/main/java/org/apache/hadoop/hbase/io/hfile/slab/SingleSizeCache.java>:[286,25]
cannot find symbol
[ERROR] symbol  : class BlockCacheKey
[ERROR] location: class org.apache.hadoop.hbase.io.hfile.slab.SingleSizeCache
[ERROR] 
[ERROR] <https://builds.apache.org/job/HBase-0.92/ws/trunk/src/main/java/org/apache/hadoop/hbase/io/hfile/SimpleBlockCache.java>:[42,14]
cannot find symbol
[ERROR] symbol  : class BlockCacheKey
[ERROR] location: class org.apache.hadoop.hbase.io.hfile.SimpleBlockCache
[ERROR] 
[ERROR] <https://builds.apache.org/job/HBase-0.92/ws/trunk/src/main/java/org/apache/hadoop/hbase/io/hfile/SimpleBlockCache.java>:[71,41]
cannot find symbol
[ERROR] symbol  : class BlockCacheKey
[ERROR] location: class org.apache.hadoop.hbase.io.hfile.SimpleBlockCache
[ERROR] 
[ERROR] <https://builds.apache.org/job/HBase-0.92/ws/trunk/src/main/java/org/apache/hadoop/hbase/io/hfile/SimpleBlockCache.java>:[79,38]
cannot find symbol
[ERROR] symbol  : class BlockCacheKey
[ERROR] location: class org.apache.hadoop.hbase.io.hfile.SimpleBlockCache
[ERROR] 
[ERROR] <https://builds.apache.org/job/HBase-0.92/ws/trunk/src/main/java/org/apache/hadoop/hbase/io/hfile/SimpleBlockCache.java>:[83,38]
cannot find symbol
[ERROR] symbol  : class BlockCacheKey
[ERROR] location: class org.apache.hadoop.hbase.io.hfile.SimpleBlockCache
[ERROR] 
[ERROR] <https://builds.apache.org/job/HBase-0.92/ws/trunk/src/main/java/org/apache/hadoop/hbase/io/hfile/SimpleBlockCache.java>:[89,28]
cannot find symbol
[ERROR] symbol  : class BlockCacheKey
[ERROR] location: class org.apache.hadoop.hbase.io.hfile.SimpleBlockCache
[ERROR] 
[ERROR] <https://builds.apache.org/job/HBase-0.92/ws/trunk/src/main/java/org/apache/hadoop/hbase/io/hfile/SimpleBlockCache.java>:[36,11]
cannot find symbol
[ERROR] symbol  : class BlockCacheKey
[ERROR] location: class org.apache.hadoop.hbase.io.hfile.SimpleBlockCache.Ref
[ERROR] 
[ERROR] <https://builds.apache.org/job/HBase-0.92/ws/trunk/src/main/java/org/apache/hadoop/hbase/io/hfile/SimpleBlockCache.java>:[37,15]
cannot find symbol
[ERROR] symbol  : class BlockCacheKey
[ERROR] location: class org.apache.hadoop.hbase.io.hfile.SimpleBlockCache.Ref
[ERROR] 
[ERROR] <https://builds.apache.org/job/HBase-0.92/ws/trunk/src/main/java/org/apache/hadoop/hbase/util/Bytes.java>:[44,15]
sun.misc.Unsafe is Sun proprietary API and may be removed in a future release
[ERROR] 
[ERROR] <https://builds.apache.org/job/HBase-0.92/ws/trunk/src/main/java/org/apache/hadoop/hbase/util/Bytes.java>:[1035,19]
sun.misc.Unsafe is Sun proprietary API and may be removed in a future release
[ERROR] 
[ERROR] <https://builds.apache.org/job/HBase-0.92/ws/trunk/src/main/java/org/apache/hadoop/hbase/io/hfile/HFile.java>:[454,15]
cannot find symbol
[ERROR] symbol  : class BlockCacheKey
[ERROR] location: class org.apache.hadoop.hbase.io.hfile.HFile
[ERROR] 
[ERROR] <https://builds.apache.org/job/HBase-0.92/ws/trunk/src/main/java/org/apache/hadoop/hbase/io/hfile/HFileReaderV2.java>:[186,6]
cannot find symbol
[ERROR] symbol  : class BlockCacheKey
[ERROR] location: class org.apache.hadoop.hbase.io.hfile.HFileReaderV2
[ERROR] 
[ERROR] <https://builds.apache.org/job/HBase-0.92/ws/trunk/src/main/java/org/apache/hadoop/hbase/io/hfile/HFileReaderV2.java>:[248,4]
cannot find symbol
[ERROR] symbol  : class BlockCacheKey
[ERROR] location: class org.apache.hadoop.hbase.io.hfile.HFileReaderV2
[ERROR] 
[ERROR] <https://builds.apache.org/job/HBase-0.92/ws/trunk/src/main/java/org/apache/hadoop/hbase/io/hfile/LruBlockCache.java>:[223,32]
cannot find symbol
[ERROR] symbol  : class BlockCacheKey
[ERROR] location: class org.apache.hadoop.hbase.io.hfile.LruBlockCache
[ERROR] 
[ERROR] <https://builds.apache.org/job/HBase-0.92/ws/trunk/src/main/java/org/apache/hadoop/hbase/io/hfile/LruBlockCache.java>:[331,9]
cannot find symbol
[ERROR] symbol  : class BlockCacheKey
[ERROR] location: class org.apache.hadoop.hbase.io.hfile.LruBlockCache
[ERROR] 
[ERROR] <https://builds.apache.org/job/HBase-0.92/ws/trunk/src/main/java/org/apache/hadoop/hbase/io/hfile/LruBlockCache.java>:[472,19]
operator + cannot be applied to long,boolean
[ERROR] 
[ERROR] <https://builds.apache.org/job/HBase-0.92/ws/trunk/src/main/java/org/apache/hadoop/hbase/io/hfile/slab/SlabCache.java>:[89,41]
cannot find symbol
[ERROR] symbol  : class BlockCacheKey
[ERROR] location: class org.apache.hadoop.hbase.io.hfile.slab.SlabCache
[ERROR] 
[ERROR] <https://builds.apache.org/job/HBase-0.92/ws/trunk/src/main/java/org/apache/hadoop/hbase/io/hfile/slab/SlabCache.java>:[408,9]
cannot find symbol
[ERROR] symbol  : class BlockCacheKey
[ERROR] location: class org.apache.hadoop.hbase.io.hfile.slab.SlabCache
[ERROR] 
[ERROR] <https://builds.apache.org/job/HBase-0.92/ws/trunk/src/main/java/org/apache/hadoop/hbase/io/hfile/CachedBlock.java>:[70,31]
operator + cannot be applied to <any>,long
[ERROR] 
[ERROR] <https://builds.apache.org/job/HBase-0.92/ws/trunk/src/main/java/org/apache/hadoop/hbase/io/hfile/CachedBlock.java>:[71,8]
operator + cannot be applied to <nulltype>,long
[ERROR] 
[ERROR] <https://builds.apache.org/job/HBase-0.92/ws/trunk/src/main/java/org/apache/hadoop/hbase/io/hfile/CachedBlock.java>:[71,42]
incompatible types
[ERROR] found   : <nulltype>
[ERROR] required: long
[ERROR] 
[ERROR] <https://builds.apache.org/job/HBase-0.92/ws/trunk/src/main/java/org/apache/hadoop/hbase/io/hfile/slab/SingleSizeCache.java>:[94,24]
cannot find symbol
[ERROR] symbol  : class BlockCacheKey
[ERROR] location: class org.apache.hadoop.hbase.io.hfile.slab.SingleSizeCache
[ERROR] 
[ERROR] <https://builds.apache.org/job/HBase-0.92/ws/trunk/src/main/java/org/apache/hadoop/hbase/io/hfile/slab/SingleSizeCache.java>:[94,89]
cannot find symbol
[ERROR] symbol  : class BlockCacheKey
[ERROR] location: class org.apache.hadoop.hbase.io.hfile.slab.SingleSizeCache
[ERROR] 
[ERROR] <https://builds.apache.org/job/HBase-0.92/ws/trunk/src/main/java/org/apache/hadoop/hbase/io/hfile/slab/SingleSizeCache.java>:[96,29]
cannot find symbol
[ERROR] symbol: class BlockCacheKey
[ERROR] public void onEviction(BlockCacheKey key, CacheablePair value) {
[ERROR] 
[ERROR] <https://builds.apache.org/job/HBase-0.92/ws/trunk/src/main/java/org/apache/hadoop/hbase/io/hfile/slab/SingleSizeCache.java>:[297,9]
cannot find symbol
[ERROR] symbol  : class BlockCacheKey
[ERROR] location: class org.apache.hadoop.hbase.io.hfile.slab.SingleSizeCache
[ERROR] 
[ERROR] <https://builds.apache.org/job/HBase-0.92/ws/trunk/src/main/java/org/apache/hadoop/hbase/io/hfile/SimpleBlockCache.java>:[43,16]
cannot find symbol
[ERROR] symbol  : class BlockCacheKey
[ERROR] location: class org.apache.hadoop.hbase.io.hfile.SimpleBlockCache
[ERROR] 
[ERROR] <https://builds.apache.org/job/HBase-0.92/ws/trunk/src/main/java/org/apache/hadoop/hbase/util/Bytes.java>:[1041,21]
sun.misc.Unsafe is Sun proprietary API and may be removed in a future release
[ERROR] 
[ERROR] <https://builds.apache.org/job/HBase-0.92/ws/trunk/src/main/java/org/apache/hadoop/hbase/util/Bytes.java>:[1046,28]
sun.misc.Unsafe is Sun proprietary API and may be removed in a future release
[ERROR] 
[ERROR] <https://builds.apache.org/job/HBase-0.92/ws/trunk/src/main/java/org/apache/hadoop/hbase/io/hfile/HFileReaderV1.java>:[214,4]
cannot find symbol
[ERROR] symbol  : class BlockCacheKey
[ERROR] location: class org.apache.hadoop.hbase.io.hfile.HFileReaderV1
[ERROR] 
[ERROR] <https://builds.apache.org/job/HBase-0.92/ws/trunk/src/main/java/org/apache/hadoop/hbase/io/hfile/HFileReaderV1.java>:[275,4]
cannot find symbol
[ERROR] symbol  : class BlockCacheKey
[ERROR] location: class org.apache.hadoop.hbase.io.hfile.HFileReaderV1
[ERROR] -> [Help 1]
org.apache.maven.lifecycle.LifecycleExecutionException: Failed to execute goal org.apache.maven.plugins:maven-compiler-plugin:2.0.2:compile
(default-compile) on project hbase: Compilation failure
	at org.apache.maven.lifecycle.internal.MojoExecutor.execute(MojoExecutor.java:213)
	at org.apache.maven.lifecycle.internal.MojoExecutor.execute(MojoExecutor.java:153)
	at org.apache.maven.lifecycle.internal.MojoExecutor.execute(MojoExecutor.java:145)
	at org.apache.maven.lifecycle.internal.MojoExecutor.executeForkedExecutions(MojoExecutor.java:365)
	at org.apache.maven.lifecycle.internal.MojoExecutor.execute(MojoExecutor.java:199)
	at org.apache.maven.lifecycle.internal.MojoExecutor.execute(MojoExecutor.java:153)
	at org.apache.maven.lifecycle.internal.MojoExecutor.execute(MojoExecutor.java:145)
	at org.apache.maven.lifecycle.internal.LifecycleModuleBuilder.buildProject(LifecycleModuleBuilder.java:84)
	at org.apache.maven.lifecycle.internal.LifecycleModuleBuilder.buildProject(LifecycleModuleBuilder.java:59)
	at org.apache.maven.lifecycle.internal.LifecycleStarter.singleThreadedBuild(LifecycleStarter.java:183)
	at org.apache.maven.lifecycle.internal.LifecycleStarter.execute(LifecycleStarter.java:161)
	at org.apache.maven.DefaultMaven.doExecute(DefaultMaven.java:319)
	at org.apache.maven.DefaultMaven.execute(DefaultMaven.java:156)
	at org.apache.maven.cli.MavenCli.execute(MavenCli.java:537)
	at org.apache.maven.cli.MavenCli.doMain(MavenCli.java:196)
	at org.apache.maven.cli.MavenCli.main(MavenCli.java:141)
	at sun.reflect.NativeMethodAccessorImpl.invoke0(Native Method)
	at sun.reflect.NativeMethodAccessorImpl.invoke(NativeMethodAccessorImpl.java:39)
	at sun.reflect.DelegatingMethodAccessorImpl.invoke(DelegatingMethodAccessorImpl.java:25)
	at java.lang.reflect.Method.invoke(Method.java:597)
	at org.codehaus.plexus.classworlds.launcher.Launcher.launchEnhanced(Launcher.java:290)
	at org.codehaus.plexus.classworlds.launcher.Launcher.launch(Launcher.java:230)
	at org.codehaus.plexus.classworlds.launcher.Launcher.mainWithExitCode(Launcher.java:409)
	at org.codehaus.plexus.classworlds.launcher.Launcher.main(Launcher.java:352)
Caused by: org.apache.maven.plugin.CompilationFailureException: Compilation failure
	at org.apache.maven.plugin.AbstractCompilerMojo.execute(AbstractCompilerMojo.java:516)
	at org.apache.maven.plugin.CompilerMojo.execute(CompilerMojo.java:114)
	at org.apache.maven.plugin.DefaultBuildPluginManager.executeMojo(DefaultBuildPluginManager.java:101)
	at org.apache.maven.lifecycle.internal.MojoExecutor.execute(MojoExecutor.java:209)
	... 23 more
[ERROR] 
[ERROR] 
[ERROR] For more information about the errors and possible solutions, please read the following
articles:
[ERROR] [Help 1] http://cwiki.apache.org/confluence/display/MAVEN/MojoFailureException
Build step 'Invoke top-level Maven targets' marked build as failure
[locks-and-latches] Releasing all the locks
[locks-and-latches] All the locks released
Archiving artifacts
Recording test results
Updating HBASE-5001


Mime
View raw message