hbase-dev mailing list archives

Site index · List index
Message view « Date » · « Thread »
Top « Date » · « Thread »
From Apache Jenkins Server <jenk...@builds.apache.org>
Subject Build failed in Jenkins: HBase-TRUNK-security #31
Date Wed, 14 Dec 2011 07:01:37 GMT
See <https://builds.apache.org/job/HBase-TRUNK-security/31/changes>

Changes:

[larsh] HBASE-5001 Improve the performance of block cache keys (Lars H and J-D)

[jdcryans] HBASE-5017  Bump the default hfile.block.cache.size because of HFileV2

[stack] HBASE-5006 Move hbase 0.92RC1 on to hadoop 1.0.0RC2

[tedyu] HBASE-5015 Remove some leaks in tests due to lack of HTable.close()

------------------------------------------
[...truncated 6174 lines...]
12966 KB   
12970 KB   
12973 KB   
12974 KB   
12976 KB   
12980 KB   
12984 KB   
12986 KB   
12987 KB   
12988 KB   
12992 KB   
12996 KB   
13000 KB   
13001 KB   
           
Downloaded: http://repository.codehaus.org/org/jruby/jruby-complete/1.6.5/jruby-complete-1.6.5.jar
(13001 KB at 6419.8 KB/sec)
[INFO] 
[INFO] --- maven-clean-plugin:2.4.1:clean (default-clean) @ hbase ---
[INFO] 
[INFO] --- xml-maven-plugin:1.0-beta-3:transform (default) @ hbase ---
[INFO] Transforming file: <https://builds.apache.org/job/HBase-TRUNK-security/ws/trunk/src/main/resources/hbase-default.xml>
[INFO] Transformed 1 file(s).
[INFO] 
[INFO] --- docbkx-maven-plugin:2.0.13:generate-html (multipage) @ hbase ---
[INFO] Processing input file: developer.xml
[INFO] Chunking output.
[INFO] See <https://builds.apache.org/job/HBase-TRUNK-security/ws/trunk/target/site/book/developer>
for generated file(s)
[INFO] Processing input file: preface.xml
[INFO] Chunking output.
[INFO] See <https://builds.apache.org/job/HBase-TRUNK-security/ws/trunk/target/site/book/preface>
for generated file(s)
[INFO] Processing input file: ops_mgt.xml
[INFO] Chunking output.
[INFO] See <https://builds.apache.org/job/HBase-TRUNK-security/ws/trunk/target/site/book/ops_mgt>
for generated file(s)
[INFO] Processing input file: performance.xml
[INFO] Chunking output.
[INFO] See <https://builds.apache.org/job/HBase-TRUNK-security/ws/trunk/target/site/book/performance>
for generated file(s)
[INFO] Processing input file: upgrading.xml
[INFO] Chunking output.
[INFO] See <https://builds.apache.org/job/HBase-TRUNK-security/ws/trunk/target/site/book/upgrading>
for generated file(s)
[INFO] Processing input file: external_apis.xml
[INFO] Chunking output.
[INFO] See <https://builds.apache.org/job/HBase-TRUNK-security/ws/trunk/target/site/book/external_apis>
for generated file(s)
[INFO] Processing input file: configuration.xml
[INFO] Chunking output.
[INFO] See <https://builds.apache.org/job/HBase-TRUNK-security/ws/trunk/target/site/book/configuration>
for generated file(s)
[INFO] Processing input file: getting_started.xml
[INFO] Chunking output.
[INFO] See <https://builds.apache.org/job/HBase-TRUNK-security/ws/trunk/target/site/book/getting_started>
for generated file(s)
[INFO] Processing input file: shell.xml
[INFO] Chunking output.
[INFO] See <https://builds.apache.org/job/HBase-TRUNK-security/ws/trunk/target/site/book/shell>
for generated file(s)
[INFO] Processing input file: book.xml
[INFO] Chunking output.
[INFO] See <https://builds.apache.org/job/HBase-TRUNK-security/ws/trunk/target/site/book/book>
for generated file(s)
[INFO] Processing input file: troubleshooting.xml
[INFO] Chunking output.
[INFO] See <https://builds.apache.org/job/HBase-TRUNK-security/ws/trunk/target/site/book/troubleshooting>
for generated file(s)
[INFO] 
[INFO] --- docbkx-maven-plugin:2.0.13:generate-html (onepage) @ hbase ---
[INFO] Processing input file: developer.xml
[INFO] <https://builds.apache.org/job/HBase-TRUNK-security/31/artifact/trunk/target/site/developer.html>
has been generated.
[INFO] Processing input file: preface.xml
[INFO] <https://builds.apache.org/job/HBase-TRUNK-security/31/artifact/trunk/target/site/preface.html>
has been generated.
[INFO] Processing input file: ops_mgt.xml
[INFO] <https://builds.apache.org/job/HBase-TRUNK-security/31/artifact/trunk/target/site/ops_mgt.html>
has been generated.
[INFO] Processing input file: performance.xml
[INFO] <https://builds.apache.org/job/HBase-TRUNK-security/31/artifact/trunk/target/site/performance.html>
has been generated.
[INFO] Processing input file: upgrading.xml
[INFO] <https://builds.apache.org/job/HBase-TRUNK-security/31/artifact/trunk/target/site/upgrading.html>
has been generated.
[INFO] Processing input file: external_apis.xml
[INFO] <https://builds.apache.org/job/HBase-TRUNK-security/31/artifact/trunk/target/site/external_apis.html>
has been generated.
[INFO] Processing input file: configuration.xml
[INFO] <https://builds.apache.org/job/HBase-TRUNK-security/31/artifact/trunk/target/site/configuration.html>
has been generated.
[INFO] Processing input file: getting_started.xml
[INFO] <https://builds.apache.org/job/HBase-TRUNK-security/31/artifact/trunk/target/site/getting_started.html>
has been generated.
[INFO] Processing input file: shell.xml
[INFO] <https://builds.apache.org/job/HBase-TRUNK-security/31/artifact/trunk/target/site/shell.html>
has been generated.
[INFO] Processing input file: book.xml
[INFO] <https://builds.apache.org/job/HBase-TRUNK-security/31/artifact/trunk/target/site/book.html>
has been generated.
[INFO] Processing input file: troubleshooting.xml
[INFO] <https://builds.apache.org/job/HBase-TRUNK-security/31/artifact/trunk/target/site/troubleshooting.html>
has been generated.
[INFO] 
[INFO] --- maven-site-plugin:2.0.1:site (default-site) @ hbase ---
[INFO] Parent project loaded from repository.
[INFO] Parent project loaded from repository.
Downloading: https://repository.apache.org/content/repositories/releases/org/apache/maven/skins/maven-stylus-skin/maven-metadata.xml
Downloading: http://repository.codehaus.org/org/apache/maven/skins/maven-stylus-skin/maven-metadata.xml
Downloading: http://people.apache.org/~stack/m2/repository/org/apache/maven/skins/maven-stylus-skin/maven-metadata.xml
Downloading: http://download.java.net/maven/2/org/apache/maven/skins/maven-stylus-skin/maven-metadata.xml
           
Downloading: http://repository.jboss.org/nexus/content/groups/public-jboss/org/apache/maven/skins/maven-stylus-skin/maven-metadata.xml
           
Downloading: http://people.apache.org/~garyh/mvn/org/apache/maven/skins/maven-stylus-skin/maven-metadata.xml
           
Downloading: http://repo1.maven.org/maven2/org/apache/maven/skins/maven-stylus-skin/maven-metadata.xml
           
458 B      
        
Downloaded: https://repository.apache.org/content/repositories/releases/org/apache/maven/skins/maven-stylus-skin/maven-metadata.xml
(458 B at 1.1 KB/sec)
        
458 B   
        
Downloaded: http://repo1.maven.org/maven2/org/apache/maven/skins/maven-stylus-skin/maven-metadata.xml
(458 B at 0.8 KB/sec)
[INFO]                                                                         
[INFO] ------------------------------------------------------------------------
[INFO] Building HBase 0.93-SNAPSHOT
[INFO] ------------------------------------------------------------------------
[INFO] 
[INFO] >>> maven-assembly-plugin:2.2-beta-5:assembly (default-cli) @ hbase >>>
[INFO] 
[INFO] --- maven-antrun-plugin:1.6:run (arc-setup) @ hbase ---
[WARNING] Parameter tasks is deprecated, use target instead
[INFO] Executing tasks

main:
[INFO] Executed tasks
[INFO] 
[INFO] --- avro-maven-plugin:1.5.3:schema (generate-avro-sources) @ hbase ---
[INFO] 
[INFO] --- avro-maven-plugin:1.5.3:protocol (generate-avro-sources) @ hbase ---
[INFO] 
[INFO] --- maven-antrun-plugin:1.6:run (generate) @ hbase ---
[INFO] Executing tasks

main:
    [mkdir] Created dir: <https://builds.apache.org/job/HBase-TRUNK-security/ws/trunk/target/hbase-webapps>
     [copy] Copying 5 files to <https://builds.apache.org/job/HBase-TRUNK-security/ws/trunk/target/hbase-webapps>
11/12/14 07:01:06 INFO mortbay.log: Logging to org.slf4j.impl.Log4jLoggerAdapter(org.mortbay.log)
via org.mortbay.log.Slf4jLog
    [mkdir] Created dir: <https://builds.apache.org/job/HBase-TRUNK-security/ws/trunk/target/hbase-webapps/master/WEB-INF>
    [mkdir] Created dir: <https://builds.apache.org/job/HBase-TRUNK-security/ws/trunk/target/hbase-webapps/regionserver/WEB-INF>
[INFO] Executed tasks
[INFO] 
[INFO] --- build-helper-maven-plugin:1.5:add-source (jspcSource-packageInfo-Avro-source) @
hbase ---
[INFO] Source directory: <https://builds.apache.org/job/HBase-TRUNK-security/ws/trunk/target/generated-jamon>
added.
[INFO] Source directory: <https://builds.apache.org/job/HBase-TRUNK-security/ws/trunk/target/generated-sources/java>
added.
[INFO] 
[INFO] --- build-helper-maven-plugin:1.5:add-source (add-source) @ hbase ---
[INFO] Source directory: <https://builds.apache.org/job/HBase-TRUNK-security/ws/trunk/security/src/main/java>
added.
[INFO] 
[INFO] --- jamon-maven-plugin:2.3.4:translate (default) @ hbase ---
[INFO] Translating 4 templates from <https://builds.apache.org/job/HBase-TRUNK-security/ws/trunk/src/main/jamon>
to <https://builds.apache.org/job/HBase-TRUNK-security/ws/trunk/target/generated-jamon>
[INFO] 
[INFO] --- maven-remote-resources-plugin:1.1:process (default) @ hbase ---
[INFO] Setting property: classpath.resource.loader.class => 'org.codehaus.plexus.velocity.ContextClassLoaderResourceLoader'.
[INFO] Setting property: velocimacro.messages.on => 'false'.
[INFO] Setting property: resource.loader => 'classpath'.
[INFO] Setting property: resource.manager.logwhenfound => 'false'.
[INFO] 
[INFO] --- maven-resources-plugin:2.4:resources (default-resources) @ hbase ---
[INFO] Using 'UTF-8' encoding to copy filtered resources.
[INFO] Copying 1 resource
[INFO] Copying 7 resources
[INFO] Copying 3 resources
[INFO] 
[INFO] --- maven-antrun-plugin:1.6:run (default) @ hbase ---
[INFO] Executing tasks

main:
    [mkdir] Created dir: <https://builds.apache.org/job/HBase-TRUNK-security/ws/trunk/target/nativelib>
     [exec] tar: hadoop-snappy-nativelibs.tar: Cannot open: No such file or directory
     [exec] tar: Error is not recoverable: exiting now
     [exec] Result: 2
[INFO] Executed tasks
[INFO] 
[INFO] --- maven-compiler-plugin:2.0.2:compile (default-compile) @ hbase ---
[INFO] Compiling 669 source files to <https://builds.apache.org/job/HBase-TRUNK-security/ws/trunk/target/classes>
[WARNING] <https://builds.apache.org/job/HBase-TRUNK-security/ws/trunk/src/main/java/org/apache/hadoop/hbase/util/Bytes.java>:[45,15]
sun.misc.Unsafe is Sun proprietary API and may be removed in a future release

[WARNING] <https://builds.apache.org/job/HBase-TRUNK-security/ws/trunk/src/main/java/org/apache/hadoop/hbase/util/Bytes.java>:[1036,19]
sun.misc.Unsafe is Sun proprietary API and may be removed in a future release

[WARNING] <https://builds.apache.org/job/HBase-TRUNK-security/ws/trunk/src/main/java/org/apache/hadoop/hbase/util/Bytes.java>:[1042,21]
sun.misc.Unsafe is Sun proprietary API and may be removed in a future release

[WARNING] <https://builds.apache.org/job/HBase-TRUNK-security/ws/trunk/src/main/java/org/apache/hadoop/hbase/util/Bytes.java>:[1047,28]
sun.misc.Unsafe is Sun proprietary API and may be removed in a future release

[INFO] 
[INFO] --- build-helper-maven-plugin:1.5:add-test-source (add-test-source) @ hbase ---
[INFO] Test Source directory: <https://builds.apache.org/job/HBase-TRUNK-security/ws/trunk/security/src/test/java>
added.
[INFO] 
[INFO] --- build-helper-maven-plugin:1.5:add-test-resource (add-test-resource) @ hbase ---
[INFO] 
[INFO] --- maven-resources-plugin:2.4:testResources (default-testResources) @ hbase ---
[INFO] Using 'UTF-8' encoding to copy filtered resources.
[INFO] Copying 4 resources
[INFO] Copying 3 resources
[INFO] Copying 1 resource
[INFO] 
[INFO] --- maven-compiler-plugin:2.0.2:testCompile (default-testCompile) @ hbase ---
[INFO] Compiling 314 source files to <https://builds.apache.org/job/HBase-TRUNK-security/ws/trunk/target/test-classes>
[INFO] ------------------------------------------------------------------------
[INFO] BUILD FAILURE
[INFO] ------------------------------------------------------------------------
[INFO] Total time: 1:06.372s
[INFO] Finished at: Wed Dec 14 07:01:29 UTC 2011
[INFO] Final Memory: 53M/618M
[INFO] ------------------------------------------------------------------------
[ERROR] Failed to execute goal org.apache.maven.plugins:maven-compiler-plugin:2.0.2:testCompile
(default-testCompile) on project hbase: Compilation failure
[ERROR] <https://builds.apache.org/job/HBase-TRUNK-security/ws/trunk/src/test/java/org/apache/hadoop/hbase/regionserver/TestStore.java>:[592,4]
method does not override or implement a method from a supertype
[ERROR] -> [Help 1]
org.apache.maven.lifecycle.LifecycleExecutionException: Failed to execute goal org.apache.maven.plugins:maven-compiler-plugin:2.0.2:testCompile
(default-testCompile) on project hbase: Compilation failure
<https://builds.apache.org/job/HBase-TRUNK-security/ws/trunk/src/test/java/org/apache/hadoop/hbase/regionserver/TestStore.java>:[592,4]
method does not override or implement a method from a supertype


	at org.apache.maven.lifecycle.internal.MojoExecutor.execute(MojoExecutor.java:213)
	at org.apache.maven.lifecycle.internal.MojoExecutor.execute(MojoExecutor.java:153)
	at org.apache.maven.lifecycle.internal.MojoExecutor.execute(MojoExecutor.java:145)
	at org.apache.maven.lifecycle.internal.MojoExecutor.executeForkedExecutions(MojoExecutor.java:365)
	at org.apache.maven.lifecycle.internal.MojoExecutor.execute(MojoExecutor.java:199)
	at org.apache.maven.lifecycle.internal.MojoExecutor.execute(MojoExecutor.java:153)
	at org.apache.maven.lifecycle.internal.MojoExecutor.execute(MojoExecutor.java:145)
	at org.apache.maven.lifecycle.internal.LifecycleModuleBuilder.buildProject(LifecycleModuleBuilder.java:84)
	at org.apache.maven.lifecycle.internal.LifecycleModuleBuilder.buildProject(LifecycleModuleBuilder.java:59)
	at org.apache.maven.lifecycle.internal.LifecycleStarter.singleThreadedBuild(LifecycleStarter.java:183)
	at org.apache.maven.lifecycle.internal.LifecycleStarter.execute(LifecycleStarter.java:161)
	at org.apache.maven.DefaultMaven.doExecute(DefaultMaven.java:319)
	at org.apache.maven.DefaultMaven.execute(DefaultMaven.java:156)
	at org.apache.maven.cli.MavenCli.execute(MavenCli.java:537)
	at org.apache.maven.cli.MavenCli.doMain(MavenCli.java:196)
	at org.apache.maven.cli.MavenCli.main(MavenCli.java:141)
	at sun.reflect.NativeMethodAccessorImpl.invoke0(Native Method)
	at sun.reflect.NativeMethodAccessorImpl.invoke(NativeMethodAccessorImpl.java:39)
	at sun.reflect.DelegatingMethodAccessorImpl.invoke(DelegatingMethodAccessorImpl.java:25)
	at java.lang.reflect.Method.invoke(Method.java:597)
	at org.codehaus.plexus.classworlds.launcher.Launcher.launchEnhanced(Launcher.java:290)
	at org.codehaus.plexus.classworlds.launcher.Launcher.launch(Launcher.java:230)
	at org.codehaus.plexus.classworlds.launcher.Launcher.mainWithExitCode(Launcher.java:409)
	at org.codehaus.plexus.classworlds.launcher.Launcher.main(Launcher.java:352)
Caused by: org.apache.maven.plugin.CompilationFailureException: Compilation failure
<https://builds.apache.org/job/HBase-TRUNK-security/ws/trunk/src/test/java/org/apache/hadoop/hbase/regionserver/TestStore.java>:[592,4]
method does not override or implement a method from a supertype


	at org.apache.maven.plugin.AbstractCompilerMojo.execute(AbstractCompilerMojo.java:516)
	at org.apache.maven.plugin.TestCompilerMojo.execute(TestCompilerMojo.java:102)
	at org.apache.maven.plugin.DefaultBuildPluginManager.executeMojo(DefaultBuildPluginManager.java:101)
	at org.apache.maven.lifecycle.internal.MojoExecutor.execute(MojoExecutor.java:209)
	... 23 more
[ERROR] 
[ERROR] Re-run Maven using the -X switch to enable full debug logging.
[ERROR] 
[ERROR] For more information about the errors and possible solutions, please read the following
articles:
[ERROR] [Help 1] http://cwiki.apache.org/confluence/display/MAVEN/MojoFailureException
Build step 'Invoke top-level Maven targets' marked build as failure
[locks-and-latches] Releasing all the locks
[locks-and-latches] All the locks released
Archiving artifacts
Recording test results
Updating HBASE-5015
Updating HBASE-5001
Updating HBASE-5017
Updating HBASE-5006


Mime
View raw message