hbase-dev mailing list archives

Site index · List index
Message view « Date » · « Thread »
Top « Date » · « Thread »
From Apache Jenkins Server <jenk...@builds.apache.org>
Subject Build failed in Jenkins: HBase-0.92-security #30
Date Mon, 05 Dec 2011 13:22:40 GMT
See <https://builds.apache.org/job/HBase-0.92-security/30/changes>

Changes:

[apurtell] HBASE-4944. Optionally verify bulk loaded HFiles

[tedyu] HBASE-4942  HMaster is unable to start of HFile V1 is used (honghua Zhu)

[larsh] HBASE-4945  NPE in HRegion.bulkLoadHFiles (Andrew P and Lars H)

------------------------------------------
[...truncated 6738 lines...]
Forking command line: /bin/sh -c cd <https://builds.apache.org/job/HBase-0.92-security/ws/trunk>
&& /home/jenkins/tools/java/jdk1.6.0_27-32/jre/bin/java -enableassertions -Xmx1400m
-Djava.security.egd=file:/dev/./urandom -jar <https://builds.apache.org/job/HBase-0.92-security/ws/trunk/target/surefire/surefirebooter9173289490682485781.jar>
<https://builds.apache.org/job/HBase-0.92-security/ws/trunk/target/surefire/surefire5447204187939569286tmp>
<https://builds.apache.org/job/HBase-0.92-security/ws/trunk/target/surefire/surefire2222819395575786869tmp>
Running org.apache.hadoop.hbase.rest.TestRowResource
Tests run: 11, Failures: 0, Errors: 0, Skipped: 0, Time elapsed: 23.707 sec
Forking command line: /bin/sh -c cd <https://builds.apache.org/job/HBase-0.92-security/ws/trunk>
&& /home/jenkins/tools/java/jdk1.6.0_27-32/jre/bin/java -enableassertions -Xmx1400m
-Djava.security.egd=file:/dev/./urandom -jar <https://builds.apache.org/job/HBase-0.92-security/ws/trunk/target/surefire/surefirebooter9034400550205711671.jar>
<https://builds.apache.org/job/HBase-0.92-security/ws/trunk/target/surefire/surefire6305895298972966942tmp>
<https://builds.apache.org/job/HBase-0.92-security/ws/trunk/target/surefire/surefire1550677846636324014tmp>
Running org.apache.hadoop.hbase.rest.model.TestCellModel
Tests run: 3, Failures: 0, Errors: 0, Skipped: 0, Time elapsed: 0.373 sec
Forking command line: /bin/sh -c cd <https://builds.apache.org/job/HBase-0.92-security/ws/trunk>
&& /home/jenkins/tools/java/jdk1.6.0_27-32/jre/bin/java -enableassertions -Xmx1400m
-Djava.security.egd=file:/dev/./urandom -jar <https://builds.apache.org/job/HBase-0.92-security/ws/trunk/target/surefire/surefirebooter7620361381019050207.jar>
<https://builds.apache.org/job/HBase-0.92-security/ws/trunk/target/surefire/surefire7986884271860116301tmp>
<https://builds.apache.org/job/HBase-0.92-security/ws/trunk/target/surefire/surefire417350025122458152tmp>
Running org.apache.hadoop.hbase.rest.model.TestCellSetModel
Tests run: 3, Failures: 0, Errors: 0, Skipped: 0, Time elapsed: 0.412 sec
Forking command line: /bin/sh -c cd <https://builds.apache.org/job/HBase-0.92-security/ws/trunk>
&& /home/jenkins/tools/java/jdk1.6.0_27-32/jre/bin/java -enableassertions -Xmx1400m
-Djava.security.egd=file:/dev/./urandom -jar <https://builds.apache.org/job/HBase-0.92-security/ws/trunk/target/surefire/surefirebooter6837198342968320559.jar>
<https://builds.apache.org/job/HBase-0.92-security/ws/trunk/target/surefire/surefire1203086205409043781tmp>
<https://builds.apache.org/job/HBase-0.92-security/ws/trunk/target/surefire/surefire2089522382685192448tmp>
Running org.apache.hadoop.hbase.rest.model.TestTableListModel
Tests run: 3, Failures: 0, Errors: 0, Skipped: 0, Time elapsed: 0.386 sec
Forking command line: /bin/sh -c cd <https://builds.apache.org/job/HBase-0.92-security/ws/trunk>
&& /home/jenkins/tools/java/jdk1.6.0_27-32/jre/bin/java -enableassertions -Xmx1400m
-Djava.security.egd=file:/dev/./urandom -jar <https://builds.apache.org/job/HBase-0.92-security/ws/trunk/target/surefire/surefirebooter1198604972235128169.jar>
<https://builds.apache.org/job/HBase-0.92-security/ws/trunk/target/surefire/surefire5968390743736024652tmp>
<https://builds.apache.org/job/HBase-0.92-security/ws/trunk/target/surefire/surefire8822279333383952012tmp>
Running org.apache.hadoop.hbase.rest.model.TestVersionModel
Tests run: 3, Failures: 0, Errors: 0, Skipped: 0, Time elapsed: 0.369 sec
Forking command line: /bin/sh -c cd <https://builds.apache.org/job/HBase-0.92-security/ws/trunk>
&& /home/jenkins/tools/java/jdk1.6.0_27-32/jre/bin/java -enableassertions -Xmx1400m
-Djava.security.egd=file:/dev/./urandom -jar <https://builds.apache.org/job/HBase-0.92-security/ws/trunk/target/surefire/surefirebooter5724834931849074209.jar>
<https://builds.apache.org/job/HBase-0.92-security/ws/trunk/target/surefire/surefire1539576655064055797tmp>
<https://builds.apache.org/job/HBase-0.92-security/ws/trunk/target/surefire/surefire8642410287646482534tmp>
Running org.apache.hadoop.hbase.rest.model.TestColumnSchemaModel
Tests run: 2, Failures: 0, Errors: 0, Skipped: 0, Time elapsed: 0.276 sec
Forking command line: /bin/sh -c cd <https://builds.apache.org/job/HBase-0.92-security/ws/trunk>
&& /home/jenkins/tools/java/jdk1.6.0_27-32/jre/bin/java -enableassertions -Xmx1400m
-Djava.security.egd=file:/dev/./urandom -jar <https://builds.apache.org/job/HBase-0.92-security/ws/trunk/target/surefire/surefirebooter7968222869377459385.jar>
<https://builds.apache.org/job/HBase-0.92-security/ws/trunk/target/surefire/surefire7350672632810187572tmp>
<https://builds.apache.org/job/HBase-0.92-security/ws/trunk/target/surefire/surefire3420323866151879544tmp>
Running org.apache.hadoop.hbase.rest.model.TestTableInfoModel
Tests run: 3, Failures: 0, Errors: 0, Skipped: 0, Time elapsed: 0.407 sec
Forking command line: /bin/sh -c cd <https://builds.apache.org/job/HBase-0.92-security/ws/trunk>
&& /home/jenkins/tools/java/jdk1.6.0_27-32/jre/bin/java -enableassertions -Xmx1400m
-Djava.security.egd=file:/dev/./urandom -jar <https://builds.apache.org/job/HBase-0.92-security/ws/trunk/target/surefire/surefirebooter3321605213568758352.jar>
<https://builds.apache.org/job/HBase-0.92-security/ws/trunk/target/surefire/surefire8373881385635318234tmp>
<https://builds.apache.org/job/HBase-0.92-security/ws/trunk/target/surefire/surefire5744761273434378052tmp>
Running org.apache.hadoop.hbase.rest.model.TestRowModel
Tests run: 2, Failures: 0, Errors: 0, Skipped: 0, Time elapsed: 0.371 sec
Forking command line: /bin/sh -c cd <https://builds.apache.org/job/HBase-0.92-security/ws/trunk>
&& /home/jenkins/tools/java/jdk1.6.0_27-32/jre/bin/java -enableassertions -Xmx1400m
-Djava.security.egd=file:/dev/./urandom -jar <https://builds.apache.org/job/HBase-0.92-security/ws/trunk/target/surefire/surefirebooter4838935708033282606.jar>
<https://builds.apache.org/job/HBase-0.92-security/ws/trunk/target/surefire/surefire8270121755370811798tmp>
<https://builds.apache.org/job/HBase-0.92-security/ws/trunk/target/surefire/surefire5616530176115861115tmp>
Running org.apache.hadoop.hbase.rest.model.TestTableSchemaModel
Tests run: 3, Failures: 0, Errors: 0, Skipped: 0, Time elapsed: 0.413 sec
Forking command line: /bin/sh -c cd <https://builds.apache.org/job/HBase-0.92-security/ws/trunk>
&& /home/jenkins/tools/java/jdk1.6.0_27-32/jre/bin/java -enableassertions -Xmx1400m
-Djava.security.egd=file:/dev/./urandom -jar <https://builds.apache.org/job/HBase-0.92-security/ws/trunk/target/surefire/surefirebooter6270554096657890494.jar>
<https://builds.apache.org/job/HBase-0.92-security/ws/trunk/target/surefire/surefire508340818197208856tmp>
<https://builds.apache.org/job/HBase-0.92-security/ws/trunk/target/surefire/surefire3078127617072746243tmp>
Running org.apache.hadoop.hbase.rest.model.TestStorageClusterVersionModel
Tests run: 2, Failures: 0, Errors: 0, Skipped: 0, Time elapsed: 0.272 sec
Forking command line: /bin/sh -c cd <https://builds.apache.org/job/HBase-0.92-security/ws/trunk>
&& /home/jenkins/tools/java/jdk1.6.0_27-32/jre/bin/java -enableassertions -Xmx1400m
-Djava.security.egd=file:/dev/./urandom -jar <https://builds.apache.org/job/HBase-0.92-security/ws/trunk/target/surefire/surefirebooter3472666671229769865.jar>
<https://builds.apache.org/job/HBase-0.92-security/ws/trunk/target/surefire/surefire6008986582978747937tmp>
<https://builds.apache.org/job/HBase-0.92-security/ws/trunk/target/surefire/surefire8685351381944208617tmp>
Running org.apache.hadoop.hbase.rest.model.TestTableRegionModel
Tests run: 4, Failures: 0, Errors: 0, Skipped: 0, Time elapsed: 0.464 sec
Forking command line: /bin/sh -c cd <https://builds.apache.org/job/HBase-0.92-security/ws/trunk>
&& /home/jenkins/tools/java/jdk1.6.0_27-32/jre/bin/java -enableassertions -Xmx1400m
-Djava.security.egd=file:/dev/./urandom -jar <https://builds.apache.org/job/HBase-0.92-security/ws/trunk/target/surefire/surefirebooter4134049044795393373.jar>
<https://builds.apache.org/job/HBase-0.92-security/ws/trunk/target/surefire/surefire7356773661598427153tmp>
<https://builds.apache.org/job/HBase-0.92-security/ws/trunk/target/surefire/surefire1245544773500995176tmp>
Running org.apache.hadoop.hbase.rest.model.TestStorageClusterStatusModel
Tests run: 3, Failures: 0, Errors: 0, Skipped: 0, Time elapsed: 0.448 sec
Forking command line: /bin/sh -c cd <https://builds.apache.org/job/HBase-0.92-security/ws/trunk>
&& /home/jenkins/tools/java/jdk1.6.0_27-32/jre/bin/java -enableassertions -Xmx1400m
-Djava.security.egd=file:/dev/./urandom -jar <https://builds.apache.org/job/HBase-0.92-security/ws/trunk/target/surefire/surefirebooter1568586768466373101.jar>
<https://builds.apache.org/job/HBase-0.92-security/ws/trunk/target/surefire/surefire3972327592332284366tmp>
<https://builds.apache.org/job/HBase-0.92-security/ws/trunk/target/surefire/surefire2568224699679425279tmp>
Running org.apache.hadoop.hbase.rest.model.TestScannerModel
Tests run: 3, Failures: 0, Errors: 0, Skipped: 0, Time elapsed: 0.412 sec
Forking command line: /bin/sh -c cd <https://builds.apache.org/job/HBase-0.92-security/ws/trunk>
&& /home/jenkins/tools/java/jdk1.6.0_27-32/jre/bin/java -enableassertions -Xmx1400m
-Djava.security.egd=file:/dev/./urandom -jar <https://builds.apache.org/job/HBase-0.92-security/ws/trunk/target/surefire/surefirebooter4670425966111225517.jar>
<https://builds.apache.org/job/HBase-0.92-security/ws/trunk/target/surefire/surefire2065501849297005055tmp>
<https://builds.apache.org/job/HBase-0.92-security/ws/trunk/target/surefire/surefire7922739245004861020tmp>
Running org.apache.hadoop.hbase.rest.client.TestRemoteAdmin
Tests run: 1, Failures: 0, Errors: 0, Skipped: 0, Time elapsed: 24.594 sec
Forking command line: /bin/sh -c cd <https://builds.apache.org/job/HBase-0.92-security/ws/trunk>
&& /home/jenkins/tools/java/jdk1.6.0_27-32/jre/bin/java -enableassertions -Xmx1400m
-Djava.security.egd=file:/dev/./urandom -jar <https://builds.apache.org/job/HBase-0.92-security/ws/trunk/target/surefire/surefirebooter8011236105990913514.jar>
<https://builds.apache.org/job/HBase-0.92-security/ws/trunk/target/surefire/surefire2542526985340835433tmp>
<https://builds.apache.org/job/HBase-0.92-security/ws/trunk/target/surefire/surefire4069506483239927239tmp>
Running org.apache.hadoop.hbase.rest.client.TestRemoteTable
Tests run: 3, Failures: 0, Errors: 0, Skipped: 0, Time elapsed: 22.452 sec
Forking command line: /bin/sh -c cd <https://builds.apache.org/job/HBase-0.92-security/ws/trunk>
&& /home/jenkins/tools/java/jdk1.6.0_27-32/jre/bin/java -enableassertions -Xmx1400m
-Djava.security.egd=file:/dev/./urandom -jar <https://builds.apache.org/job/HBase-0.92-security/ws/trunk/target/surefire/surefirebooter3564627990299128842.jar>
<https://builds.apache.org/job/HBase-0.92-security/ws/trunk/target/surefire/surefire2396454490020438858tmp>
<https://builds.apache.org/job/HBase-0.92-security/ws/trunk/target/surefire/surefire8977928102661723899tmp>
Running org.apache.hadoop.hbase.rest.TestVersionResource
Tests run: 7, Failures: 0, Errors: 0, Skipped: 0, Time elapsed: 21.026 sec
Forking command line: /bin/sh -c cd <https://builds.apache.org/job/HBase-0.92-security/ws/trunk>
&& /home/jenkins/tools/java/jdk1.6.0_27-32/jre/bin/java -enableassertions -Xmx1400m
-Djava.security.egd=file:/dev/./urandom -jar <https://builds.apache.org/job/HBase-0.92-security/ws/trunk/target/surefire/surefirebooter6305123095315748900.jar>
<https://builds.apache.org/job/HBase-0.92-security/ws/trunk/target/surefire/surefire2304896604586644449tmp>
<https://builds.apache.org/job/HBase-0.92-security/ws/trunk/target/surefire/surefire7724720751955407647tmp>
Running org.apache.hadoop.hbase.rest.TestScannerResource
Tests run: 5, Failures: 0, Errors: 0, Skipped: 0, Time elapsed: 34.85 sec
Forking command line: /bin/sh -c cd <https://builds.apache.org/job/HBase-0.92-security/ws/trunk>
&& /home/jenkins/tools/java/jdk1.6.0_27-32/jre/bin/java -enableassertions -Xmx1400m
-Djava.security.egd=file:/dev/./urandom -jar <https://builds.apache.org/job/HBase-0.92-security/ws/trunk/target/surefire/surefirebooter3525648559046095652.jar>
<https://builds.apache.org/job/HBase-0.92-security/ws/trunk/target/surefire/surefire5710441890553643106tmp>
<https://builds.apache.org/job/HBase-0.92-security/ws/trunk/target/surefire/surefire5270871971655265657tmp>
Running org.apache.hadoop.hbase.rest.TestTransform
Tests run: 1, Failures: 0, Errors: 0, Skipped: 0, Time elapsed: 21.968 sec
Forking command line: /bin/sh -c cd <https://builds.apache.org/job/HBase-0.92-security/ws/trunk>
&& /home/jenkins/tools/java/jdk1.6.0_27-32/jre/bin/java -enableassertions -Xmx1400m
-Djava.security.egd=file:/dev/./urandom -jar <https://builds.apache.org/job/HBase-0.92-security/ws/trunk/target/surefire/surefirebooter6355413244337295905.jar>
<https://builds.apache.org/job/HBase-0.92-security/ws/trunk/target/surefire/surefire5455879874699165266tmp>
<https://builds.apache.org/job/HBase-0.92-security/ws/trunk/target/surefire/surefire2272635851104952106tmp>
Running org.apache.hadoop.hbase.rest.TestTableResource
Tests run: 8, Failures: 0, Errors: 0, Skipped: 0, Time elapsed: 28.2 sec
Forking command line: /bin/sh -c cd <https://builds.apache.org/job/HBase-0.92-security/ws/trunk>
&& /home/jenkins/tools/java/jdk1.6.0_27-32/jre/bin/java -enableassertions -Xmx1400m
-Djava.security.egd=file:/dev/./urandom -jar <https://builds.apache.org/job/HBase-0.92-security/ws/trunk/target/surefire/surefirebooter8959057754888746291.jar>
<https://builds.apache.org/job/HBase-0.92-security/ws/trunk/target/surefire/surefire2677454896885334644tmp>
<https://builds.apache.org/job/HBase-0.92-security/ws/trunk/target/surefire/surefire8865943190193663533tmp>
Running org.apache.hadoop.hbase.rest.TestStatusResource
Tests run: 2, Failures: 0, Errors: 0, Skipped: 0, Time elapsed: 19.898 sec
Forking command line: /bin/sh -c cd <https://builds.apache.org/job/HBase-0.92-security/ws/trunk>
&& /home/jenkins/tools/java/jdk1.6.0_27-32/jre/bin/java -enableassertions -Xmx1400m
-Djava.security.egd=file:/dev/./urandom -jar <https://builds.apache.org/job/HBase-0.92-security/ws/trunk/target/surefire/surefirebooter4552029314219026877.jar>
<https://builds.apache.org/job/HBase-0.92-security/ws/trunk/target/surefire/surefire4769153902689125591tmp>
<https://builds.apache.org/job/HBase-0.92-security/ws/trunk/target/surefire/surefire7234485491523855093tmp>
Running org.apache.hadoop.hbase.rest.TestSchemaResource
Tests run: 2, Failures: 0, Errors: 0, Skipped: 0, Time elapsed: 26.301 sec
Forking command line: /bin/sh -c cd <https://builds.apache.org/job/HBase-0.92-security/ws/trunk>
&& /home/jenkins/tools/java/jdk1.6.0_27-32/jre/bin/java -enableassertions -Xmx1400m
-Djava.security.egd=file:/dev/./urandom -jar <https://builds.apache.org/job/HBase-0.92-security/ws/trunk/target/surefire/surefirebooter5875618581111029157.jar>
<https://builds.apache.org/job/HBase-0.92-security/ws/trunk/target/surefire/surefire4099503177268147644tmp>
<https://builds.apache.org/job/HBase-0.92-security/ws/trunk/target/surefire/surefire2483089777713774785tmp>
Running org.apache.hadoop.hbase.thrift.TestThriftServer
Tests run: 1, Failures: 0, Errors: 0, Skipped: 0, Time elapsed: 26.541 sec
Forking command line: /bin/sh -c cd <https://builds.apache.org/job/HBase-0.92-security/ws/trunk>
&& /home/jenkins/tools/java/jdk1.6.0_27-32/jre/bin/java -enableassertions -Xmx1400m
-Djava.security.egd=file:/dev/./urandom -jar <https://builds.apache.org/job/HBase-0.92-security/ws/trunk/target/surefire/surefirebooter1831551908053294668.jar>
<https://builds.apache.org/job/HBase-0.92-security/ws/trunk/target/surefire/surefire6423404431588938818tmp>
<https://builds.apache.org/job/HBase-0.92-security/ws/trunk/target/surefire/surefire6405883418405296527tmp>
Running org.apache.hadoop.hbase.io.TestHeapSize
Tests run: 2, Failures: 0, Errors: 0, Skipped: 0, Time elapsed: 0.157 sec
Forking command line: /bin/sh -c cd <https://builds.apache.org/job/HBase-0.92-security/ws/trunk>
&& /home/jenkins/tools/java/jdk1.6.0_27-32/jre/bin/java -enableassertions -Xmx1400m
-Djava.security.egd=file:/dev/./urandom -jar <https://builds.apache.org/job/HBase-0.92-security/ws/trunk/target/surefire/surefirebooter5701010244378122293.jar>
<https://builds.apache.org/job/HBase-0.92-security/ws/trunk/target/surefire/surefire3142046313224614291tmp>
<https://builds.apache.org/job/HBase-0.92-security/ws/trunk/target/surefire/surefire6497250251910345765tmp>
Running org.apache.hadoop.hbase.io.hfile.TestHFileSeek
Tests run: 1, Failures: 0, Errors: 0, Skipped: 0, Time elapsed: 5.718 sec
Forking command line: /bin/sh -c cd <https://builds.apache.org/job/HBase-0.92-security/ws/trunk>
&& /home/jenkins/tools/java/jdk1.6.0_27-32/jre/bin/java -enableassertions -Xmx1400m
-Djava.security.egd=file:/dev/./urandom -jar <https://builds.apache.org/job/HBase-0.92-security/ws/trunk/target/surefire/surefirebooter4124882212117637.jar>
<https://builds.apache.org/job/HBase-0.92-security/ws/trunk/target/surefire/surefire6514077949063312784tmp>
<https://builds.apache.org/job/HBase-0.92-security/ws/trunk/target/surefire/surefire5624254044124863297tmp>
Running org.apache.hadoop.hbase.io.hfile.slab.TestSlab
Tests run: 1, Failures: 0, Errors: 0, Skipped: 0, Time elapsed: 0.145 sec
Forking command line: /bin/sh -c cd <https://builds.apache.org/job/HBase-0.92-security/ws/trunk>
&& /home/jenkins/tools/java/jdk1.6.0_27-32/jre/bin/java -enableassertions -Xmx1400m
-Djava.security.egd=file:/dev/./urandom -jar <https://builds.apache.org/job/HBase-0.92-security/ws/trunk/target/surefire/surefirebooter3952567733927447619.jar>
<https://builds.apache.org/job/HBase-0.92-security/ws/trunk/target/surefire/surefire7952231174874704000tmp>
<https://builds.apache.org/job/HBase-0.92-security/ws/trunk/target/surefire/surefire270466335981073936tmp>
Running org.apache.hadoop.hbase.io.hfile.slab.TestSlabCache
Tests run: 7, Failures: 0, Errors: 0, Skipped: 0, Time elapsed: 19.442 sec
Forking command line: /bin/sh -c cd <https://builds.apache.org/job/HBase-0.92-security/ws/trunk>
&& /home/jenkins/tools/java/jdk1.6.0_27-32/jre/bin/java -enableassertions -Xmx1400m
-Djava.security.egd=file:/dev/./urandom -jar <https://builds.apache.org/job/HBase-0.92-security/ws/trunk/target/surefire/surefirebooter2086482581252514090.jar>
<https://builds.apache.org/job/HBase-0.92-security/ws/trunk/target/surefire/surefire8256895565358373297tmp>
<https://builds.apache.org/job/HBase-0.92-security/ws/trunk/target/surefire/surefire2427577148370864662tmp>
Running org.apache.hadoop.hbase.io.hfile.slab.TestSingleSizeCache
Tests run: 5, Failures: 0, Errors: 0, Skipped: 0, Time elapsed: 24.391 sec
Forking command line: /bin/sh -c cd <https://builds.apache.org/job/HBase-0.92-security/ws/trunk>
&& /home/jenkins/tools/java/jdk1.6.0_27-32/jre/bin/java -enableassertions -Xmx1400m
-Djava.security.egd=file:/dev/./urandom -jar <https://builds.apache.org/job/HBase-0.92-security/ws/trunk/target/surefire/surefirebooter3036845801454945573.jar>
<https://builds.apache.org/job/HBase-0.92-security/ws/trunk/target/surefire/surefire3983459306881649417tmp>
<https://builds.apache.org/job/HBase-0.92-security/ws/trunk/target/surefire/surefire3217682907574359700tmp>
Running org.apache.hadoop.hbase.io.hfile.TestCachedBlockQueue
Tests run: 2, Failures: 0, Errors: 0, Skipped: 0, Time elapsed: 0.104 sec
Forking command line: /bin/sh -c cd <https://builds.apache.org/job/HBase-0.92-security/ws/trunk>
&& /home/jenkins/tools/java/jdk1.6.0_27-32/jre/bin/java -enableassertions -Xmx1400m
-Djava.security.egd=file:/dev/./urandom -jar <https://builds.apache.org/job/HBase-0.92-security/ws/trunk/target/surefire/surefirebooter1062555175105397055.jar>
<https://builds.apache.org/job/HBase-0.92-security/ws/trunk/target/surefire/surefire1229892580340015972tmp>
<https://builds.apache.org/job/HBase-0.92-security/ws/trunk/target/surefire/surefire2185851954793653740tmp>
Running org.apache.hadoop.hbase.io.hfile.TestHFileBlockIndex
Tests run: 10, Failures: 0, Errors: 0, Skipped: 0, Time elapsed: 10.241 sec
Forking command line: /bin/sh -c cd <https://builds.apache.org/job/HBase-0.92-security/ws/trunk>
&& /home/jenkins/tools/java/jdk1.6.0_27-32/jre/bin/java -enableassertions -Xmx1400m
-Djava.security.egd=file:/dev/./urandom -jar <https://builds.apache.org/job/HBase-0.92-security/ws/trunk/target/surefire/surefirebooter6202066104774017862.jar>
<https://builds.apache.org/job/HBase-0.92-security/ws/trunk/target/surefire/surefire5830829625827331081tmp>
<https://builds.apache.org/job/HBase-0.92-security/ws/trunk/target/surefire/surefire2423795204302084636tmp>
Running org.apache.hadoop.hbase.io.hfile.TestLruBlockCache
Tests run: 7, Failures: 0, Errors: 0, Skipped: 0, Time elapsed: 0.343 sec
Forking command line: /bin/sh -c cd <https://builds.apache.org/job/HBase-0.92-security/ws/trunk>
&& /home/jenkins/tools/java/jdk1.6.0_27-32/jre/bin/java -enableassertions -Xmx1400m
-Djava.security.egd=file:/dev/./urandom -jar <https://builds.apache.org/job/HBase-0.92-security/ws/trunk/target/surefire/surefirebooter1319353215151971542.jar>
<https://builds.apache.org/job/HBase-0.92-security/ws/trunk/target/surefire/surefire5370836484789219946tmp>
<https://builds.apache.org/job/HBase-0.92-security/ws/trunk/target/surefire/surefire7790581879518019081tmp>
Running org.apache.hadoop.hbase.io.hfile.TestHFilePerformance
Tests run: 1, Failures: 0, Errors: 0, Skipped: 0, Time elapsed: 5.948 sec
Forking command line: /bin/sh -c cd <https://builds.apache.org/job/HBase-0.92-security/ws/trunk>
&& /home/jenkins/tools/java/jdk1.6.0_27-32/jre/bin/java -enableassertions -Xmx1400m
-Djava.security.egd=file:/dev/./urandom -jar <https://builds.apache.org/job/HBase-0.92-security/ws/trunk/target/surefire/surefirebooter8812183520538062430.jar>
<https://builds.apache.org/job/HBase-0.92-security/ws/trunk/target/surefire/surefire4375661044627035714tmp>
<https://builds.apache.org/job/HBase-0.92-security/ws/trunk/target/surefire/surefire1671300390945571289tmp>
Running org.apache.hadoop.hbase.io.hfile.TestFixedFileTrailer
Tests run: 2, Failures: 0, Errors: 0, Skipped: 0, Time elapsed: 0.679 sec
Forking command line: /bin/sh -c cd <https://builds.apache.org/job/HBase-0.92-security/ws/trunk>
&& /home/jenkins/tools/java/jdk1.6.0_27-32/jre/bin/java -enableassertions -Xmx1400m
-Djava.security.egd=file:/dev/./urandom -jar <https://builds.apache.org/job/HBase-0.92-security/ws/trunk/target/surefire/surefirebooter1157941560336195874.jar>
<https://builds.apache.org/job/HBase-0.92-security/ws/trunk/target/surefire/surefire1014678828410242901tmp>
<https://builds.apache.org/job/HBase-0.92-security/ws/trunk/target/surefire/surefire2112789281804305389tmp>
Running org.apache.hadoop.hbase.io.hfile.TestHFileWriterV2
Tests run: 1, Failures: 0, Errors: 0, Skipped: 0, Time elapsed: 1.14 sec
Forking command line: /bin/sh -c cd <https://builds.apache.org/job/HBase-0.92-security/ws/trunk>
&& /home/jenkins/tools/java/jdk1.6.0_27-32/jre/bin/java -enableassertions -Xmx1400m
-Djava.security.egd=file:/dev/./urandom -jar <https://builds.apache.org/job/HBase-0.92-security/ws/trunk/target/surefire/surefirebooter5034754460445438260.jar>
<https://builds.apache.org/job/HBase-0.92-security/ws/trunk/target/surefire/surefire1779591944234779091tmp>
<https://builds.apache.org/job/HBase-0.92-security/ws/trunk/target/surefire/surefire4525411955810730618tmp>
Running org.apache.hadoop.hbase.io.hfile.TestBlockCacheColumnFamilySummary
Tests run: 4, Failures: 0, Errors: 0, Skipped: 0, Time elapsed: 0.057 sec
Forking command line: /bin/sh -c cd <https://builds.apache.org/job/HBase-0.92-security/ws/trunk>
&& /home/jenkins/tools/java/jdk1.6.0_27-32/jre/bin/java -enableassertions -Xmx1400m
-Djava.security.egd=file:/dev/./urandom -jar <https://builds.apache.org/job/HBase-0.92-security/ws/trunk/target/surefire/surefirebooter802716285545978627.jar>
<https://builds.apache.org/job/HBase-0.92-security/ws/trunk/target/surefire/surefire3353593579133382784tmp>
<https://builds.apache.org/job/HBase-0.92-security/ws/trunk/target/surefire/surefire5518638820329657729tmp>
Running org.apache.hadoop.hbase.io.hfile.TestHFileReaderV1
Tests run: 1, Failures: 0, Errors: 0, Skipped: 0, Time elapsed: 0.572 sec
Forking command line: /bin/sh -c cd <https://builds.apache.org/job/HBase-0.92-security/ws/trunk>
&& /home/jenkins/tools/java/jdk1.6.0_27-32/jre/bin/java -enableassertions -Xmx1400m
-Djava.security.egd=file:/dev/./urandom -jar <https://builds.apache.org/job/HBase-0.92-security/ws/trunk/target/surefire/surefirebooter3150536210865919565.jar>
<https://builds.apache.org/job/HBase-0.92-security/ws/trunk/target/surefire/surefire2117341346524602600tmp>
<https://builds.apache.org/job/HBase-0.92-security/ws/trunk/target/surefire/surefire1172012325216285177tmp>
Running org.apache.hadoop.hbase.io.hfile.TestHFile
Tests run: 6, Failures: 0, Errors: 0, Skipped: 0, Time elapsed: 0.847 sec
Forking command line: /bin/sh -c cd <https://builds.apache.org/job/HBase-0.92-security/ws/trunk>
&& /home/jenkins/tools/java/jdk1.6.0_27-32/jre/bin/java -enableassertions -Xmx1400m
-Djava.security.egd=file:/dev/./urandom -jar <https://builds.apache.org/job/HBase-0.92-security/ws/trunk/target/surefire/surefirebooter282277451185051131.jar>
<https://builds.apache.org/job/HBase-0.92-security/ws/trunk/target/surefire/surefire2858865208016907604tmp>
<https://builds.apache.org/job/HBase-0.92-security/ws/trunk/target/surefire/surefire1929860911313155527tmp>
Running org.apache.hadoop.hbase.io.hfile.TestReseekTo
Tests run: 1, Failures: 0, Errors: 0, Skipped: 0, Time elapsed: 0.76 sec
Forking command line: /bin/sh -c cd <https://builds.apache.org/job/HBase-0.92-security/ws/trunk>
&& /home/jenkins/tools/java/jdk1.6.0_27-32/jre/bin/java -enableassertions -Xmx1400m
-Djava.security.egd=file:/dev/./urandom -jar <https://builds.apache.org/job/HBase-0.92-security/ws/trunk/target/surefire/surefirebooter4677812833508172041.jar>
<https://builds.apache.org/job/HBase-0.92-security/ws/trunk/target/surefire/surefire8432855021715515448tmp>
<https://builds.apache.org/job/HBase-0.92-security/ws/trunk/target/surefire/surefire6868257269567421139tmp>
Running org.apache.hadoop.hbase.io.hfile.TestHFileBlock
Tests run: 7, Failures: 0, Errors: 0, Skipped: 0, Time elapsed: 25.819 sec
Forking command line: /bin/sh -c cd <https://builds.apache.org/job/HBase-0.92-security/ws/trunk>
&& /home/jenkins/tools/java/jdk1.6.0_27-32/jre/bin/java -enableassertions -Xmx1400m
-Djava.security.egd=file:/dev/./urandom -jar <https://builds.apache.org/job/HBase-0.92-security/ws/trunk/target/surefire/surefirebooter8968079705761455003.jar>
<https://builds.apache.org/job/HBase-0.92-security/ws/trunk/target/surefire/surefire1307891220909395957tmp>
<https://builds.apache.org/job/HBase-0.92-security/ws/trunk/target/surefire/surefire9077967081032020339tmp>
Running org.apache.hadoop.hbase.io.hfile.TestSeekTo
Tests run: 3, Failures: 0, Errors: 0, Skipped: 0, Time elapsed: 0.659 sec
Forking command line: /bin/sh -c cd <https://builds.apache.org/job/HBase-0.92-security/ws/trunk>
&& /home/jenkins/tools/java/jdk1.6.0_27-32/jre/bin/java -enableassertions -Xmx1400m
-Djava.security.egd=file:/dev/./urandom -jar <https://builds.apache.org/job/HBase-0.92-security/ws/trunk/target/surefire/surefirebooter3657424136935137385.jar>
<https://builds.apache.org/job/HBase-0.92-security/ws/trunk/target/surefire/surefire7035372858466134610tmp>
<https://builds.apache.org/job/HBase-0.92-security/ws/trunk/target/surefire/surefire2626032571837374372tmp>
Running org.apache.hadoop.hbase.io.hfile.TestCacheOnWrite
Tests run: 6, Failures: 0, Errors: 0, Skipped: 0, Time elapsed: 7.502 sec
Forking command line: /bin/sh -c cd <https://builds.apache.org/job/HBase-0.92-security/ws/trunk>
&& /home/jenkins/tools/java/jdk1.6.0_27-32/jre/bin/java -enableassertions -Xmx1400m
-Djava.security.egd=file:/dev/./urandom -jar <https://builds.apache.org/job/HBase-0.92-security/ws/trunk/target/surefire/surefirebooter1199346155523786440.jar>
<https://builds.apache.org/job/HBase-0.92-security/ws/trunk/target/surefire/surefire1127236983744023367tmp>
<https://builds.apache.org/job/HBase-0.92-security/ws/trunk/target/surefire/surefire2772718430085727942tmp>
Running org.apache.hadoop.hbase.io.TestHbaseObjectWritable
Tests run: 4, Failures: 0, Errors: 0, Skipped: 0, Time elapsed: 0.461 sec
Forking command line: /bin/sh -c cd <https://builds.apache.org/job/HBase-0.92-security/ws/trunk>
&& /home/jenkins/tools/java/jdk1.6.0_27-32/jre/bin/java -enableassertions -Xmx1400m
-Djava.security.egd=file:/dev/./urandom -jar <https://builds.apache.org/job/HBase-0.92-security/ws/trunk/target/surefire/surefirebooter8883801952714136389.jar>
<https://builds.apache.org/job/HBase-0.92-security/ws/trunk/target/surefire/surefire3028368926368303298tmp>
<https://builds.apache.org/job/HBase-0.92-security/ws/trunk/target/surefire/surefire8865980477930419145tmp>
Running org.apache.hadoop.hbase.io.TestImmutableBytesWritable
Tests run: 3, Failures: 0, Errors: 0, Skipped: 0, Time elapsed: 0.11 sec
Forking command line: /bin/sh -c cd <https://builds.apache.org/job/HBase-0.92-security/ws/trunk>
&& /home/jenkins/tools/java/jdk1.6.0_27-32/jre/bin/java -enableassertions -Xmx1400m
-Djava.security.egd=file:/dev/./urandom -jar <https://builds.apache.org/job/HBase-0.92-security/ws/trunk/target/surefire/surefirebooter8234221758789033164.jar>
<https://builds.apache.org/job/HBase-0.92-security/ws/trunk/target/surefire/surefire5690342710305400547tmp>
<https://builds.apache.org/job/HBase-0.92-security/ws/trunk/target/surefire/surefire8749714809390081415tmp>
Running org.apache.hadoop.hbase.io.TestHalfStoreFileReader
Tests run: 1, Failures: 0, Errors: 0, Skipped: 0, Time elapsed: 0.78 sec
Forking command line: /bin/sh -c cd <https://builds.apache.org/job/HBase-0.92-security/ws/trunk>
&& /home/jenkins/tools/java/jdk1.6.0_27-32/jre/bin/java -enableassertions -Xmx1400m
-Djava.security.egd=file:/dev/./urandom -jar <https://builds.apache.org/job/HBase-0.92-security/ws/trunk/target/surefire/surefirebooter640585547063489309.jar>
<https://builds.apache.org/job/HBase-0.92-security/ws/trunk/target/surefire/surefire5387894559595773502tmp>
<https://builds.apache.org/job/HBase-0.92-security/ws/trunk/target/surefire/surefire6887784843041229349tmp>
Running org.apache.hadoop.hbase.migration.TestMigrationFrom090To092
Tests run: 1, Failures: 0, Errors: 0, Skipped: 0, Time elapsed: 0.271 sec
Forking command line: /bin/sh -c cd <https://builds.apache.org/job/HBase-0.92-security/ws/trunk>
&& /home/jenkins/tools/java/jdk1.6.0_27-32/jre/bin/java -enableassertions -Xmx1400m
-Djava.security.egd=file:/dev/./urandom -jar <https://builds.apache.org/job/HBase-0.92-security/ws/trunk/target/surefire/surefirebooter2605430293404003806.jar>
<https://builds.apache.org/job/HBase-0.92-security/ws/trunk/target/surefire/surefire6266910285787349997tmp>
<https://builds.apache.org/job/HBase-0.92-security/ws/trunk/target/surefire/surefire8693125853931775554tmp>
Running org.apache.hadoop.hbase.TestFSTableDescriptorForceCreation
Tests run: 3, Failures: 0, Errors: 0, Skipped: 0, Time elapsed: 0.649 sec
Forking command line: /bin/sh -c cd <https://builds.apache.org/job/HBase-0.92-security/ws/trunk>
&& /home/jenkins/tools/java/jdk1.6.0_27-32/jre/bin/java -enableassertions -Xmx1400m
-Djava.security.egd=file:/dev/./urandom -jar <https://builds.apache.org/job/HBase-0.92-security/ws/trunk/target/surefire/surefirebooter7134531361201666967.jar>
<https://builds.apache.org/job/HBase-0.92-security/ws/trunk/target/surefire/surefire9117667503282977309tmp>
<https://builds.apache.org/job/HBase-0.92-security/ws/trunk/target/surefire/surefire7698799469682373233tmp>
Running org.apache.hadoop.hbase.avro.TestAvroUtil
Tests run: 1, Failures: 0, Errors: 0, Skipped: 0, Time elapsed: 0.637 sec
Forking command line: /bin/sh -c cd <https://builds.apache.org/job/HBase-0.92-security/ws/trunk>
&& /home/jenkins/tools/java/jdk1.6.0_27-32/jre/bin/java -enableassertions -Xmx1400m
-Djava.security.egd=file:/dev/./urandom -jar <https://builds.apache.org/job/HBase-0.92-security/ws/trunk/target/surefire/surefirebooter7507920697468957554.jar>
<https://builds.apache.org/job/HBase-0.92-security/ws/trunk/target/surefire/surefire3663388593214341537tmp>
<https://builds.apache.org/job/HBase-0.92-security/ws/trunk/target/surefire/surefire6848396009684095460tmp>
Running org.apache.hadoop.hbase.avro.TestAvroServer
Tests run: 3, Failures: 0, Errors: 0, Skipped: 0, Time elapsed: 36.018 sec
Forking command line: /bin/sh -c cd <https://builds.apache.org/job/HBase-0.92-security/ws/trunk>
&& /home/jenkins/tools/java/jdk1.6.0_27-32/jre/bin/java -enableassertions -Xmx1400m
-Djava.security.egd=file:/dev/./urandom -jar <https://builds.apache.org/job/HBase-0.92-security/ws/trunk/target/surefire/surefirebooter7197022838687698307.jar>
<https://builds.apache.org/job/HBase-0.92-security/ws/trunk/target/surefire/surefire303366393780555949tmp>
<https://builds.apache.org/job/HBase-0.92-security/ws/trunk/target/surefire/surefire5388011478631242071tmp>
Running org.apache.hadoop.hbase.TestKeyValue
Tests run: 11, Failures: 0, Errors: 0, Skipped: 0, Time elapsed: 0.129 sec
Forking command line: /bin/sh -c cd <https://builds.apache.org/job/HBase-0.92-security/ws/trunk>
&& /home/jenkins/tools/java/jdk1.6.0_27-32/jre/bin/java -enableassertions -Xmx1400m
-Djava.security.egd=file:/dev/./urandom -jar <https://builds.apache.org/job/HBase-0.92-security/ws/trunk/target/surefire/surefirebooter5327045993296965809.jar>
<https://builds.apache.org/job/HBase-0.92-security/ws/trunk/target/surefire/surefire4923236735057194689tmp>
<https://builds.apache.org/job/HBase-0.92-security/ws/trunk/target/surefire/surefire2685735737989898679tmp>
Running org.apache.hadoop.hbase.replication.TestMultiSlaveReplication
Tests run: 1, Failures: 0, Errors: 0, Skipped: 0, Time elapsed: 60.386 sec
Forking command line: /bin/sh -c cd <https://builds.apache.org/job/HBase-0.92-security/ws/trunk>
&& /home/jenkins/tools/java/jdk1.6.0_27-32/jre/bin/java -enableassertions -Xmx1400m
-Djava.security.egd=file:/dev/./urandom -jar <https://builds.apache.org/job/HBase-0.92-security/ws/trunk/target/surefire/surefirebooter8445321128432115289.jar>
<https://builds.apache.org/job/HBase-0.92-security/ws/trunk/target/surefire/surefire5142219429168486185tmp>
<https://builds.apache.org/job/HBase-0.92-security/ws/trunk/target/surefire/surefire7046629334513004428tmp>
Running org.apache.hadoop.hbase.replication.regionserver.TestReplicationSourceManager
Tests run: 1, Failures: 0, Errors: 0, Skipped: 0, Time elapsed: 1.038 sec
Forking command line: /bin/sh -c cd <https://builds.apache.org/job/HBase-0.92-security/ws/trunk>
&& /home/jenkins/tools/java/jdk1.6.0_27-32/jre/bin/java -enableassertions -Xmx1400m
-Djava.security.egd=file:/dev/./urandom -jar <https://builds.apache.org/job/HBase-0.92-security/ws/trunk/target/surefire/surefirebooter4863817653810934204.jar>
<https://builds.apache.org/job/HBase-0.92-security/ws/trunk/target/surefire/surefire7360700667151296868tmp>
<https://builds.apache.org/job/HBase-0.92-security/ws/trunk/target/surefire/surefire8495147242530065943tmp>
Running org.apache.hadoop.hbase.replication.regionserver.TestReplicationSink
Tests run: 5, Failures: 0, Errors: 0, Skipped: 0, Time elapsed: 23.358 sec
Forking command line: /bin/sh -c cd <https://builds.apache.org/job/HBase-0.92-security/ws/trunk>
&& /home/jenkins/tools/java/jdk1.6.0_27-32/jre/bin/java -enableassertions -Xmx1400m
-Djava.security.egd=file:/dev/./urandom -jar <https://builds.apache.org/job/HBase-0.92-security/ws/trunk/target/surefire/surefirebooter2828247183823924277.jar>
<https://builds.apache.org/job/HBase-0.92-security/ws/trunk/target/surefire/surefire9085854383585176138tmp>
<https://builds.apache.org/job/HBase-0.92-security/ws/trunk/target/surefire/surefire2616262457021158614tmp>
Running org.apache.hadoop.hbase.replication.TestMasterReplication
Tests run: 2, Failures: 0, Errors: 0, Skipped: 0, Time elapsed: 104.949 sec
Forking command line: /bin/sh -c cd <https://builds.apache.org/job/HBase-0.92-security/ws/trunk>
&& /home/jenkins/tools/java/jdk1.6.0_27-32/jre/bin/java -enableassertions -Xmx1400m
-Djava.security.egd=file:/dev/./urandom -jar <https://builds.apache.org/job/HBase-0.92-security/ws/trunk/target/surefire/surefirebooter4992769568004151529.jar>
<https://builds.apache.org/job/HBase-0.92-security/ws/trunk/target/surefire/surefire6106386113465551493tmp>
<https://builds.apache.org/job/HBase-0.92-security/ws/trunk/target/surefire/surefire6171861662480694851tmp>
Running org.apache.hadoop.hbase.replication.TestReplicationSource
Tests run: 1, Failures: 0, Errors: 0, Skipped: 0, Time elapsed: 2.705 sec
Forking command line: /bin/sh -c cd <https://builds.apache.org/job/HBase-0.92-security/ws/trunk>
&& /home/jenkins/tools/java/jdk1.6.0_27-32/jre/bin/java -enableassertions -Xmx1400m
-Djava.security.egd=file:/dev/./urandom -jar <https://builds.apache.org/job/HBase-0.92-security/ws/trunk/target/surefire/surefirebooter3345102015402164747.jar>
<https://builds.apache.org/job/HBase-0.92-security/ws/trunk/target/surefire/surefire3736940553344125956tmp>
<https://builds.apache.org/job/HBase-0.92-security/ws/trunk/target/surefire/surefire7017065029978960456tmp>
Running org.apache.hadoop.hbase.replication.TestReplicationPeer
Tests run: 1, Failures: 0, Errors: 0, Skipped: 0, Time elapsed: 25.649 sec
Forking command line: /bin/sh -c cd <https://builds.apache.org/job/HBase-0.92-security/ws/trunk>
&& /home/jenkins/tools/java/jdk1.6.0_27-32/jre/bin/java -enableassertions -Xmx1400m
-Djava.security.egd=file:/dev/./urandom -jar <https://builds.apache.org/job/HBase-0.92-security/ws/trunk/target/surefire/surefirebooter6831991053904905944.jar>
<https://builds.apache.org/job/HBase-0.92-security/ws/trunk/target/surefire/surefire2423062867548274661tmp>
<https://builds.apache.org/job/HBase-0.92-security/ws/trunk/target/surefire/surefire5380023023062326312tmp>
Running org.apache.hadoop.hbase.replication.TestReplication
Tests run: 7, Failures: 0, Errors: 0, Skipped: 0, Time elapsed: 124.149 sec
Forking command line: /bin/sh -c cd <https://builds.apache.org/job/HBase-0.92-security/ws/trunk>
&& /home/jenkins/tools/java/jdk1.6.0_27-32/jre/bin/java -enableassertions -Xmx1400m
-Djava.security.egd=file:/dev/./urandom -jar <https://builds.apache.org/job/HBase-0.92-security/ws/trunk/target/surefire/surefirebooter3180400604259204160.jar>
<https://builds.apache.org/job/HBase-0.92-security/ws/trunk/target/surefire/surefire7882805198542280734tmp>
<https://builds.apache.org/job/HBase-0.92-security/ws/trunk/target/surefire/surefire7128168782069580774tmp>
Running org.apache.hadoop.hbase.ipc.TestDelayedRpc
Tests run: 4, Failures: 0, Errors: 0, Skipped: 0, Time elapsed: 2.287 sec
Forking command line: /bin/sh -c cd <https://builds.apache.org/job/HBase-0.92-security/ws/trunk>
&& /home/jenkins/tools/java/jdk1.6.0_27-32/jre/bin/java -enableassertions -Xmx1400m
-Djava.security.egd=file:/dev/./urandom -jar <https://builds.apache.org/job/HBase-0.92-security/ws/trunk/target/surefire/surefirebooter1587257465391705876.jar>
<https://builds.apache.org/job/HBase-0.92-security/ws/trunk/target/surefire/surefire3815654321929759764tmp>
<https://builds.apache.org/job/HBase-0.92-security/ws/trunk/target/surefire/surefire1943506900897335826tmp>
Running org.apache.hadoop.hbase.TestCompare
Tests run: 1, Failures: 0, Errors: 0, Skipped: 0, Time elapsed: 0.233 sec
Forking command line: /bin/sh -c cd <https://builds.apache.org/job/HBase-0.92-security/ws/trunk>
&& /home/jenkins/tools/java/jdk1.6.0_27-32/jre/bin/java -enableassertions -Xmx1400m
-Djava.security.egd=file:/dev/./urandom -jar <https://builds.apache.org/job/HBase-0.92-security/ws/trunk/target/surefire/surefirebooter3845770892720973655.jar>
<https://builds.apache.org/job/HBase-0.92-security/ws/trunk/target/surefire/surefire8030776861178398206tmp>
<https://builds.apache.org/job/HBase-0.92-security/ws/trunk/target/surefire/surefire3955244667050363385tmp>
Running org.apache.hadoop.hbase.TestZooKeeper
Tests run: 7, Failures: 0, Errors: 0, Skipped: 0, Time elapsed: 87.043 sec
Forking command line: /bin/sh -c cd <https://builds.apache.org/job/HBase-0.92-security/ws/trunk>
&& /home/jenkins/tools/java/jdk1.6.0_27-32/jre/bin/java -enableassertions -Xmx1400m
-Djava.security.egd=file:/dev/./urandom -jar <https://builds.apache.org/job/HBase-0.92-security/ws/trunk/target/surefire/surefirebooter179313040992215497.jar>
<https://builds.apache.org/job/HBase-0.92-security/ws/trunk/target/surefire/surefire924465708967876075tmp>
<https://builds.apache.org/job/HBase-0.92-security/ws/trunk/target/surefire/surefire7669659767791781037tmp>
Running org.apache.hadoop.hbase.TestHBaseTestingUtility
Tests run: 7, Failures: 0, Errors: 0, Skipped: 0, Time elapsed: 108.822 sec

Results :

Failed tests:   testWorkerAbort(org.apache.hadoop.hbase.master.TestDistributedLogSplitting):
expected:<1> but was:<0>
  testPermissionsWatcher(org.apache.hadoop.hbase.security.access.TestZKPermissionsWatcher)

Tests in error: 
  testMasterFailoverWithMockedRITOnDeadRS(org.apache.hadoop.hbase.master.TestMasterFailover):
test timed out after 180000 milliseconds

Tests run: 1098, Failures: 2, Errors: 1, Skipped: 8

[INFO] ------------------------------------------------------------------------
[INFO] BUILD FAILURE
[INFO] ------------------------------------------------------------------------
[INFO] Total time: 1:57:56.070s
[INFO] Finished at: Mon Dec 05 13:22:12 UTC 2011
[INFO] Final Memory: 43M/605M
[INFO] ------------------------------------------------------------------------
[ERROR] Failed to execute goal org.apache.maven.plugins:maven-surefire-plugin:2.10:test (default-test)
on project hbase: There are test failures.
[ERROR] 
[ERROR] Please refer to <https://builds.apache.org/job/HBase-0.92-security/ws/trunk/target/surefire-reports>
for the individual test results.
[ERROR] -> [Help 1]
org.apache.maven.lifecycle.LifecycleExecutionException: Failed to execute goal org.apache.maven.plugins:maven-surefire-plugin:2.10:test
(default-test) on project hbase: There are test failures.

Please refer to <https://builds.apache.org/job/HBase-0.92-security/ws/trunk/target/surefire-reports>
for the individual test results.
	at org.apache.maven.lifecycle.internal.MojoExecutor.execute(MojoExecutor.java:213)
	at org.apache.maven.lifecycle.internal.MojoExecutor.execute(MojoExecutor.java:153)
	at org.apache.maven.lifecycle.internal.MojoExecutor.execute(MojoExecutor.java:145)
	at org.apache.maven.lifecycle.internal.MojoExecutor.executeForkedExecutions(MojoExecutor.java:365)
	at org.apache.maven.lifecycle.internal.MojoExecutor.execute(MojoExecutor.java:199)
	at org.apache.maven.lifecycle.internal.MojoExecutor.execute(MojoExecutor.java:153)
	at org.apache.maven.lifecycle.internal.MojoExecutor.execute(MojoExecutor.java:145)
	at org.apache.maven.lifecycle.internal.LifecycleModuleBuilder.buildProject(LifecycleModuleBuilder.java:84)
	at org.apache.maven.lifecycle.internal.LifecycleModuleBuilder.buildProject(LifecycleModuleBuilder.java:59)
	at org.apache.maven.lifecycle.internal.LifecycleStarter.singleThreadedBuild(LifecycleStarter.java:183)
	at org.apache.maven.lifecycle.internal.LifecycleStarter.execute(LifecycleStarter.java:161)
	at org.apache.maven.DefaultMaven.doExecute(DefaultMaven.java:319)
	at org.apache.maven.DefaultMaven.execute(DefaultMaven.java:156)
	at org.apache.maven.cli.MavenCli.execute(MavenCli.java:537)
	at org.apache.maven.cli.MavenCli.doMain(MavenCli.java:196)
	at org.apache.maven.cli.MavenCli.main(MavenCli.java:141)
	at sun.reflect.NativeMethodAccessorImpl.invoke0(Native Method)
	at sun.reflect.NativeMethodAccessorImpl.invoke(NativeMethodAccessorImpl.java:39)
	at sun.reflect.DelegatingMethodAccessorImpl.invoke(DelegatingMethodAccessorImpl.java:25)
	at java.lang.reflect.Method.invoke(Method.java:597)
	at org.codehaus.plexus.classworlds.launcher.Launcher.launchEnhanced(Launcher.java:290)
	at org.codehaus.plexus.classworlds.launcher.Launcher.launch(Launcher.java:230)
	at org.codehaus.plexus.classworlds.launcher.Launcher.mainWithExitCode(Launcher.java:409)
	at org.codehaus.plexus.classworlds.launcher.Launcher.main(Launcher.java:352)
Caused by: org.apache.maven.plugin.MojoFailureException: There are test failures.

Please refer to <https://builds.apache.org/job/HBase-0.92-security/ws/trunk/target/surefire-reports>
for the individual test results.
	at org.apache.maven.plugin.surefire.SurefireHelper.reportExecution(SurefireHelper.java:87)
	at org.apache.maven.plugin.surefire.SurefirePlugin.writeSummary(SurefirePlugin.java:641)
	at org.apache.maven.plugin.surefire.SurefirePlugin.handleSummary(SurefirePlugin.java:615)
	at org.apache.maven.plugin.surefire.AbstractSurefireMojo.executeAfterPreconditionsChecked(AbstractSurefireMojo.java:137)
	at org.apache.maven.plugin.surefire.AbstractSurefireMojo.execute(AbstractSurefireMojo.java:98)
	at org.apache.maven.plugin.DefaultBuildPluginManager.executeMojo(DefaultBuildPluginManager.java:101)
	at org.apache.maven.lifecycle.internal.MojoExecutor.execute(MojoExecutor.java:209)
	... 23 more
[ERROR] 
[ERROR] 
[ERROR] For more information about the errors and possible solutions, please read the following
articles:
[ERROR] [Help 1] http://cwiki.apache.org/confluence/display/MAVEN/MojoFailureException
Build step 'Invoke top-level Maven targets' marked build as failure
[locks-and-latches] Releasing all the locks
[locks-and-latches] All the locks released
Archiving artifacts
Recording test results
Updating HBASE-4942
Updating HBASE-4944
Updating HBASE-4945


Mime
View raw message