hbase-dev mailing list archives

Site index · List index
Message view « Date » · « Thread »
Top « Date » · « Thread »
From Apache Jenkins Server <jenk...@builds.apache.org>
Subject Build failed in Jenkins: HBase-0.92 #194
Date Sun, 18 Dec 2011 02:46:29 GMT
See <https://builds.apache.org/job/HBase-0.92/194/changes>

Changes:

[stack] HBASE-4934 Display Master server and Regionserver start time on respective info servers

[stack] HBASE-5040 Secure HBase builds fail

[stack] HBASE-5040 Secure HBase builds fail

------------------------------------------
[...truncated 8328 lines...]
Running org.apache.hadoop.hbase.regionserver.TestKeyValueSkipListSet
Tests run: 4, Failures: 0, Errors: 0, Skipped: 0, Time elapsed: 0.122 sec
Forking command line: /bin/sh -c cd <https://builds.apache.org/job/HBase-0.92/ws/trunk>
&& /home/hudson/tools/java/jdk1.6.0_27-32/jre/bin/java -enableassertions -Xmx1400m
-Djava.security.egd=file:/dev/./urandom -jar <https://builds.apache.org/job/HBase-0.92/ws/trunk/target/surefire/surefirebooter3111811306699412348.jar>
<https://builds.apache.org/job/HBase-0.92/ws/trunk/target/surefire/surefire8711600186439774022tmp>
<https://builds.apache.org/job/HBase-0.92/ws/trunk/target/surefire/surefire9169781907532341563tmp>
Running org.apache.hadoop.hbase.regionserver.TestExplicitColumnTracker
Tests run: 4, Failures: 0, Errors: 0, Skipped: 0, Time elapsed: 0.875 sec
Forking command line: /bin/sh -c cd <https://builds.apache.org/job/HBase-0.92/ws/trunk>
&& /home/hudson/tools/java/jdk1.6.0_27-32/jre/bin/java -enableassertions -Xmx1400m
-Djava.security.egd=file:/dev/./urandom -jar <https://builds.apache.org/job/HBase-0.92/ws/trunk/target/surefire/surefirebooter5465367209921951055.jar>
<https://builds.apache.org/job/HBase-0.92/ws/trunk/target/surefire/surefire4473813401973686059tmp>
<https://builds.apache.org/job/HBase-0.92/ws/trunk/target/surefire/surefire5104987739387320930tmp>
Running org.apache.hadoop.hbase.regionserver.TestHRegionServerBulkLoad
Tests run: 1, Failures: 0, Errors: 0, Skipped: 0, Time elapsed: 51.962 sec
Forking command line: /bin/sh -c cd <https://builds.apache.org/job/HBase-0.92/ws/trunk>
&& /home/hudson/tools/java/jdk1.6.0_27-32/jre/bin/java -enableassertions -Xmx1400m
-Djava.security.egd=file:/dev/./urandom -jar <https://builds.apache.org/job/HBase-0.92/ws/trunk/target/surefire/surefirebooter7855515463669065767.jar>
<https://builds.apache.org/job/HBase-0.92/ws/trunk/target/surefire/surefire7056184874806130448tmp>
<https://builds.apache.org/job/HBase-0.92/ws/trunk/target/surefire/surefire2888064390655804657tmp>
Running org.apache.hadoop.hbase.regionserver.TestMemStoreLAB
Tests run: 3, Failures: 0, Errors: 0, Skipped: 0, Time elapsed: 1.392 sec
Forking command line: /bin/sh -c cd <https://builds.apache.org/job/HBase-0.92/ws/trunk>
&& /home/hudson/tools/java/jdk1.6.0_27-32/jre/bin/java -enableassertions -Xmx1400m
-Djava.security.egd=file:/dev/./urandom -jar <https://builds.apache.org/job/HBase-0.92/ws/trunk/target/surefire/surefirebooter4849750187346169601.jar>
<https://builds.apache.org/job/HBase-0.92/ws/trunk/target/surefire/surefire1753900279169399170tmp>
<https://builds.apache.org/job/HBase-0.92/ws/trunk/target/surefire/surefire2324625671227586224tmp>
Running org.apache.hadoop.hbase.regionserver.TestSplitLogWorker
Tests run: 5, Failures: 0, Errors: 0, Skipped: 0, Time elapsed: 2.573 sec
Forking command line: /bin/sh -c cd <https://builds.apache.org/job/HBase-0.92/ws/trunk>
&& /home/hudson/tools/java/jdk1.6.0_27-32/jre/bin/java -enableassertions -Xmx1400m
-Djava.security.egd=file:/dev/./urandom -jar <https://builds.apache.org/job/HBase-0.92/ws/trunk/target/surefire/surefirebooter4134242870280357081.jar>
<https://builds.apache.org/job/HBase-0.92/ws/trunk/target/surefire/surefire1145835970461428308tmp>
<https://builds.apache.org/job/HBase-0.92/ws/trunk/target/surefire/surefire4923085912947137680tmp>
Running org.apache.hadoop.hbase.regionserver.TestMultiColumnScanner
Tests run: 6, Failures: 0, Errors: 0, Skipped: 0, Time elapsed: 18.842 sec
Forking command line: /bin/sh -c cd <https://builds.apache.org/job/HBase-0.92/ws/trunk>
&& /home/hudson/tools/java/jdk1.6.0_27-32/jre/bin/java -enableassertions -Xmx1400m
-Djava.security.egd=file:/dev/./urandom -jar <https://builds.apache.org/job/HBase-0.92/ws/trunk/target/surefire/surefirebooter4491723938347434158.jar>
<https://builds.apache.org/job/HBase-0.92/ws/trunk/target/surefire/surefire8844248865000615918tmp>
<https://builds.apache.org/job/HBase-0.92/ws/trunk/target/surefire/surefire7761928967114677440tmp>
Running org.apache.hadoop.hbase.regionserver.TestSplitTransaction
Tests run: 6, Failures: 0, Errors: 0, Skipped: 0, Time elapsed: 4.016 sec
Forking command line: /bin/sh -c cd <https://builds.apache.org/job/HBase-0.92/ws/trunk>
&& /home/hudson/tools/java/jdk1.6.0_27-32/jre/bin/java -enableassertions -Xmx1400m
-Djava.security.egd=file:/dev/./urandom -jar <https://builds.apache.org/job/HBase-0.92/ws/trunk/target/surefire/surefirebooter292097285377227008.jar>
<https://builds.apache.org/job/HBase-0.92/ws/trunk/target/surefire/surefire6578907377476031814tmp>
<https://builds.apache.org/job/HBase-0.92/ws/trunk/target/surefire/surefire7772534116867721872tmp>
Running org.apache.hadoop.hbase.regionserver.TestCompoundBloomFilter
Tests run: 3, Failures: 0, Errors: 0, Skipped: 0, Time elapsed: 21.074 sec
Forking command line: /bin/sh -c cd <https://builds.apache.org/job/HBase-0.92/ws/trunk>
&& /home/hudson/tools/java/jdk1.6.0_27-32/jre/bin/java -enableassertions -Xmx1400m
-Djava.security.egd=file:/dev/./urandom -jar <https://builds.apache.org/job/HBase-0.92/ws/trunk/target/surefire/surefirebooter8507051652225618503.jar>
<https://builds.apache.org/job/HBase-0.92/ws/trunk/target/surefire/surefire906878051723168130tmp>
<https://builds.apache.org/job/HBase-0.92/ws/trunk/target/surefire/surefire1629237938092265399tmp>
Running org.apache.hadoop.hbase.regionserver.TestEndToEndSplitTransaction
Tests run: 1, Failures: 0, Errors: 0, Skipped: 0, Time elapsed: 51.269 sec
Forking command line: /bin/sh -c cd <https://builds.apache.org/job/HBase-0.92/ws/trunk>
&& /home/hudson/tools/java/jdk1.6.0_27-32/jre/bin/java -enableassertions -Xmx1400m
-Djava.security.egd=file:/dev/./urandom -jar <https://builds.apache.org/job/HBase-0.92/ws/trunk/target/surefire/surefirebooter1079150755868834739.jar>
<https://builds.apache.org/job/HBase-0.92/ws/trunk/target/surefire/surefire4425951739760302040tmp>
<https://builds.apache.org/job/HBase-0.92/ws/trunk/target/surefire/surefire2052568113003196386tmp>
Running org.apache.hadoop.hbase.regionserver.TestWideScanner
Tests run: 1, Failures: 0, Errors: 0, Skipped: 0, Time elapsed: 1.993 sec
Forking command line: /bin/sh -c cd <https://builds.apache.org/job/HBase-0.92/ws/trunk>
&& /home/hudson/tools/java/jdk1.6.0_27-32/jre/bin/java -enableassertions -Xmx1400m
-Djava.security.egd=file:/dev/./urandom -jar <https://builds.apache.org/job/HBase-0.92/ws/trunk/target/surefire/surefirebooter7864382903814340412.jar>
<https://builds.apache.org/job/HBase-0.92/ws/trunk/target/surefire/surefire3419493515608916592tmp>
<https://builds.apache.org/job/HBase-0.92/ws/trunk/target/surefire/surefire3435555847652752813tmp>
Running org.apache.hadoop.hbase.regionserver.TestHRegion
Tests run: 60, Failures: 0, Errors: 0, Skipped: 0, Time elapsed: 44.241 sec
Forking command line: /bin/sh -c cd <https://builds.apache.org/job/HBase-0.92/ws/trunk>
&& /home/hudson/tools/java/jdk1.6.0_27-32/jre/bin/java -enableassertions -Xmx1400m
-Djava.security.egd=file:/dev/./urandom -jar <https://builds.apache.org/job/HBase-0.92/ws/trunk/target/surefire/surefirebooter4759615800383690892.jar>
<https://builds.apache.org/job/HBase-0.92/ws/trunk/target/surefire/surefire4305854353293264442tmp>
<https://builds.apache.org/job/HBase-0.92/ws/trunk/target/surefire/surefire8170652771610818259tmp>
Running org.apache.hadoop.hbase.regionserver.TestMinVersions
Tests run: 6, Failures: 0, Errors: 0, Skipped: 0, Time elapsed: 1.266 sec
Forking command line: /bin/sh -c cd <https://builds.apache.org/job/HBase-0.92/ws/trunk>
&& /home/hudson/tools/java/jdk1.6.0_27-32/jre/bin/java -enableassertions -Xmx1400m
-Djava.security.egd=file:/dev/./urandom -jar <https://builds.apache.org/job/HBase-0.92/ws/trunk/target/surefire/surefirebooter7172797817018896027.jar>
<https://builds.apache.org/job/HBase-0.92/ws/trunk/target/surefire/surefire1392925869955843559tmp>
<https://builds.apache.org/job/HBase-0.92/ws/trunk/target/surefire/surefire7138104188739461308tmp>
Running org.apache.hadoop.hbase.client.TestGet
Tests run: 2, Failures: 0, Errors: 0, Skipped: 0, Time elapsed: 0.138 sec
Forking command line: /bin/sh -c cd <https://builds.apache.org/job/HBase-0.92/ws/trunk>
&& /home/hudson/tools/java/jdk1.6.0_27-32/jre/bin/java -enableassertions -Xmx1400m
-Djava.security.egd=file:/dev/./urandom -jar <https://builds.apache.org/job/HBase-0.92/ws/trunk/target/surefire/surefirebooter6364166223491263527.jar>
<https://builds.apache.org/job/HBase-0.92/ws/trunk/target/surefire/surefire6635316675384740139tmp>
<https://builds.apache.org/job/HBase-0.92/ws/trunk/target/surefire/surefire2204371227151394436tmp>
Running org.apache.hadoop.hbase.client.TestAttributes
Tests run: 3, Failures: 0, Errors: 0, Skipped: 0, Time elapsed: 0.141 sec
Forking command line: /bin/sh -c cd <https://builds.apache.org/job/HBase-0.92/ws/trunk>
&& /home/hudson/tools/java/jdk1.6.0_27-32/jre/bin/java -enableassertions -Xmx1400m
-Djava.security.egd=file:/dev/./urandom -jar <https://builds.apache.org/job/HBase-0.92/ws/trunk/target/surefire/surefirebooter4664312952598236316.jar>
<https://builds.apache.org/job/HBase-0.92/ws/trunk/target/surefire/surefire6189340451573900885tmp>
<https://builds.apache.org/job/HBase-0.92/ws/trunk/target/surefire/surefire5064448787318839368tmp>
Running org.apache.hadoop.hbase.client.TestResult
Tests run: 3, Failures: 0, Errors: 0, Skipped: 0, Time elapsed: 0.144 sec
Forking command line: /bin/sh -c cd <https://builds.apache.org/job/HBase-0.92/ws/trunk>
&& /home/hudson/tools/java/jdk1.6.0_27-32/jre/bin/java -enableassertions -Xmx1400m
-Djava.security.egd=file:/dev/./urandom -jar <https://builds.apache.org/job/HBase-0.92/ws/trunk/target/surefire/surefirebooter6559702390118798447.jar>
<https://builds.apache.org/job/HBase-0.92/ws/trunk/target/surefire/surefire5416013435888024940tmp>
<https://builds.apache.org/job/HBase-0.92/ws/trunk/target/surefire/surefire6792546283417561459tmp>
Running org.apache.hadoop.hbase.client.replication.TestReplicationAdmin
Tests run: 1, Failures: 0, Errors: 0, Skipped: 0, Time elapsed: 1.072 sec
Forking command line: /bin/sh -c cd <https://builds.apache.org/job/HBase-0.92/ws/trunk>
&& /home/hudson/tools/java/jdk1.6.0_27-32/jre/bin/java -enableassertions -Xmx1400m
-Djava.security.egd=file:/dev/./urandom -jar <https://builds.apache.org/job/HBase-0.92/ws/trunk/target/surefire/surefirebooter1040096361744729628.jar>
<https://builds.apache.org/job/HBase-0.92/ws/trunk/target/surefire/surefire8136907462021338265tmp>
<https://builds.apache.org/job/HBase-0.92/ws/trunk/target/surefire/surefire5842397361417007049tmp>
Running org.apache.hadoop.hbase.client.TestTimestampsFilter
Tests run: 3, Failures: 0, Errors: 0, Skipped: 0, Time elapsed: 36.475 sec
Forking command line: /bin/sh -c cd <https://builds.apache.org/job/HBase-0.92/ws/trunk>
&& /home/hudson/tools/java/jdk1.6.0_27-32/jre/bin/java -enableassertions -Xmx1400m
-Djava.security.egd=file:/dev/./urandom -jar <https://builds.apache.org/job/HBase-0.92/ws/trunk/target/surefire/surefirebooter282561058920369847.jar>
<https://builds.apache.org/job/HBase-0.92/ws/trunk/target/surefire/surefire5454387312838079393tmp>
<https://builds.apache.org/job/HBase-0.92/ws/trunk/target/surefire/surefire4062966894320178408tmp>
Running org.apache.hadoop.hbase.client.TestMultipleTimestamps
Tests run: 8, Failures: 0, Errors: 0, Skipped: 0, Time elapsed: 69.987 sec
Forking command line: /bin/sh -c cd <https://builds.apache.org/job/HBase-0.92/ws/trunk>
&& /home/hudson/tools/java/jdk1.6.0_27-32/jre/bin/java -enableassertions -Xmx1400m
-Djava.security.egd=file:/dev/./urandom -jar <https://builds.apache.org/job/HBase-0.92/ws/trunk/target/surefire/surefirebooter6225309521183390586.jar>
<https://builds.apache.org/job/HBase-0.92/ws/trunk/target/surefire/surefire3950826449131636987tmp>
<https://builds.apache.org/job/HBase-0.92/ws/trunk/target/surefire/surefire6255409618265414028tmp>
Running org.apache.hadoop.hbase.client.TestFromClientSide
Tests run: 46, Failures: 0, Errors: 0, Skipped: 3, Time elapsed: 179.963 sec
Forking command line: /bin/sh -c cd <https://builds.apache.org/job/HBase-0.92/ws/trunk>
&& /home/hudson/tools/java/jdk1.6.0_27-32/jre/bin/java -enableassertions -Xmx1400m
-Djava.security.egd=file:/dev/./urandom -jar <https://builds.apache.org/job/HBase-0.92/ws/trunk/target/surefire/surefirebooter9007639073153707300.jar>
<https://builds.apache.org/job/HBase-0.92/ws/trunk/target/surefire/surefire3699153794756344340tmp>
<https://builds.apache.org/job/HBase-0.92/ws/trunk/target/surefire/surefire936103424093271667tmp>
Running org.apache.hadoop.hbase.client.TestHCM
Tests run: 5, Failures: 0, Errors: 0, Skipped: 0, Time elapsed: 25.243 sec
Forking command line: /bin/sh -c cd <https://builds.apache.org/job/HBase-0.92/ws/trunk>
&& /home/hudson/tools/java/jdk1.6.0_27-32/jre/bin/java -enableassertions -Xmx1400m
-Djava.security.egd=file:/dev/./urandom -jar <https://builds.apache.org/job/HBase-0.92/ws/trunk/target/surefire/surefirebooter3148038419485894382.jar>
<https://builds.apache.org/job/HBase-0.92/ws/trunk/target/surefire/surefire123038907343239274tmp>
<https://builds.apache.org/job/HBase-0.92/ws/trunk/target/surefire/surefire4196910937621200021tmp>
Running org.apache.hadoop.hbase.client.TestHTablePool
Tests run: 18, Failures: 0, Errors: 0, Skipped: 0, Time elapsed: 33.239 sec
Forking command line: /bin/sh -c cd <https://builds.apache.org/job/HBase-0.92/ws/trunk>
&& /home/hudson/tools/java/jdk1.6.0_27-32/jre/bin/java -enableassertions -Xmx1400m
-Djava.security.egd=file:/dev/./urandom -jar <https://builds.apache.org/job/HBase-0.92/ws/trunk/target/surefire/surefirebooter31789366038454938.jar>
<https://builds.apache.org/job/HBase-0.92/ws/trunk/target/surefire/surefire4925614777607476408tmp>
<https://builds.apache.org/job/HBase-0.92/ws/trunk/target/surefire/surefire5776216124042153444tmp>
Running org.apache.hadoop.hbase.client.TestHTableUtil
Tests run: 2, Failures: 0, Errors: 0, Skipped: 0, Time elapsed: 23.966 sec
Forking command line: /bin/sh -c cd <https://builds.apache.org/job/HBase-0.92/ws/trunk>
&& /home/hudson/tools/java/jdk1.6.0_27-32/jre/bin/java -enableassertions -Xmx1400m
-Djava.security.egd=file:/dev/./urandom -jar <https://builds.apache.org/job/HBase-0.92/ws/trunk/target/surefire/surefirebooter6443436897996195657.jar>
<https://builds.apache.org/job/HBase-0.92/ws/trunk/target/surefire/surefire3738153215923540196tmp>
<https://builds.apache.org/job/HBase-0.92/ws/trunk/target/surefire/surefire5175392305346843866tmp>
Running org.apache.hadoop.hbase.client.TestScan
Tests run: 2, Failures: 0, Errors: 0, Skipped: 0, Time elapsed: 0.141 sec
Forking command line: /bin/sh -c cd <https://builds.apache.org/job/HBase-0.92/ws/trunk>
&& /home/hudson/tools/java/jdk1.6.0_27-32/jre/bin/java -enableassertions -Xmx1400m
-Djava.security.egd=file:/dev/./urandom -jar <https://builds.apache.org/job/HBase-0.92/ws/trunk/target/surefire/surefirebooter1931828692942265114.jar>
<https://builds.apache.org/job/HBase-0.92/ws/trunk/target/surefire/surefire1786638654296004881tmp>
<https://builds.apache.org/job/HBase-0.92/ws/trunk/target/surefire/surefire9048952550209237556tmp>
Running org.apache.hadoop.hbase.client.TestAdmin
Tests run: 34, Failures: 0, Errors: 0, Skipped: 0, Time elapsed: 518.116 sec
Forking command line: /bin/sh -c cd <https://builds.apache.org/job/HBase-0.92/ws/trunk>
&& /home/hudson/tools/java/jdk1.6.0_27-32/jre/bin/java -enableassertions -Xmx1400m
-Djava.security.egd=file:/dev/./urandom -jar <https://builds.apache.org/job/HBase-0.92/ws/trunk/target/surefire/surefirebooter469030393676643835.jar>
<https://builds.apache.org/job/HBase-0.92/ws/trunk/target/surefire/surefire6811155173022093465tmp>
<https://builds.apache.org/job/HBase-0.92/ws/trunk/target/surefire/surefire4480748730634590199tmp>
Running org.apache.hadoop.hbase.client.TestMetaScanner
Tests run: 1, Failures: 0, Errors: 0, Skipped: 0, Time elapsed: 24.346 sec
Forking command line: /bin/sh -c cd <https://builds.apache.org/job/HBase-0.92/ws/trunk>
&& /home/hudson/tools/java/jdk1.6.0_27-32/jre/bin/java -enableassertions -Xmx1400m
-Djava.security.egd=file:/dev/./urandom -jar <https://builds.apache.org/job/HBase-0.92/ws/trunk/target/surefire/surefirebooter2168225892319843921.jar>
<https://builds.apache.org/job/HBase-0.92/ws/trunk/target/surefire/surefire2159478905309572904tmp>
<https://builds.apache.org/job/HBase-0.92/ws/trunk/target/surefire/surefire3179032078476246328tmp>
Running org.apache.hadoop.hbase.client.TestShell
Tests run: 1, Failures: 0, Errors: 0, Skipped: 0, Time elapsed: 101.652 sec
Forking command line: /bin/sh -c cd <https://builds.apache.org/job/HBase-0.92/ws/trunk>
&& /home/hudson/tools/java/jdk1.6.0_27-32/jre/bin/java -enableassertions -Xmx1400m
-Djava.security.egd=file:/dev/./urandom -jar <https://builds.apache.org/job/HBase-0.92/ws/trunk/target/surefire/surefirebooter5365137183174191834.jar>
<https://builds.apache.org/job/HBase-0.92/ws/trunk/target/surefire/surefire8210087483293932048tmp>
<https://builds.apache.org/job/HBase-0.92/ws/trunk/target/surefire/surefire2417278325209236375tmp>
Running org.apache.hadoop.hbase.client.TestScannerTimeout
Tests run: 4, Failures: 0, Errors: 0, Skipped: 0, Time elapsed: 58.575 sec
Forking command line: /bin/sh -c cd <https://builds.apache.org/job/HBase-0.92/ws/trunk>
&& /home/hudson/tools/java/jdk1.6.0_27-32/jre/bin/java -enableassertions -Xmx1400m
-Djava.security.egd=file:/dev/./urandom -jar <https://builds.apache.org/job/HBase-0.92/ws/trunk/target/surefire/surefirebooter5229356351803351736.jar>
<https://builds.apache.org/job/HBase-0.92/ws/trunk/target/surefire/surefire7305299353066950735tmp>
<https://builds.apache.org/job/HBase-0.92/ws/trunk/target/surefire/surefire2579227548303989111tmp>
Running org.apache.hadoop.hbase.client.TestMetaMigrationRemovingHTD
Tests run: 3, Failures: 0, Errors: 0, Skipped: 0, Time elapsed: 31.049 sec
Forking command line: /bin/sh -c cd <https://builds.apache.org/job/HBase-0.92/ws/trunk>
&& /home/hudson/tools/java/jdk1.6.0_27-32/jre/bin/java -enableassertions -Xmx1400m
-Djava.security.egd=file:/dev/./urandom -jar <https://builds.apache.org/job/HBase-0.92/ws/trunk/target/surefire/surefirebooter1220797616690366935.jar>
<https://builds.apache.org/job/HBase-0.92/ws/trunk/target/surefire/surefire731264515046019945tmp>
<https://builds.apache.org/job/HBase-0.92/ws/trunk/target/surefire/surefire8182882950458144846tmp>
Running org.apache.hadoop.hbase.client.TestOperation
Tests run: 1, Failures: 0, Errors: 0, Skipped: 0, Time elapsed: 0.575 sec
Forking command line: /bin/sh -c cd <https://builds.apache.org/job/HBase-0.92/ws/trunk>
&& /home/hudson/tools/java/jdk1.6.0_27-32/jre/bin/java -enableassertions -Xmx1400m
-Djava.security.egd=file:/dev/./urandom -jar <https://builds.apache.org/job/HBase-0.92/ws/trunk/target/surefire/surefirebooter7271376586194992870.jar>
<https://builds.apache.org/job/HBase-0.92/ws/trunk/target/surefire/surefire4892167886818312474tmp>
<https://builds.apache.org/job/HBase-0.92/ws/trunk/target/surefire/surefire6727493912434244452tmp>
Running org.apache.hadoop.hbase.client.TestMultiParallel
Tests run: 10, Failures: 0, Errors: 0, Skipped: 0, Time elapsed: 65.774 sec
Forking command line: /bin/sh -c cd <https://builds.apache.org/job/HBase-0.92/ws/trunk>
&& /home/hudson/tools/java/jdk1.6.0_27-32/jre/bin/java -enableassertions -Xmx1400m
-Djava.security.egd=file:/dev/./urandom -jar <https://builds.apache.org/job/HBase-0.92/ws/trunk/target/surefire/surefirebooter5480628531246094968.jar>
<https://builds.apache.org/job/HBase-0.92/ws/trunk/target/surefire/surefire5274939988045263430tmp>
<https://builds.apache.org/job/HBase-0.92/ws/trunk/target/surefire/surefire6141245530547216577tmp>
Running org.apache.hadoop.hbase.TestMultiVersions
Tests run: 3, Failures: 0, Errors: 0, Skipped: 0, Time elapsed: 53.337 sec
Forking command line: /bin/sh -c cd <https://builds.apache.org/job/HBase-0.92/ws/trunk>
&& /home/hudson/tools/java/jdk1.6.0_27-32/jre/bin/java -enableassertions -Xmx1400m
-Djava.security.egd=file:/dev/./urandom -jar <https://builds.apache.org/job/HBase-0.92/ws/trunk/target/surefire/surefirebooter2381844378251302778.jar>
<https://builds.apache.org/job/HBase-0.92/ws/trunk/target/surefire/surefire7737330401103650732tmp>
<https://builds.apache.org/job/HBase-0.92/ws/trunk/target/surefire/surefire3367795621772734318tmp>
Running org.apache.hadoop.hbase.thrift.TestThriftServer
Tests run: 1, Failures: 0, Errors: 0, Skipped: 0, Time elapsed: 56.222 sec
Forking command line: /bin/sh -c cd <https://builds.apache.org/job/HBase-0.92/ws/trunk>
&& /home/hudson/tools/java/jdk1.6.0_27-32/jre/bin/java -enableassertions -Xmx1400m
-Djava.security.egd=file:/dev/./urandom -jar <https://builds.apache.org/job/HBase-0.92/ws/trunk/target/surefire/surefirebooter5478003813457662010.jar>
<https://builds.apache.org/job/HBase-0.92/ws/trunk/target/surefire/surefire8176196106726172922tmp>
<https://builds.apache.org/job/HBase-0.92/ws/trunk/target/surefire/surefire5979160939431995112tmp>
Running org.apache.hadoop.hbase.master.TestRollingRestart
Tests run: 1, Failures: 0, Errors: 0, Skipped: 0, Time elapsed: 204.319 sec
Forking command line: /bin/sh -c cd <https://builds.apache.org/job/HBase-0.92/ws/trunk>
&& /home/hudson/tools/java/jdk1.6.0_27-32/jre/bin/java -enableassertions -Xmx1400m
-Djava.security.egd=file:/dev/./urandom -jar <https://builds.apache.org/job/HBase-0.92/ws/trunk/target/surefire/surefirebooter2296379762902543495.jar>
<https://builds.apache.org/job/HBase-0.92/ws/trunk/target/surefire/surefire4618524112282989408tmp>
<https://builds.apache.org/job/HBase-0.92/ws/trunk/target/surefire/surefire1629520988343026448tmp>
Running org.apache.hadoop.hbase.master.TestActiveMasterManager
Tests run: 2, Failures: 0, Errors: 0, Skipped: 0, Time elapsed: 1.107 sec
Forking command line: /bin/sh -c cd <https://builds.apache.org/job/HBase-0.92/ws/trunk>
&& /home/hudson/tools/java/jdk1.6.0_27-32/jre/bin/java -enableassertions -Xmx1400m
-Djava.security.egd=file:/dev/./urandom -jar <https://builds.apache.org/job/HBase-0.92/ws/trunk/target/surefire/surefirebooter2866312203234608224.jar>
<https://builds.apache.org/job/HBase-0.92/ws/trunk/target/surefire/surefire2223301527121966028tmp>
<https://builds.apache.org/job/HBase-0.92/ws/trunk/target/surefire/surefire2481207616302769130tmp>
Running org.apache.hadoop.hbase.master.TestDeadServer
Tests run: 1, Failures: 0, Errors: 0, Skipped: 0, Time elapsed: 0.138 sec
Forking command line: /bin/sh -c cd <https://builds.apache.org/job/HBase-0.92/ws/trunk>
&& /home/hudson/tools/java/jdk1.6.0_27-32/jre/bin/java -enableassertions -Xmx1400m
-Djava.security.egd=file:/dev/./urandom -jar <https://builds.apache.org/job/HBase-0.92/ws/trunk/target/surefire/surefirebooter7655690497048207063.jar>
<https://builds.apache.org/job/HBase-0.92/ws/trunk/target/surefire/surefire2438558033694270875tmp>
<https://builds.apache.org/job/HBase-0.92/ws/trunk/target/surefire/surefire8667997901507405762tmp>
Running org.apache.hadoop.hbase.master.TestLogsCleaner
Tests run: 1, Failures: 0, Errors: 0, Skipped: 0, Time elapsed: 3.272 sec
Forking command line: /bin/sh -c cd <https://builds.apache.org/job/HBase-0.92/ws/trunk>
&& /home/hudson/tools/java/jdk1.6.0_27-32/jre/bin/java -enableassertions -Xmx1400m
-Djava.security.egd=file:/dev/./urandom -jar <https://builds.apache.org/job/HBase-0.92/ws/trunk/target/surefire/surefirebooter2878925820274009031.jar>
<https://builds.apache.org/job/HBase-0.92/ws/trunk/target/surefire/surefire2185700906339236467tmp>
<https://builds.apache.org/job/HBase-0.92/ws/trunk/target/surefire/surefire7019294857070996918tmp>
Running org.apache.hadoop.hbase.master.TestZKBasedOpenCloseRegion
Tests run: 3, Failures: 0, Errors: 0, Skipped: 0, Time elapsed: 35.047 sec
Forking command line: /bin/sh -c cd <https://builds.apache.org/job/HBase-0.92/ws/trunk>
&& /home/hudson/tools/java/jdk1.6.0_27-32/jre/bin/java -enableassertions -Xmx1400m
-Djava.security.egd=file:/dev/./urandom -jar <https://builds.apache.org/job/HBase-0.92/ws/trunk/target/surefire/surefirebooter5870398060812721734.jar>
<https://builds.apache.org/job/HBase-0.92/ws/trunk/target/surefire/surefire515898532807726999tmp>
<https://builds.apache.org/job/HBase-0.92/ws/trunk/target/surefire/surefire7031169682714899349tmp>
Running org.apache.hadoop.hbase.master.TestMaster
Tests run: 1, Failures: 0, Errors: 0, Skipped: 0, Time elapsed: 27.609 sec
Forking command line: /bin/sh -c cd <https://builds.apache.org/job/HBase-0.92/ws/trunk>
&& /home/hudson/tools/java/jdk1.6.0_27-32/jre/bin/java -enableassertions -Xmx1400m
-Djava.security.egd=file:/dev/./urandom -jar <https://builds.apache.org/job/HBase-0.92/ws/trunk/target/surefire/surefirebooter8428967184777822076.jar>
<https://builds.apache.org/job/HBase-0.92/ws/trunk/target/surefire/surefire2195264838785580533tmp>
<https://builds.apache.org/job/HBase-0.92/ws/trunk/target/surefire/surefire8553217887486365239tmp>
Running org.apache.hadoop.hbase.master.TestMasterTransitions
Tests run: 3, Failures: 0, Errors: 0, Skipped: 3, Time elapsed: 35.724 sec
Forking command line: /bin/sh -c cd <https://builds.apache.org/job/HBase-0.92/ws/trunk>
&& /home/hudson/tools/java/jdk1.6.0_27-32/jre/bin/java -enableassertions -Xmx1400m
-Djava.security.egd=file:/dev/./urandom -jar <https://builds.apache.org/job/HBase-0.92/ws/trunk/target/surefire/surefirebooter7209605994362923069.jar>
<https://builds.apache.org/job/HBase-0.92/ws/trunk/target/surefire/surefire6956947989060844840tmp>
<https://builds.apache.org/job/HBase-0.92/ws/trunk/target/surefire/surefire1570964930152494840tmp>
Running org.apache.hadoop.hbase.master.TestOpenedRegionHandler
Tests run: 2, Failures: 0, Errors: 0, Skipped: 0, Time elapsed: 26.833 sec
Forking command line: /bin/sh -c cd <https://builds.apache.org/job/HBase-0.92/ws/trunk>
&& /home/hudson/tools/java/jdk1.6.0_27-32/jre/bin/java -enableassertions -Xmx1400m
-Djava.security.egd=file:/dev/./urandom -jar <https://builds.apache.org/job/HBase-0.92/ws/trunk/target/surefire/surefirebooter2801545197005837034.jar>
<https://builds.apache.org/job/HBase-0.92/ws/trunk/target/surefire/surefire4745445611379608502tmp>
<https://builds.apache.org/job/HBase-0.92/ws/trunk/target/surefire/surefire5729587482588441194tmp>
Running org.apache.hadoop.hbase.master.TestClockSkewDetection
Tests run: 1, Failures: 0, Errors: 0, Skipped: 0, Time elapsed: 0.246 sec
Forking command line: /bin/sh -c cd <https://builds.apache.org/job/HBase-0.92/ws/trunk>
&& /home/hudson/tools/java/jdk1.6.0_27-32/jre/bin/java -enableassertions -Xmx1400m
-Djava.security.egd=file:/dev/./urandom -jar <https://builds.apache.org/job/HBase-0.92/ws/trunk/target/surefire/surefirebooter8425992272640775783.jar>
<https://builds.apache.org/job/HBase-0.92/ws/trunk/target/surefire/surefire2298748710611380050tmp>
<https://builds.apache.org/job/HBase-0.92/ws/trunk/target/surefire/surefire2130718491305860550tmp>
Running org.apache.hadoop.hbase.master.TestCatalogJanitor
Tests run: 4, Failures: 0, Errors: 0, Skipped: 0, Time elapsed: 7.389 sec
Forking command line: /bin/sh -c cd <https://builds.apache.org/job/HBase-0.92/ws/trunk>
&& /home/hudson/tools/java/jdk1.6.0_27-32/jre/bin/java -enableassertions -Xmx1400m
-Djava.security.egd=file:/dev/./urandom -jar <https://builds.apache.org/job/HBase-0.92/ws/trunk/target/surefire/surefirebooter2202547004199277917.jar>
<https://builds.apache.org/job/HBase-0.92/ws/trunk/target/surefire/surefire5828923043680777534tmp>
<https://builds.apache.org/job/HBase-0.92/ws/trunk/target/surefire/surefire1257439272045145744tmp>
Running org.apache.hadoop.hbase.master.TestSplitLogManager
Tests run: 10, Failures: 0, Errors: 0, Skipped: 0, Time elapsed: 15.425 sec
Forking command line: /bin/sh -c cd <https://builds.apache.org/job/HBase-0.92/ws/trunk>
&& /home/hudson/tools/java/jdk1.6.0_27-32/jre/bin/java -enableassertions -Xmx1400m
-Djava.security.egd=file:/dev/./urandom -jar <https://builds.apache.org/job/HBase-0.92/ws/trunk/target/surefire/surefirebooter7917676798096283266.jar>
<https://builds.apache.org/job/HBase-0.92/ws/trunk/target/surefire/surefire6289246525147184516tmp>
<https://builds.apache.org/job/HBase-0.92/ws/trunk/target/surefire/surefire8871995992796363813tmp>
Running org.apache.hadoop.hbase.master.TestMasterRestartAfterDisablingTable
Tests run: 1, Failures: 0, Errors: 0, Skipped: 0, Time elapsed: 30.903 sec
Forking command line: /bin/sh -c cd <https://builds.apache.org/job/HBase-0.92/ws/trunk>
&& /home/hudson/tools/java/jdk1.6.0_27-32/jre/bin/java -enableassertions -Xmx1400m
-Djava.security.egd=file:/dev/./urandom -jar <https://builds.apache.org/job/HBase-0.92/ws/trunk/target/surefire/surefirebooter5293512242558705847.jar>
<https://builds.apache.org/job/HBase-0.92/ws/trunk/target/surefire/surefire6231178066303175936tmp>
<https://builds.apache.org/job/HBase-0.92/ws/trunk/target/surefire/surefire4496683761168430196tmp>
Running org.apache.hadoop.hbase.master.TestDistributedLogSplitting
Tests run: 4, Failures: 0, Errors: 0, Skipped: 0, Time elapsed: 197.837 sec
Forking command line: /bin/sh -c cd <https://builds.apache.org/job/HBase-0.92/ws/trunk>
&& /home/hudson/tools/java/jdk1.6.0_27-32/jre/bin/java -enableassertions -Xmx1400m
-Djava.security.egd=file:/dev/./urandom -jar <https://builds.apache.org/job/HBase-0.92/ws/trunk/target/surefire/surefirebooter7831764069105750142.jar>
<https://builds.apache.org/job/HBase-0.92/ws/trunk/target/surefire/surefire1308458257899152121tmp>
<https://builds.apache.org/job/HBase-0.92/ws/trunk/target/surefire/surefire2747760679314825314tmp>
Running org.apache.hadoop.hbase.master.TestDefaultLoadBalancer
Tests run: 4, Failures: 0, Errors: 0, Skipped: 0, Time elapsed: 1.43 sec
Forking command line: /bin/sh -c cd <https://builds.apache.org/job/HBase-0.92/ws/trunk>
&& /home/hudson/tools/java/jdk1.6.0_27-32/jre/bin/java -enableassertions -Xmx1400m
-Djava.security.egd=file:/dev/./urandom -jar <https://builds.apache.org/job/HBase-0.92/ws/trunk/target/surefire/surefirebooter8120796626583476890.jar>
<https://builds.apache.org/job/HBase-0.92/ws/trunk/target/surefire/surefire1894408932052742521tmp>
<https://builds.apache.org/job/HBase-0.92/ws/trunk/target/surefire/surefire4428889757971604209tmp>
Running org.apache.hadoop.hbase.master.TestMasterStatusServlet
Tests run: 5, Failures: 0, Errors: 0, Skipped: 0, Time elapsed: 1.023 sec
Forking command line: /bin/sh -c cd <https://builds.apache.org/job/HBase-0.92/ws/trunk>
&& /home/hudson/tools/java/jdk1.6.0_27-32/jre/bin/java -enableassertions -Xmx1400m
-Djava.security.egd=file:/dev/./urandom -jar <https://builds.apache.org/job/HBase-0.92/ws/trunk/target/surefire/surefirebooter4561188226822404871.jar>
<https://builds.apache.org/job/HBase-0.92/ws/trunk/target/surefire/surefire5008913874637815270tmp>
<https://builds.apache.org/job/HBase-0.92/ws/trunk/target/surefire/surefire8408187227683097076tmp>
Running org.apache.hadoop.hbase.master.TestHMasterRPCException
Tests run: 1, Failures: 0, Errors: 0, Skipped: 0, Time elapsed: 1.392 sec
Forking command line: /bin/sh -c cd <https://builds.apache.org/job/HBase-0.92/ws/trunk>
&& /home/hudson/tools/java/jdk1.6.0_27-32/jre/bin/java -enableassertions -Xmx1400m
-Djava.security.egd=file:/dev/./urandom -jar <https://builds.apache.org/job/HBase-0.92/ws/trunk/target/surefire/surefirebooter3031708084777515768.jar>
<https://builds.apache.org/job/HBase-0.92/ws/trunk/target/surefire/surefire8314134362649804180tmp>
<https://builds.apache.org/job/HBase-0.92/ws/trunk/target/surefire/surefire8215560362622883656tmp>
Running org.apache.hadoop.hbase.master.TestMasterFailover
Tests run: 4, Failures: 0, Errors: 0, Skipped: 0, Time elapsed: 105.955 sec
Forking command line: /bin/sh -c cd <https://builds.apache.org/job/HBase-0.92/ws/trunk>
&& /home/hudson/tools/java/jdk1.6.0_27-32/jre/bin/java -enableassertions -Xmx1400m
-Djava.security.egd=file:/dev/./urandom -jar <https://builds.apache.org/job/HBase-0.92/ws/trunk/target/surefire/surefirebooter8755763050281340400.jar>
<https://builds.apache.org/job/HBase-0.92/ws/trunk/target/surefire/surefire7202933421979821014tmp>
<https://builds.apache.org/job/HBase-0.92/ws/trunk/target/surefire/surefire879852285287399430tmp>
Running org.apache.hadoop.hbase.master.TestRestartCluster
Tests run: 2, Failures: 0, Errors: 0, Skipped: 0, Time elapsed: 57.998 sec
Forking command line: /bin/sh -c cd <https://builds.apache.org/job/HBase-0.92/ws/trunk>
&& /home/hudson/tools/java/jdk1.6.0_27-32/jre/bin/java -enableassertions -Xmx1400m
-Djava.security.egd=file:/dev/./urandom -jar <https://builds.apache.org/job/HBase-0.92/ws/trunk/target/surefire/surefirebooter676861493571911965.jar>
<https://builds.apache.org/job/HBase-0.92/ws/trunk/target/surefire/surefire4112498878856799320tmp>
<https://builds.apache.org/job/HBase-0.92/ws/trunk/target/surefire/surefire4603684201254257385tmp>
Running org.apache.hadoop.hbase.migration.TestMigrationFrom090To092
Tests run: 1, Failures: 0, Errors: 0, Skipped: 0, Time elapsed: 0.273 sec
Forking command line: /bin/sh -c cd <https://builds.apache.org/job/HBase-0.92/ws/trunk>
&& /home/hudson/tools/java/jdk1.6.0_27-32/jre/bin/java -enableassertions -Xmx1400m
-Djava.security.egd=file:/dev/./urandom -jar <https://builds.apache.org/job/HBase-0.92/ws/trunk/target/surefire/surefirebooter5118486632930292371.jar>
<https://builds.apache.org/job/HBase-0.92/ws/trunk/target/surefire/surefire4791345298496697841tmp>
<https://builds.apache.org/job/HBase-0.92/ws/trunk/target/surefire/surefire2328640438128237948tmp>
Running org.apache.hadoop.hbase.TestRegionRebalancing
Tests run: 1, Failures: 0, Errors: 0, Skipped: 0, Time elapsed: 75.359 sec
Forking command line: /bin/sh -c cd <https://builds.apache.org/job/HBase-0.92/ws/trunk>
&& /home/hudson/tools/java/jdk1.6.0_27-32/jre/bin/java -enableassertions -Xmx1400m
-Djava.security.egd=file:/dev/./urandom -jar <https://builds.apache.org/job/HBase-0.92/ws/trunk/target/surefire/surefirebooter1319830348002130382.jar>
<https://builds.apache.org/job/HBase-0.92/ws/trunk/target/surefire/surefire1431795121494562356tmp>
<https://builds.apache.org/job/HBase-0.92/ws/trunk/target/surefire/surefire3208369006708798795tmp>
Running org.apache.hadoop.hbase.avro.TestAvroUtil
Tests run: 1, Failures: 0, Errors: 0, Skipped: 0, Time elapsed: 0.878 sec
Forking command line: /bin/sh -c cd <https://builds.apache.org/job/HBase-0.92/ws/trunk>
&& /home/hudson/tools/java/jdk1.6.0_27-32/jre/bin/java -enableassertions -Xmx1400m
-Djava.security.egd=file:/dev/./urandom -jar <https://builds.apache.org/job/HBase-0.92/ws/trunk/target/surefire/surefirebooter2330479381660806593.jar>
<https://builds.apache.org/job/HBase-0.92/ws/trunk/target/surefire/surefire1950689193750668158tmp>
<https://builds.apache.org/job/HBase-0.92/ws/trunk/target/surefire/surefire526465515039133729tmp>
Running org.apache.hadoop.hbase.avro.TestAvroServer
Tests run: 3, Failures: 0, Errors: 0, Skipped: 0, Time elapsed: 37.942 sec
Forking command line: /bin/sh -c cd <https://builds.apache.org/job/HBase-0.92/ws/trunk>
&& /home/hudson/tools/java/jdk1.6.0_27-32/jre/bin/java -enableassertions -Xmx1400m
-Djava.security.egd=file:/dev/./urandom -jar <https://builds.apache.org/job/HBase-0.92/ws/trunk/target/surefire/surefirebooter8230251600120918874.jar>
<https://builds.apache.org/job/HBase-0.92/ws/trunk/target/surefire/surefire627396638848883088tmp>
<https://builds.apache.org/job/HBase-0.92/ws/trunk/target/surefire/surefire6016509367317462430tmp>
Running org.apache.hadoop.hbase.TestAcidGuarantees
Tests run: 3, Failures: 0, Errors: 0, Skipped: 0, Time elapsed: 124.212 sec
Forking command line: /bin/sh -c cd <https://builds.apache.org/job/HBase-0.92/ws/trunk>
&& /home/hudson/tools/java/jdk1.6.0_27-32/jre/bin/java -enableassertions -Xmx1400m
-Djava.security.egd=file:/dev/./urandom -jar <https://builds.apache.org/job/HBase-0.92/ws/trunk/target/surefire/surefirebooter6774083649019181604.jar>
<https://builds.apache.org/job/HBase-0.92/ws/trunk/target/surefire/surefire981063770460241042tmp>
<https://builds.apache.org/job/HBase-0.92/ws/trunk/target/surefire/surefire4426863163201268808tmp>
Running org.apache.hadoop.hbase.TestHRegionLocation
Tests run: 3, Failures: 0, Errors: 0, Skipped: 0, Time elapsed: 0.143 sec
Forking command line: /bin/sh -c cd <https://builds.apache.org/job/HBase-0.92/ws/trunk>
&& /home/hudson/tools/java/jdk1.6.0_27-32/jre/bin/java -enableassertions -Xmx1400m
-Djava.security.egd=file:/dev/./urandom -jar <https://builds.apache.org/job/HBase-0.92/ws/trunk/target/surefire/surefirebooter8068000346747418575.jar>
<https://builds.apache.org/job/HBase-0.92/ws/trunk/target/surefire/surefire6765864894175974079tmp>
<https://builds.apache.org/job/HBase-0.92/ws/trunk/target/surefire/surefire3893140697986088692tmp>
Running org.apache.hadoop.hbase.TestZooKeeper
Tests run: 7, Failures: 0, Errors: 0, Skipped: 0, Time elapsed: 91.411 sec
Forking command line: /bin/sh -c cd <https://builds.apache.org/job/HBase-0.92/ws/trunk>
&& /home/hudson/tools/java/jdk1.6.0_27-32/jre/bin/java -enableassertions -Xmx1400m
-Djava.security.egd=file:/dev/./urandom -jar <https://builds.apache.org/job/HBase-0.92/ws/trunk/target/surefire/surefirebooter4704958671536497344.jar>
<https://builds.apache.org/job/HBase-0.92/ws/trunk/target/surefire/surefire3902609110117309536tmp>
<https://builds.apache.org/job/HBase-0.92/ws/trunk/target/surefire/surefire7582552009580583507tmp>
Running org.apache.hadoop.hbase.TestCompare
Tests run: 1, Failures: 0, Errors: 0, Skipped: 0, Time elapsed: 0.239 sec
Forking command line: /bin/sh -c cd <https://builds.apache.org/job/HBase-0.92/ws/trunk>
&& /home/hudson/tools/java/jdk1.6.0_27-32/jre/bin/java -enableassertions -Xmx1400m
-Djava.security.egd=file:/dev/./urandom -jar <https://builds.apache.org/job/HBase-0.92/ws/trunk/target/surefire/surefirebooter3926203559735135315.jar>
<https://builds.apache.org/job/HBase-0.92/ws/trunk/target/surefire/surefire2841770593214569281tmp>
<https://builds.apache.org/job/HBase-0.92/ws/trunk/target/surefire/surefire3915829318819344236tmp>
Running org.apache.hadoop.hbase.ipc.TestDelayedRpc
Tests run: 4, Failures: 0, Errors: 0, Skipped: 0, Time elapsed: 2.607 sec
Forking command line: /bin/sh -c cd <https://builds.apache.org/job/HBase-0.92/ws/trunk>
&& /home/hudson/tools/java/jdk1.6.0_27-32/jre/bin/java -enableassertions -Xmx1400m
-Djava.security.egd=file:/dev/./urandom -jar <https://builds.apache.org/job/HBase-0.92/ws/trunk/target/surefire/surefirebooter1480621430549011658.jar>
<https://builds.apache.org/job/HBase-0.92/ws/trunk/target/surefire/surefire2976339790508681182tmp>
<https://builds.apache.org/job/HBase-0.92/ws/trunk/target/surefire/surefire8915610730563280229tmp>
Running org.apache.hadoop.hbase.TestFSTableDescriptorForceCreation
Tests run: 3, Failures: 0, Errors: 0, Skipped: 0, Time elapsed: 0.628 sec
Forking command line: /bin/sh -c cd <https://builds.apache.org/job/HBase-0.92/ws/trunk>
&& /home/hudson/tools/java/jdk1.6.0_27-32/jre/bin/java -enableassertions -Xmx1400m
-Djava.security.egd=file:/dev/./urandom -jar <https://builds.apache.org/job/HBase-0.92/ws/trunk/target/surefire/surefirebooter5780138513925640535.jar>
<https://builds.apache.org/job/HBase-0.92/ws/trunk/target/surefire/surefire6952601451120583153tmp>
<https://builds.apache.org/job/HBase-0.92/ws/trunk/target/surefire/surefire6995124114752616692tmp>
Running org.apache.hadoop.hbase.TestInfoServers
Tests run: 2, Failures: 0, Errors: 0, Skipped: 0, Time elapsed: 20.404 sec

Results :

Failed tests:   queueFailover(org.apache.hadoop.hbase.replication.TestReplication): Waited
too much time for queueFailover replication

Tests run: 1073, Failures: 1, Errors: 0, Skipped: 8

[INFO] ------------------------------------------------------------------------
[INFO] BUILD FAILURE
[INFO] ------------------------------------------------------------------------
[INFO] Total time: 2:09:16.091s
[INFO] Finished at: Sun Dec 18 02:45:56 UTC 2011
[INFO] Final Memory: 44M/552M
[INFO] ------------------------------------------------------------------------
[ERROR] Failed to execute goal org.apache.maven.plugins:maven-surefire-plugin:2.10:test (default-test)
on project hbase: There are test failures.
[ERROR] 
[ERROR] Please refer to <https://builds.apache.org/job/HBase-0.92/ws/trunk/target/surefire-reports>
for the individual test results.
[ERROR] -> [Help 1]
org.apache.maven.lifecycle.LifecycleExecutionException: Failed to execute goal org.apache.maven.plugins:maven-surefire-plugin:2.10:test
(default-test) on project hbase: There are test failures.

Please refer to <https://builds.apache.org/job/HBase-0.92/ws/trunk/target/surefire-reports>
for the individual test results.
	at org.apache.maven.lifecycle.internal.MojoExecutor.execute(MojoExecutor.java:213)
	at org.apache.maven.lifecycle.internal.MojoExecutor.execute(MojoExecutor.java:153)
	at org.apache.maven.lifecycle.internal.MojoExecutor.execute(MojoExecutor.java:145)
	at org.apache.maven.lifecycle.internal.MojoExecutor.executeForkedExecutions(MojoExecutor.java:365)
	at org.apache.maven.lifecycle.internal.MojoExecutor.execute(MojoExecutor.java:199)
	at org.apache.maven.lifecycle.internal.MojoExecutor.execute(MojoExecutor.java:153)
	at org.apache.maven.lifecycle.internal.MojoExecutor.execute(MojoExecutor.java:145)
	at org.apache.maven.lifecycle.internal.LifecycleModuleBuilder.buildProject(LifecycleModuleBuilder.java:84)
	at org.apache.maven.lifecycle.internal.LifecycleModuleBuilder.buildProject(LifecycleModuleBuilder.java:59)
	at org.apache.maven.lifecycle.internal.LifecycleStarter.singleThreadedBuild(LifecycleStarter.java:183)
	at org.apache.maven.lifecycle.internal.LifecycleStarter.execute(LifecycleStarter.java:161)
	at org.apache.maven.DefaultMaven.doExecute(DefaultMaven.java:319)
	at org.apache.maven.DefaultMaven.execute(DefaultMaven.java:156)
	at org.apache.maven.cli.MavenCli.execute(MavenCli.java:537)
	at org.apache.maven.cli.MavenCli.doMain(MavenCli.java:196)
	at org.apache.maven.cli.MavenCli.main(MavenCli.java:141)
	at sun.reflect.NativeMethodAccessorImpl.invoke0(Native Method)
	at sun.reflect.NativeMethodAccessorImpl.invoke(NativeMethodAccessorImpl.java:39)
	at sun.reflect.DelegatingMethodAccessorImpl.invoke(DelegatingMethodAccessorImpl.java:25)
	at java.lang.reflect.Method.invoke(Method.java:597)
	at org.codehaus.plexus.classworlds.launcher.Launcher.launchEnhanced(Launcher.java:290)
	at org.codehaus.plexus.classworlds.launcher.Launcher.launch(Launcher.java:230)
	at org.codehaus.plexus.classworlds.launcher.Launcher.mainWithExitCode(Launcher.java:409)
	at org.codehaus.plexus.classworlds.launcher.Launcher.main(Launcher.java:352)
Caused by: org.apache.maven.plugin.MojoFailureException: There are test failures.

Please refer to <https://builds.apache.org/job/HBase-0.92/ws/trunk/target/surefire-reports>
for the individual test results.
	at org.apache.maven.plugin.surefire.SurefireHelper.reportExecution(SurefireHelper.java:87)
	at org.apache.maven.plugin.surefire.SurefirePlugin.writeSummary(SurefirePlugin.java:641)
	at org.apache.maven.plugin.surefire.SurefirePlugin.handleSummary(SurefirePlugin.java:615)
	at org.apache.maven.plugin.surefire.AbstractSurefireMojo.executeAfterPreconditionsChecked(AbstractSurefireMojo.java:137)
	at org.apache.maven.plugin.surefire.AbstractSurefireMojo.execute(AbstractSurefireMojo.java:98)
	at org.apache.maven.plugin.DefaultBuildPluginManager.executeMojo(DefaultBuildPluginManager.java:101)
	at org.apache.maven.lifecycle.internal.MojoExecutor.execute(MojoExecutor.java:209)
	... 23 more
[ERROR] 
[ERROR] 
[ERROR] For more information about the errors and possible solutions, please read the following
articles:
[ERROR] [Help 1] http://cwiki.apache.org/confluence/display/MAVEN/MojoFailureException
Build step 'Invoke top-level Maven targets' marked build as failure
[locks-and-latches] Releasing all the locks
[locks-and-latches] All the locks released
Archiving artifacts
Recording test results
Updating HBASE-5040
Updating HBASE-4934


Mime
View raw message