hbase-dev mailing list archives

Site index · List index
Message view « Date » · « Thread »
Top « Date » · « Thread »
From Apache Jenkins Server <jenk...@builds.apache.org>
Subject Build failed in Jenkins: HBase-0.92-security #28
Date Fri, 02 Dec 2011 05:04:06 GMT
See <https://builds.apache.org/job/HBase-0.92-security/28/changes>

Changes:

[stack] HBASE-4918 HTablePool Constructor may cause unintended behavior

[stack] HBASE-4918 HTablePool Constructor may cause unintended behavior

[larsh] HBASE-4903  Return a result from RegionObserver.preIncrement (Daniel Gómez Ferro)

------------------------------------------
[...truncated 5624 lines...]
[INFO] Executing tasks
Build sequence for target(s) `main' is [main]
Complete build sequence is [main, ]

main:
  [replace] Replacing in /x1/jenkins/jenkins-slave/workspace/HBase-0.92-security/trunk/target/classes/hbase-default.xml:
@@@VERSION@@@ --> 0.92.0
    [mkdir] Created dir: /x1/jenkins/jenkins-slave/workspace/HBase-0.92-security/trunk/target/nativelib
     [exec] Current OS is Linux
     [exec] Executing 'tar' with arguments:
     [exec] 'xf'
     [exec] 'hadoop-snappy-nativelibs.tar'
     [exec] 
     [exec] The ' characters around the executable and arguments are
     [exec] not part of the command.
Execute:Java13CommandLauncher: Executing 'tar' with arguments:
'xf'
'hadoop-snappy-nativelibs.tar'

The ' characters around the executable and arguments are
not part of the command.
     [exec] tar: hadoop-snappy-nativelibs.tar: Cannot open: No such file or directory
     [exec] tar: Error is not recoverable: exiting now
     [exec] Result: 2
[INFO] Executed tasks
[INFO] 
[INFO] --- maven-compiler-plugin:2.0.2:compile (default-compile) @ hbase ---
[DEBUG] org.apache.maven.plugins:maven-compiler-plugin:jar:2.0.2:
[DEBUG]    org.apache.maven:maven-plugin-api:jar:2.0:compile
[DEBUG]    org.codehaus.plexus:plexus-utils:jar:1.0.4:compile
[DEBUG]    org.codehaus.plexus:plexus-compiler-api:jar:1.5.3:compile
[DEBUG]       org.codehaus.plexus:plexus-container-default:jar:1.0-alpha-8:compile
[DEBUG]          junit:junit:jar:3.8.1:compile
[DEBUG]          classworlds:classworlds:jar:1.1-alpha-2:compile
[DEBUG]    org.codehaus.plexus:plexus-compiler-manager:jar:1.5.3:compile
[DEBUG]    org.codehaus.plexus:plexus-compiler-javac:jar:1.5.3:runtime
[DEBUG]    org.apache.maven:maven-artifact:jar:2.0:compile
[DEBUG] Created new class realm plugin>org.apache.maven.plugins:maven-compiler-plugin:2.0.2
[DEBUG] Importing foreign packages into class realm plugin>org.apache.maven.plugins:maven-compiler-plugin:2.0.2
[DEBUG]   Imported:  < maven.api
[DEBUG] Populating class realm plugin>org.apache.maven.plugins:maven-compiler-plugin:2.0.2
[DEBUG]   Included: org.apache.maven.plugins:maven-compiler-plugin:jar:2.0.2
[DEBUG]   Included: org.codehaus.plexus:plexus-utils:jar:1.0.4
[DEBUG]   Included: org.codehaus.plexus:plexus-compiler-api:jar:1.5.3
[DEBUG]   Included: junit:junit:jar:3.8.1
[DEBUG]   Included: org.codehaus.plexus:plexus-compiler-manager:jar:1.5.3
[DEBUG]   Included: org.codehaus.plexus:plexus-compiler-javac:jar:1.5.3
[DEBUG]   Excluded: org.apache.maven:maven-plugin-api:jar:2.0
[DEBUG]   Excluded: org.codehaus.plexus:plexus-container-default:jar:1.0-alpha-8
[DEBUG]   Excluded: classworlds:classworlds:jar:1.1-alpha-2
[DEBUG]   Excluded: org.apache.maven:maven-artifact:jar:2.0
[DEBUG] Configuring mojo org.apache.maven.plugins:maven-compiler-plugin:2.0.2:compile from
plugin realm ClassRealm[plugin>org.apache.maven.plugins:maven-compiler-plugin:2.0.2, parent:
sun.misc.Launcher$AppClassLoader@18fe7c3]
[DEBUG] Configuring mojo 'org.apache.maven.plugins:maven-compiler-plugin:2.0.2:compile' with
basic configurator -->
[DEBUG]   (f) basedir = /x1/jenkins/jenkins-slave/workspace/HBase-0.92-security/trunk
[DEBUG]   (f) buildDirectory = /x1/jenkins/jenkins-slave/workspace/HBase-0.92-security/trunk/target
[DEBUG]   (f) classpathElements = [/x1/jenkins/jenkins-slave/workspace/HBase-0.92-security/trunk/target/classes,
/home/jenkins/.m2/repository/com/google/guava/guava/r09/guava-r09.jar, /home/jenkins/.m2/repository/commons-cli/commons-cli/1.2/commons-cli-1.2.jar,
/home/jenkins/.m2/repository/com/github/stephenc/high-scale-lib/high-scale-lib/1.1.1/high-scale-lib-1.1.1.jar,
/home/jenkins/.m2/repository/commons-codec/commons-codec/1.4/commons-codec-1.4.jar, /home/jenkins/.m2/repository/commons-httpclient/commons-httpclient/3.1/commons-httpclient-3.1.jar,
/home/jenkins/.m2/repository/commons-lang/commons-lang/2.5/commons-lang-2.5.jar, /home/jenkins/.m2/repository/commons-logging/commons-logging/1.1.1/commons-logging-1.1.1.jar,
/home/jenkins/.m2/repository/log4j/log4j/1.2.16/log4j-1.2.16.jar, /home/jenkins/.m2/repository/org/apache/avro/avro/1.5.3/avro-1.5.3.jar,
/home/jenkins/.m2/repository/org/xerial/snappy/snappy-java/1.0.3.2/snappy-java-1.0.3.2.jar,
/home/jenkins/.m2/repository/org/apache/avro/avro-ipc/1.5.3/avro-ipc-1.5.3.jar, /home/jenkins/.m2/repository/org/jboss/netty/netty/3.2.4.Final/netty-3.2.4.Final.jar,
/home/jenkins/.m2/repository/org/apache/velocity/velocity/1.7/velocity-1.7.jar, /home/jenkins/.m2/repository/commons-collections/commons-collections/3.2.1/commons-collections-3.2.1.jar,
/home/jenkins/.m2/repository/org/apache/zookeeper/zookeeper/3.4.0/zookeeper-3.4.0.jar, /home/jenkins/.m2/repository/org/apache/thrift/libthrift/0.7.0/libthrift-0.7.0.jar,
/home/jenkins/.m2/repository/javax/servlet/servlet-api/2.5/servlet-api-2.5.jar, /home/jenkins/.m2/repository/org/apache/httpcomponents/httpclient/4.0.1/httpclient-4.0.1.jar,
/home/jenkins/.m2/repository/org/apache/httpcomponents/httpcore/4.0.1/httpcore-4.0.1.jar,
/home/jenkins/.m2/repository/org/jruby/jruby-complete/1.6.0/jruby-complete-1.6.0.jar, /home/jenkins/.m2/repository/org/mortbay/jetty/jetty/6.1.26/jetty-6.1.26.jar,
/home/jenkins/.m2/repository/org/mortbay/jetty/jetty-util/6.1.26/jetty-util-6.1.26.jar, /home/jenkins/.m2/repository/org/mortbay/jetty/jsp-2.1/6.1.14/jsp-2.1-6.1.14.jar,
/home/jenkins/.m2/repository/org/eclipse/jdt/core/3.1.1/core-3.1.1.jar, /home/jenkins/.m2/repository/org/mortbay/jetty/jsp-api-2.1/6.1.14/jsp-api-2.1-6.1.14.jar,
/home/jenkins/.m2/repository/org/mortbay/jetty/servlet-api-2.5/6.1.14/servlet-api-2.5-6.1.14.jar,
/home/jenkins/.m2/repository/org/codehaus/jackson/jackson-core-asl/1.5.5/jackson-core-asl-1.5.5.jar,
/home/jenkins/.m2/repository/org/codehaus/jackson/jackson-mapper-asl/1.5.5/jackson-mapper-asl-1.5.5.jar,
/home/jenkins/.m2/repository/org/codehaus/jackson/jackson-jaxrs/1.5.5/jackson-jaxrs-1.5.5.jar,
/home/jenkins/.m2/repository/org/codehaus/jackson/jackson-xc/1.5.5/jackson-xc-1.5.5.jar, /home/jenkins/.m2/repository/org/slf4j/slf4j-api/1.5.8/slf4j-api-1.5.8.jar,
/home/jenkins/.m2/repository/org/slf4j/slf4j-log4j12/1.5.8/slf4j-log4j12-1.5.8.jar, /home/jenkins/.m2/repository/commons-el/commons-el/1.0/commons-el-1.0.jar,
/home/jenkins/.m2/repository/org/jamon/jamon-runtime/2.3.1/jamon-runtime-2.3.1.jar, /home/jenkins/.m2/repository/com/google/protobuf/protobuf-java/2.4.0a/protobuf-java-2.4.0a.jar,
/home/jenkins/.m2/repository/com/sun/jersey/jersey-core/1.4/jersey-core-1.4.jar, /home/jenkins/.m2/repository/com/sun/jersey/jersey-json/1.4/jersey-json-1.4.jar,
/home/jenkins/.m2/repository/org/codehaus/jettison/jettison/1.1/jettison-1.1.jar, /home/jenkins/.m2/repository/com/sun/xml/bind/jaxb-impl/2.1.12/jaxb-impl-2.1.12.jar,
/home/jenkins/.m2/repository/com/sun/jersey/jersey-server/1.4/jersey-server-1.4.jar, /home/jenkins/.m2/repository/asm/asm/3.1/asm-3.1.jar,
/home/jenkins/.m2/repository/javax/xml/bind/jaxb-api/2.1/jaxb-api-2.1.jar, /home/jenkins/.m2/repository/javax/activation/activation/1.1/activation-1.1.jar,
/home/jenkins/.m2/repository/stax/stax-api/1.0.1/stax-api-1.0.1.jar, /home/jenkins/.m2/repository/org/apache/hadoop/hadoop-core/0.20.205.1-7070-SNAPSHOT/hadoop-core-0.20.205.1-7070-SNAPSHOT.jar,
/home/jenkins/.m2/repository/xmlenc/xmlenc/0.52/xmlenc-0.52.jar, /home/jenkins/.m2/repository/commons-configuration/commons-configuration/1.6/commons-configuration-1.6.jar,
/home/jenkins/.m2/repository/commons-digester/commons-digester/1.8/commons-digester-1.8.jar,
/home/jenkins/.m2/repository/commons-beanutils/commons-beanutils/1.7.0/commons-beanutils-1.7.0.jar,
/home/jenkins/.m2/repository/commons-beanutils/commons-beanutils-core/1.8.0/commons-beanutils-core-1.8.0.jar,
/home/jenkins/.m2/repository/commons-net/commons-net/1.4.1/commons-net-1.4.1.jar]
[DEBUG]   (f) compileSourceRoots = [/x1/jenkins/jenkins-slave/workspace/HBase-0.92-security/trunk/src/main/java,
/x1/jenkins/jenkins-slave/workspace/HBase-0.92-security/trunk/target/generated-sources/java,
/x1/jenkins/jenkins-slave/workspace/HBase-0.92-security/trunk/target/generated-jamon, /x1/jenkins/jenkins-slave/workspace/HBase-0.92-security/trunk/security/src/main/java]
[DEBUG]   (f) compilerId = javac
[DEBUG]   (f) debug = true
[DEBUG]   (f) encoding = UTF-8
[DEBUG]   (f) failOnError = true
[DEBUG]   (f) fork = false
[DEBUG]   (f) optimize = false
[DEBUG]   (f) outputDirectory = /x1/jenkins/jenkins-slave/workspace/HBase-0.92-security/trunk/target/classes
[DEBUG]   (f) outputFileName = hbase-0.92.0-security
[DEBUG]   (f) projectArtifact = org.apache.hbase:hbase:jar:0.92.0
[DEBUG]   (f) showDeprecation = false
[DEBUG]   (f) showWarnings = true
[DEBUG]   (f) source = 1.6
[DEBUG]   (f) staleMillis = 0
[DEBUG]   (f) target = 1.6
[DEBUG]   (f) verbose = false
[DEBUG] -- end configuration --
[DEBUG] Using compiler 'javac'.
[DEBUG] Source directories: [/x1/jenkins/jenkins-slave/workspace/HBase-0.92-security/trunk/src/main/java
 /x1/jenkins/jenkins-slave/workspace/HBase-0.92-security/trunk/target/generated-sources/java
 /x1/jenkins/jenkins-slave/workspace/HBase-0.92-security/trunk/target/generated-jamon
 /x1/jenkins/jenkins-slave/workspace/HBase-0.92-security/trunk/security/src/main/java]
[DEBUG] Classpath: [/x1/jenkins/jenkins-slave/workspace/HBase-0.92-security/trunk/target/classes
 /home/jenkins/.m2/repository/com/google/guava/guava/r09/guava-r09.jar
 /home/jenkins/.m2/repository/commons-cli/commons-cli/1.2/commons-cli-1.2.jar
 /home/jenkins/.m2/repository/com/github/stephenc/high-scale-lib/high-scale-lib/1.1.1/high-scale-lib-1.1.1.jar
 /home/jenkins/.m2/repository/commons-codec/commons-codec/1.4/commons-codec-1.4.jar
 /home/jenkins/.m2/repository/commons-httpclient/commons-httpclient/3.1/commons-httpclient-3.1.jar
 /home/jenkins/.m2/repository/commons-lang/commons-lang/2.5/commons-lang-2.5.jar
 /home/jenkins/.m2/repository/commons-logging/commons-logging/1.1.1/commons-logging-1.1.1.jar
 /home/jenkins/.m2/repository/log4j/log4j/1.2.16/log4j-1.2.16.jar
 /home/jenkins/.m2/repository/org/apache/avro/avro/1.5.3/avro-1.5.3.jar
 /home/jenkins/.m2/repository/org/xerial/snappy/snappy-java/1.0.3.2/snappy-java-1.0.3.2.jar
 /home/jenkins/.m2/repository/org/apache/avro/avro-ipc/1.5.3/avro-ipc-1.5.3.jar
 /home/jenkins/.m2/repository/org/jboss/netty/netty/3.2.4.Final/netty-3.2.4.Final.jar
 /home/jenkins/.m2/repository/org/apache/velocity/velocity/1.7/velocity-1.7.jar
 /home/jenkins/.m2/repository/commons-collections/commons-collections/3.2.1/commons-collections-3.2.1.jar
 /home/jenkins/.m2/repository/org/apache/zookeeper/zookeeper/3.4.0/zookeeper-3.4.0.jar
 /home/jenkins/.m2/repository/org/apache/thrift/libthrift/0.7.0/libthrift-0.7.0.jar
 /home/jenkins/.m2/repository/javax/servlet/servlet-api/2.5/servlet-api-2.5.jar
 /home/jenkins/.m2/repository/org/apache/httpcomponents/httpclient/4.0.1/httpclient-4.0.1.jar
 /home/jenkins/.m2/repository/org/apache/httpcomponents/httpcore/4.0.1/httpcore-4.0.1.jar
 /home/jenkins/.m2/repository/org/jruby/jruby-complete/1.6.0/jruby-complete-1.6.0.jar
 /home/jenkins/.m2/repository/org/mortbay/jetty/jetty/6.1.26/jetty-6.1.26.jar
 /home/jenkins/.m2/repository/org/mortbay/jetty/jetty-util/6.1.26/jetty-util-6.1.26.jar
 /home/jenkins/.m2/repository/org/mortbay/jetty/jsp-2.1/6.1.14/jsp-2.1-6.1.14.jar
 /home/jenkins/.m2/repository/org/eclipse/jdt/core/3.1.1/core-3.1.1.jar
 /home/jenkins/.m2/repository/org/mortbay/jetty/jsp-api-2.1/6.1.14/jsp-api-2.1-6.1.14.jar
 /home/jenkins/.m2/repository/org/mortbay/jetty/servlet-api-2.5/6.1.14/servlet-api-2.5-6.1.14.jar
 /home/jenkins/.m2/repository/org/codehaus/jackson/jackson-core-asl/1.5.5/jackson-core-asl-1.5.5.jar
 /home/jenkins/.m2/repository/org/codehaus/jackson/jackson-mapper-asl/1.5.5/jackson-mapper-asl-1.5.5.jar
 /home/jenkins/.m2/repository/org/codehaus/jackson/jackson-jaxrs/1.5.5/jackson-jaxrs-1.5.5.jar
 /home/jenkins/.m2/repository/org/codehaus/jackson/jackson-xc/1.5.5/jackson-xc-1.5.5.jar
 /home/jenkins/.m2/repository/org/slf4j/slf4j-api/1.5.8/slf4j-api-1.5.8.jar
 /home/jenkins/.m2/repository/org/slf4j/slf4j-log4j12/1.5.8/slf4j-log4j12-1.5.8.jar
 /home/jenkins/.m2/repository/commons-el/commons-el/1.0/commons-el-1.0.jar
 /home/jenkins/.m2/repository/org/jamon/jamon-runtime/2.3.1/jamon-runtime-2.3.1.jar
 /home/jenkins/.m2/repository/com/google/protobuf/protobuf-java/2.4.0a/protobuf-java-2.4.0a.jar
 /home/jenkins/.m2/repository/com/sun/jersey/jersey-core/1.4/jersey-core-1.4.jar
 /home/jenkins/.m2/repository/com/sun/jersey/jersey-json/1.4/jersey-json-1.4.jar
 /home/jenkins/.m2/repository/org/codehaus/jettison/jettison/1.1/jettison-1.1.jar
 /home/jenkins/.m2/repository/com/sun/xml/bind/jaxb-impl/2.1.12/jaxb-impl-2.1.12.jar
 /home/jenkins/.m2/repository/com/sun/jersey/jersey-server/1.4/jersey-server-1.4.jar
 /home/jenkins/.m2/repository/asm/asm/3.1/asm-3.1.jar
 /home/jenkins/.m2/repository/javax/xml/bind/jaxb-api/2.1/jaxb-api-2.1.jar
 /home/jenkins/.m2/repository/javax/activation/activation/1.1/activation-1.1.jar
 /home/jenkins/.m2/repository/stax/stax-api/1.0.1/stax-api-1.0.1.jar
 /home/jenkins/.m2/repository/org/apache/hadoop/hadoop-core/0.20.205.1-7070-SNAPSHOT/hadoop-core-0.20.205.1-7070-SNAPSHOT.jar
 /home/jenkins/.m2/repository/xmlenc/xmlenc/0.52/xmlenc-0.52.jar
 /home/jenkins/.m2/repository/commons-configuration/commons-configuration/1.6/commons-configuration-1.6.jar
 /home/jenkins/.m2/repository/commons-digester/commons-digester/1.8/commons-digester-1.8.jar
 /home/jenkins/.m2/repository/commons-beanutils/commons-beanutils/1.7.0/commons-beanutils-1.7.0.jar
 /home/jenkins/.m2/repository/commons-beanutils/commons-beanutils-core/1.8.0/commons-beanutils-core-1.8.0.jar
 /home/jenkins/.m2/repository/commons-net/commons-net/1.4.1/commons-net-1.4.1.jar]
[DEBUG] Output directory: /x1/jenkins/jenkins-slave/workspace/HBase-0.92-security/trunk/target/classes
[DEBUG] Classpath:
[DEBUG]  /x1/jenkins/jenkins-slave/workspace/HBase-0.92-security/trunk/target/classes
[DEBUG]  /home/jenkins/.m2/repository/com/google/guava/guava/r09/guava-r09.jar
[DEBUG]  /home/jenkins/.m2/repository/commons-cli/commons-cli/1.2/commons-cli-1.2.jar
[DEBUG]  /home/jenkins/.m2/repository/com/github/stephenc/high-scale-lib/high-scale-lib/1.1.1/high-scale-lib-1.1.1.jar
[DEBUG]  /home/jenkins/.m2/repository/commons-codec/commons-codec/1.4/commons-codec-1.4.jar
[DEBUG]  /home/jenkins/.m2/repository/commons-httpclient/commons-httpclient/3.1/commons-httpclient-3.1.jar
[DEBUG]  /home/jenkins/.m2/repository/commons-lang/commons-lang/2.5/commons-lang-2.5.jar
[DEBUG]  /home/jenkins/.m2/repository/commons-logging/commons-logging/1.1.1/commons-logging-1.1.1.jar
[DEBUG]  /home/jenkins/.m2/repository/log4j/log4j/1.2.16/log4j-1.2.16.jar
[DEBUG]  /home/jenkins/.m2/repository/org/apache/avro/avro/1.5.3/avro-1.5.3.jar
[DEBUG]  /home/jenkins/.m2/repository/org/xerial/snappy/snappy-java/1.0.3.2/snappy-java-1.0.3.2.jar
[DEBUG]  /home/jenkins/.m2/repository/org/apache/avro/avro-ipc/1.5.3/avro-ipc-1.5.3.jar
[DEBUG]  /home/jenkins/.m2/repository/org/jboss/netty/netty/3.2.4.Final/netty-3.2.4.Final.jar
[DEBUG]  /home/jenkins/.m2/repository/org/apache/velocity/velocity/1.7/velocity-1.7.jar
[DEBUG]  /home/jenkins/.m2/repository/commons-collections/commons-collections/3.2.1/commons-collections-3.2.1.jar
[DEBUG]  /home/jenkins/.m2/repository/org/apache/zookeeper/zookeeper/3.4.0/zookeeper-3.4.0.jar
[DEBUG]  /home/jenkins/.m2/repository/org/apache/thrift/libthrift/0.7.0/libthrift-0.7.0.jar
[DEBUG]  /home/jenkins/.m2/repository/javax/servlet/servlet-api/2.5/servlet-api-2.5.jar
[DEBUG]  /home/jenkins/.m2/repository/org/apache/httpcomponents/httpclient/4.0.1/httpclient-4.0.1.jar
[DEBUG]  /home/jenkins/.m2/repository/org/apache/httpcomponents/httpcore/4.0.1/httpcore-4.0.1.jar
[DEBUG]  /home/jenkins/.m2/repository/org/jruby/jruby-complete/1.6.0/jruby-complete-1.6.0.jar
[DEBUG]  /home/jenkins/.m2/repository/org/mortbay/jetty/jetty/6.1.26/jetty-6.1.26.jar
[DEBUG]  /home/jenkins/.m2/repository/org/mortbay/jetty/jetty-util/6.1.26/jetty-util-6.1.26.jar
[DEBUG]  /home/jenkins/.m2/repository/org/mortbay/jetty/jsp-2.1/6.1.14/jsp-2.1-6.1.14.jar
[DEBUG]  /home/jenkins/.m2/repository/org/eclipse/jdt/core/3.1.1/core-3.1.1.jar
[DEBUG]  /home/jenkins/.m2/repository/org/mortbay/jetty/jsp-api-2.1/6.1.14/jsp-api-2.1-6.1.14.jar
[DEBUG]  /home/jenkins/.m2/repository/org/mortbay/jetty/servlet-api-2.5/6.1.14/servlet-api-2.5-6.1.14.jar
[DEBUG]  /home/jenkins/.m2/repository/org/codehaus/jackson/jackson-core-asl/1.5.5/jackson-core-asl-1.5.5.jar
[DEBUG]  /home/jenkins/.m2/repository/org/codehaus/jackson/jackson-mapper-asl/1.5.5/jackson-mapper-asl-1.5.5.jar
[DEBUG]  /home/jenkins/.m2/repository/org/codehaus/jackson/jackson-jaxrs/1.5.5/jackson-jaxrs-1.5.5.jar
[DEBUG]  /home/jenkins/.m2/repository/org/codehaus/jackson/jackson-xc/1.5.5/jackson-xc-1.5.5.jar
[DEBUG]  /home/jenkins/.m2/repository/org/slf4j/slf4j-api/1.5.8/slf4j-api-1.5.8.jar
[DEBUG]  /home/jenkins/.m2/repository/org/slf4j/slf4j-log4j12/1.5.8/slf4j-log4j12-1.5.8.jar
[DEBUG]  /home/jenkins/.m2/repository/commons-el/commons-el/1.0/commons-el-1.0.jar
[DEBUG]  /home/jenkins/.m2/repository/org/jamon/jamon-runtime/2.3.1/jamon-runtime-2.3.1.jar
[DEBUG]  /home/jenkins/.m2/repository/com/google/protobuf/protobuf-java/2.4.0a/protobuf-java-2.4.0a.jar
[DEBUG]  /home/jenkins/.m2/repository/com/sun/jersey/jersey-core/1.4/jersey-core-1.4.jar
[DEBUG]  /home/jenkins/.m2/repository/com/sun/jersey/jersey-json/1.4/jersey-json-1.4.jar
[DEBUG]  /home/jenkins/.m2/repository/org/codehaus/jettison/jettison/1.1/jettison-1.1.jar
[DEBUG]  /home/jenkins/.m2/repository/com/sun/xml/bind/jaxb-impl/2.1.12/jaxb-impl-2.1.12.jar
[DEBUG]  /home/jenkins/.m2/repository/com/sun/jersey/jersey-server/1.4/jersey-server-1.4.jar
[DEBUG]  /home/jenkins/.m2/repository/asm/asm/3.1/asm-3.1.jar
[DEBUG]  /home/jenkins/.m2/repository/javax/xml/bind/jaxb-api/2.1/jaxb-api-2.1.jar
[DEBUG]  /home/jenkins/.m2/repository/javax/activation/activation/1.1/activation-1.1.jar
[DEBUG]  /home/jenkins/.m2/repository/stax/stax-api/1.0.1/stax-api-1.0.1.jar
[DEBUG]  /home/jenkins/.m2/repository/org/apache/hadoop/hadoop-core/0.20.205.1-7070-SNAPSHOT/hadoop-core-0.20.205.1-7070-SNAPSHOT.jar
[DEBUG]  /home/jenkins/.m2/repository/xmlenc/xmlenc/0.52/xmlenc-0.52.jar
[DEBUG]  /home/jenkins/.m2/repository/commons-configuration/commons-configuration/1.6/commons-configuration-1.6.jar
[DEBUG]  /home/jenkins/.m2/repository/commons-digester/commons-digester/1.8/commons-digester-1.8.jar
[DEBUG]  /home/jenkins/.m2/repository/commons-beanutils/commons-beanutils/1.7.0/commons-beanutils-1.7.0.jar
[DEBUG]  /home/jenkins/.m2/repository/commons-beanutils/commons-beanutils-core/1.8.0/commons-beanutils-core-1.8.0.jar
[DEBUG]  /home/jenkins/.m2/repository/commons-net/commons-net/1.4.1/commons-net-1.4.1.jar
[DEBUG] Source roots:
[DEBUG]  /x1/jenkins/jenkins-slave/workspace/HBase-0.92-security/trunk/src/main/java
[DEBUG]  /x1/jenkins/jenkins-slave/workspace/HBase-0.92-security/trunk/target/generated-sources/java
[DEBUG]  /x1/jenkins/jenkins-slave/workspace/HBase-0.92-security/trunk/target/generated-jamon
[DEBUG]  /x1/jenkins/jenkins-slave/workspace/HBase-0.92-security/trunk/security/src/main/java
[INFO] Compiling 634 source files to /x1/jenkins/jenkins-slave/workspace/HBase-0.92-security/trunk/target/classes
[INFO] ------------------------------------------------------------------------
[INFO] BUILD FAILURE
[INFO] ------------------------------------------------------------------------
[INFO] Total time: 31.251s
[INFO] Finished at: Fri Dec 02 05:04:02 UTC 2011
[INFO] Final Memory: 46M/1067M
[INFO] ------------------------------------------------------------------------
[ERROR] Failed to execute goal org.apache.maven.plugins:maven-compiler-plugin:2.0.2:compile
(default-compile) on project hbase: Compilation failure: Compilation failure:
[ERROR] /x1/jenkins/jenkins-slave/workspace/HBase-0.92-security/trunk/src/main/java/org/apache/hadoop/hbase/util/Bytes.java:[44,15]
sun.misc.Unsafe is Sun proprietary API and may be removed in a future release
[ERROR] 
[ERROR] /x1/jenkins/jenkins-slave/workspace/HBase-0.92-security/trunk/src/main/java/org/apache/hadoop/hbase/util/Bytes.java:[1035,19]
sun.misc.Unsafe is Sun proprietary API and may be removed in a future release
[ERROR] 
[ERROR] /x1/jenkins/jenkins-slave/workspace/HBase-0.92-security/trunk/src/main/java/org/apache/hadoop/hbase/util/Bytes.java:[1041,21]
sun.misc.Unsafe is Sun proprietary API and may be removed in a future release
[ERROR] 
[ERROR] /x1/jenkins/jenkins-slave/workspace/HBase-0.92-security/trunk/src/main/java/org/apache/hadoop/hbase/util/Bytes.java:[1046,28]
sun.misc.Unsafe is Sun proprietary API and may be removed in a future release
[ERROR] 
[ERROR] /x1/jenkins/jenkins-slave/workspace/HBase-0.92-security/trunk/security/src/main/java/org/apache/hadoop/hbase/security/access/AccessController.java:[787,2]
method does not override or implement a method from a supertype
[ERROR] -> [Help 1]
org.apache.maven.lifecycle.LifecycleExecutionException: Failed to execute goal org.apache.maven.plugins:maven-compiler-plugin:2.0.2:compile
(default-compile) on project hbase: Compilation failure
	at org.apache.maven.lifecycle.internal.MojoExecutor.execute(MojoExecutor.java:213)
	at org.apache.maven.lifecycle.internal.MojoExecutor.execute(MojoExecutor.java:153)
	at org.apache.maven.lifecycle.internal.MojoExecutor.execute(MojoExecutor.java:145)
	at org.apache.maven.lifecycle.internal.MojoExecutor.executeForkedExecutions(MojoExecutor.java:365)
	at org.apache.maven.lifecycle.internal.MojoExecutor.execute(MojoExecutor.java:199)
	at org.apache.maven.lifecycle.internal.MojoExecutor.execute(MojoExecutor.java:153)
	at org.apache.maven.lifecycle.internal.MojoExecutor.execute(MojoExecutor.java:145)
	at org.apache.maven.lifecycle.internal.LifecycleModuleBuilder.buildProject(LifecycleModuleBuilder.java:84)
	at org.apache.maven.lifecycle.internal.LifecycleModuleBuilder.buildProject(LifecycleModuleBuilder.java:59)
	at org.apache.maven.lifecycle.internal.LifecycleStarter.singleThreadedBuild(LifecycleStarter.java:183)
	at org.apache.maven.lifecycle.internal.LifecycleStarter.execute(LifecycleStarter.java:161)
	at org.apache.maven.DefaultMaven.doExecute(DefaultMaven.java:319)
	at org.apache.maven.DefaultMaven.execute(DefaultMaven.java:156)
	at org.apache.maven.cli.MavenCli.execute(MavenCli.java:537)
	at org.apache.maven.cli.MavenCli.doMain(MavenCli.java:196)
	at org.apache.maven.cli.MavenCli.main(MavenCli.java:141)
	at sun.reflect.NativeMethodAccessorImpl.invoke0(Native Method)
	at sun.reflect.NativeMethodAccessorImpl.invoke(NativeMethodAccessorImpl.java:39)
	at sun.reflect.DelegatingMethodAccessorImpl.invoke(DelegatingMethodAccessorImpl.java:25)
	at java.lang.reflect.Method.invoke(Method.java:597)
	at org.codehaus.plexus.classworlds.launcher.Launcher.launchEnhanced(Launcher.java:290)
	at org.codehaus.plexus.classworlds.launcher.Launcher.launch(Launcher.java:230)
	at org.codehaus.plexus.classworlds.launcher.Launcher.mainWithExitCode(Launcher.java:409)
	at org.codehaus.plexus.classworlds.launcher.Launcher.main(Launcher.java:352)
Caused by: org.apache.maven.plugin.CompilationFailureException: Compilation failure
	at org.apache.maven.plugin.AbstractCompilerMojo.execute(AbstractCompilerMojo.java:516)
	at org.apache.maven.plugin.CompilerMojo.execute(CompilerMojo.java:114)
	at org.apache.maven.plugin.DefaultBuildPluginManager.executeMojo(DefaultBuildPluginManager.java:101)
	at org.apache.maven.lifecycle.internal.MojoExecutor.execute(MojoExecutor.java:209)
	... 23 more
[ERROR] 
[ERROR] 
[ERROR] For more information about the errors and possible solutions, please read the following
articles:
[ERROR] [Help 1] http://cwiki.apache.org/confluence/display/MAVEN/MojoFailureException
Build step 'Invoke top-level Maven targets' marked build as failure
[locks-and-latches] Releasing all the locks
[locks-and-latches] All the locks released
Archiving artifacts
Recording test results
Updating HBASE-4903
Updating HBASE-4918


Mime
View raw message