hbase-dev mailing list archives

Site index · List index
Message view « Date » · « Thread »
Top « Date » · « Thread »
From lars hofhansl <lhofha...@yahoo.com>
Subject Re: Build failed in Jenkins: HBase-TRUNK #2560
Date Tue, 20 Dec 2011 04:07:04 GMT
Is it possible to get jstack dump?



________________________________
 From: Stack <stack@duboce.net>
To: dev@hbase.apache.org 
Sent: Monday, December 19, 2011 8:00 PM
Subject: Re: Build failed in Jenkins: HBase-TRUNK #2560
 
Hung TestMasterReplications

On Mon, Dec 19, 2011 at 5:28 PM, Apache Jenkins Server
<jenkins@builds.apache.org> wrote:
> See <https://builds.apache.org/job/HBase-TRUNK/2560/changes>
>
> Changes:
>
> [stack] HBASE-5029 TestDistributedLogSplitting fails on occasion; disabling failing test
-- redo -- forgot to import @Ignore
>
> [stack] HBASE-5029 TestDistributedLogSplitting fails on occasion; disabling failing test
>
> ------------------------------------------
> [...truncated 1923 lines...]
> Tests run: 1, Failures: 0, Errors: 0, Skipped: 0, Time elapsed: 2.317 sec
> Running org.apache.hadoop.hbase.client.TestMultiParallel
> Tests run: 10, Failures: 0, Errors: 0, Skipped: 0, Time elapsed: 19.933 sec
> Running org.apache.hadoop.hbase.client.TestHTableUtil
> Tests run: 2, Failures: 0, Errors: 0, Skipped: 0, Time elapsed: 2.122 sec
> Running org.apache.hadoop.hbase.client.TestMultipleTimestamps
> Tests run: 8, Failures: 0, Errors: 0, Skipped: 0, Time elapsed: 15.084 sec
> Running org.apache.hadoop.hbase.client.replication.TestReplicationAdmin
> Tests run: 1, Failures: 0, Errors: 0, Skipped: 0, Time elapsed: 0.027 sec
> Running org.apache.hadoop.hbase.client.TestHCM
> Tests run: 5, Failures: 0, Errors: 0, Skipped: 0, Time elapsed: 3.786 sec
> Running org.apache.hadoop.hbase.client.TestHTablePool$TestHTableReusablePool
> Tests run: 9, Failures: 0, Errors: 0, Skipped: 0, Time elapsed: 6.182 sec
> Running org.apache.hadoop.hbase.client.TestHTablePool$TestHTableThreadLocalPool
> Tests run: 9, Failures: 0, Errors: 0, Skipped: 0, Time elapsed: 5.156 sec
> Running org.apache.hadoop.hbase.client.TestInstantSchemaChange
> Tests run: 10, Failures: 0, Errors: 0, Skipped: 0, Time elapsed: 194.01 sec
> Running org.apache.hadoop.hbase.master.TestActiveMasterManager
> Tests run: 2, Failures: 0, Errors: 0, Skipped: 0, Time elapsed: 0.326 sec
> Running org.apache.hadoop.hbase.master.TestMasterStatusServlet
> Tests run: 5, Failures: 0, Errors: 0, Skipped: 0, Time elapsed: 0.787 sec
> Running org.apache.hadoop.hbase.master.TestHMasterRPCException
> Tests run: 1, Failures: 0, Errors: 0, Skipped: 0, Time elapsed: 1.496 sec
> Running org.apache.hadoop.hbase.master.TestDeadServer
> Tests run: 1, Failures: 0, Errors: 0, Skipped: 0, Time elapsed: 0.196 sec
> Running org.apache.hadoop.hbase.master.TestRollingRestart
> Tests run: 1, Failures: 0, Errors: 0, Skipped: 0, Time elapsed: 42.763 sec
> Running org.apache.hadoop.hbase.master.TestLogsCleaner
> Tests run: 1, Failures: 0, Errors: 0, Skipped: 0, Time elapsed: 2.587 sec
> Running org.apache.hadoop.hbase.master.TestOpenedRegionHandler
> Tests run: 2, Failures: 0, Errors: 0, Skipped: 0, Time elapsed: 15.453 sec
> Running org.apache.hadoop.hbase.master.TestMasterTransitions
> Tests run: 3, Failures: 0, Errors: 0, Skipped: 3, Time elapsed: 0 sec
> Running org.apache.hadoop.hbase.master.TestZKBasedOpenCloseRegion
> Tests run: 3, Failures: 0, Errors: 0, Skipped: 0, Time elapsed: 1.097 sec
> Running org.apache.hadoop.hbase.master.TestRestartCluster
> Tests run: 2, Failures: 0, Errors: 0, Skipped: 0, Time elapsed: 27.408 sec
> Running org.apache.hadoop.hbase.master.TestDefaultLoadBalancer
> Tests run: 4, Failures: 0, Errors: 0, Skipped: 0, Time elapsed: 1.248 sec
> Running org.apache.hadoop.hbase.master.TestMasterFailover
> Tests run: 4, Failures: 0, Errors: 0, Skipped: 0, Time elapsed: 62.76 sec
> Running org.apache.hadoop.hbase.master.TestClockSkewDetection
> Tests run: 1, Failures: 0, Errors: 0, Skipped: 0, Time elapsed: 0.169 sec
> Running org.apache.hadoop.hbase.master.TestMaster
> Tests run: 1, Failures: 0, Errors: 0, Skipped: 0, Time elapsed: 5.798 sec
> Running org.apache.hadoop.hbase.master.TestDistributedLogSplitting
> Tests run: 4, Failures: 0, Errors: 0, Skipped: 1, Time elapsed: 77.802 sec
> Running org.apache.hadoop.hbase.master.TestSplitLogManager
> Tests run: 10, Failures: 0, Errors: 0, Skipped: 0, Time elapsed: 14.036 sec
> Running org.apache.hadoop.hbase.master.TestMasterRestartAfterDisablingTable
> Tests run: 1, Failures: 0, Errors: 0, Skipped: 0, Time elapsed: 18.324 sec
> Running org.apache.hadoop.hbase.TestFullLogReconstruction
> Tests run: 1, Failures: 0, Errors: 0, Skipped: 0, Time elapsed: 21.162 sec
> Running org.apache.hadoop.hbase.metrics.TestMetricsMBeanBase
> Tests run: 2, Failures: 0, Errors: 0, Skipped: 0, Time elapsed: 1.113 sec
> Running org.apache.hadoop.hbase.TestGlobalMemStoreSize
> Tests run: 1, Failures: 0, Errors: 0, Skipped: 0, Time elapsed: 15.475 sec
> Running org.apache.hadoop.hbase.TestZooKeeper
> Tests run: 7, Failures: 0, Errors: 0, Skipped: 0, Time elapsed: 31.35 sec
> Running org.apache.hadoop.hbase.replication.TestMasterReplication
> Running org.apache.hadoop.hbase.replication.TestReplicationSource
> Tests run: 1, Failures: 0, Errors: 0, Skipped: 0, Time elapsed: 0.61 sec
> Running org.apache.hadoop.hbase.replication.TestReplication
> Tests run: 7, Failures: 0, Errors: 0, Skipped: 0, Time elapsed: 88.697 sec
> Running org.apache.hadoop.hbase.replication.TestReplicationPeer
> Tests run: 1, Failures: 0, Errors: 0, Skipped: 0, Time elapsed: 7.1 sec
> Running org.apache.hadoop.hbase.replication.regionserver.TestReplicationSink
> Tests run: 5, Failures: 0, Errors: 0, Skipped: 0, Time elapsed: 0.461 sec
> Running org.apache.hadoop.hbase.replication.regionserver.TestReplicationSourceManager
> Tests run: 1, Failures: 0, Errors: 0, Skipped: 0, Time elapsed: 0.183 sec
> Running org.apache.hadoop.hbase.replication.TestMultiSlaveReplication
> Tests run: 1, Failures: 0, Errors: 0, Skipped: 0, Time elapsed: 39.352 sec
> Running org.apache.hadoop.hbase.TestHBaseTestingUtility
> Tests run: 7, Failures: 0, Errors: 0, Skipped: 0, Time elapsed: 59.008 sec
> Running org.apache.hadoop.hbase.TestMultiVersions
> Tests run: 3, Failures: 0, Errors: 0, Skipped: 0, Time elapsed: 10.684 sec
> Running org.apache.hadoop.hbase.catalog.TestMetaReaderEditorNoCluster
> Tests run: 1, Failures: 0, Errors: 0, Skipped: 0, Time elapsed: 5.229 sec
> Running org.apache.hadoop.hbase.catalog.TestCatalogTracker
> Tests run: 9, Failures: 0, Errors: 0, Skipped: 1, Time elapsed: 3.002 sec
> Running org.apache.hadoop.hbase.catalog.TestCatalogTrackerOnCluster
> Tests run: 1, Failures: 0, Errors: 0, Skipped: 0, Time elapsed: 77.629 sec
> Running org.apache.hadoop.hbase.coprocessor.TestAggregateProtocol
> Tests run: 44, Failures: 0, Errors: 0, Skipped: 0, Time elapsed: 2.519 sec
> Running org.apache.hadoop.hbase.coprocessor.TestMasterObserver
> Tests run: 3, Failures: 0, Errors: 0, Skipped: 0, Time elapsed: 15.22 sec
> Running org.apache.hadoop.hbase.coprocessor.TestCoprocessorEndpoint
> Tests run: 3, Failures: 0, Errors: 0, Skipped: 0, Time elapsed: 0.527 sec
> Running org.apache.hadoop.hbase.coprocessor.TestClassLoading
> Tests run: 5, Failures: 0, Errors: 0, Skipped: 0, Time elapsed: 15.602 sec
> Running org.apache.hadoop.hbase.coprocessor.TestRegionObserverInterface
> Tests run: 5, Failures: 0, Errors: 0, Skipped: 0, Time elapsed: 17.648 sec
> Running org.apache.hadoop.hbase.coprocessor.TestMasterCoprocessorExceptionWithRemove
> Tests run: 1, Failures: 0, Errors: 0, Skipped: 0, Time elapsed: 4.1 sec
> Running org.apache.hadoop.hbase.coprocessor.TestRegionServerCoprocessorExceptionWithRemove
> Tests run: 1, Failures: 0, Errors: 0, Skipped: 0, Time elapsed: 5.413 sec
> Running org.apache.hadoop.hbase.coprocessor.TestMasterCoprocessorExceptionWithAbort
> Tests run: 1, Failures: 0, Errors: 0, Skipped: 0, Time elapsed: 1.027 sec
> Running org.apache.hadoop.hbase.coprocessor.TestWALObserver
> Tests run: 3, Failures: 0, Errors: 0, Skipped: 0, Time elapsed: 5.503 sec
> Running org.apache.hadoop.hbase.coprocessor.TestRegionServerCoprocessorExceptionWithAbort
> Tests run: 1, Failures: 0, Errors: 0, Skipped: 0, Time elapsed: 4.337 sec
> Running org.apache.hadoop.hbase.coprocessor.TestRegionObserverBypass
> Tests run: 2, Failures: 0, Errors: 0, Skipped: 0, Time elapsed: 0.092 sec
> Running org.apache.hadoop.hbase.thrift2.TestThriftHBaseServiceHandler
> Tests run: 11, Failures: 0, Errors: 0, Skipped: 0, Time elapsed: 0.355 sec
> Running org.apache.hadoop.hbase.avro.TestAvroServer
> Tests run: 3, Failures: 0, Errors: 0, Skipped: 0, Time elapsed: 27.581 sec
> Running org.apache.hadoop.hbase.thrift.TestThriftServerCmdLine
> Tests run: 16, Failures: 0, Errors: 0, Skipped: 0, Time elapsed: 76.822 sec
> Running org.apache.hadoop.hbase.thrift.TestThriftServer
> Tests run: 1, Failures: 0, Errors: 0, Skipped: 0, Time elapsed: 7.281 sec
> Running org.apache.hadoop.hbase.monitoring.TestTaskMonitor
> Tests run: 3, Failures: 0, Errors: 0, Skipped: 0, Time elapsed: 0.286 sec
> Running org.apache.hadoop.hbase.monitoring.TestMemoryBoundedLogMessageBuffer
> Tests run: 2, Failures: 0, Errors: 0, Skipped: 0, Time elapsed: 0.23 sec
> Running org.apache.hadoop.hbase.regionserver.TestHRegion
> Tests run: 60, Failures: 0, Errors: 0, Skipped: 0, Time elapsed: 49.715 sec
> Running org.apache.hadoop.hbase.regionserver.TestMasterAddressManager
> Tests run: 1, Failures: 0, Errors: 0, Skipped: 0, Time elapsed: 0.154 sec
> Running org.apache.hadoop.hbase.regionserver.TestRegionServerMetrics
> Tests run: 1, Failures: 0, Errors: 0, Skipped: 0, Time elapsed: 31.346 sec
> Running org.apache.hadoop.hbase.regionserver.TestSplitLogWorker
> Tests run: 5, Failures: 0, Errors: 0, Skipped: 0, Time elapsed: 2.115 sec
> Running org.apache.hadoop.hbase.regionserver.TestServerCustomProtocol
> Tests run: 7, Failures: 0, Errors: 0, Skipped: 0, Time elapsed: 1.185 sec
> Running org.apache.hadoop.hbase.regionserver.TestStoreFileBlockCacheSummary
> Tests run: 1, Failures: 0, Errors: 0, Skipped: 0, Time elapsed: 4.578 sec
> Running org.apache.hadoop.hbase.regionserver.TestStore
> Tests run: 11, Failures: 0, Errors: 0, Skipped: 0, Time elapsed: 1.25 sec
> Running org.apache.hadoop.hbase.regionserver.TestAtomicOperation
> Tests run: 3, Failures: 0, Errors: 0, Skipped: 0, Time elapsed: 7.142 sec
> Running org.apache.hadoop.hbase.regionserver.TestBlocksRead
> Tests run: 4, Failures: 0, Errors: 0, Skipped: 0, Time elapsed: 0.932 sec
> Running org.apache.hadoop.hbase.regionserver.TestFSErrorsExposed
> Tests run: 3, Failures: 0, Errors: 0, Skipped: 0, Time elapsed: 27.598 sec
> Running org.apache.hadoop.hbase.regionserver.TestSeekOptimizations
> Tests run: 6, Failures: 0, Errors: 0, Skipped: 0, Time elapsed: 3.109 sec
> Running org.apache.hadoop.hbase.regionserver.metrics.TestSchemaMetrics
> Tests run: 6, Failures: 0, Errors: 0, Skipped: 0, Time elapsed: 17.474 sec
> Running org.apache.hadoop.hbase.regionserver.handler.TestCloseRegionHandler
> Tests run: 1, Failures: 0, Errors: 0, Skipped: 0, Time elapsed: 0.834 sec
> Running org.apache.hadoop.hbase.regionserver.handler.TestOpenRegionHandler
> Tests run: 3, Failures: 0, Errors: 0, Skipped: 0, Time elapsed: 0.64 sec
> Running org.apache.hadoop.hbase.regionserver.TestSplitTransactionOnCluster
> Tests run: 4, Failures: 0, Errors: 0, Skipped: 0, Time elapsed: 26.201 sec
> Running org.apache.hadoop.hbase.regionserver.TestHRegionServerBulkLoad
> Tests run: 1, Failures: 0, Errors: 0, Skipped: 0, Time elapsed: 46.504 sec
> Running org.apache.hadoop.hbase.regionserver.TestParallelPut
> Tests run: 2, Failures: 0, Errors: 0, Skipped: 0, Time elapsed: 5.029 sec
> Running org.apache.hadoop.hbase.regionserver.wal.TestHLogBench
> Tests run: 1, Failures: 0, Errors: 0, Skipped: 0, Time elapsed: 1.024 sec
> Running org.apache.hadoop.hbase.regionserver.wal.TestLogRollAbort
> Tests run: 1, Failures: 0, Errors: 0, Skipped: 0, Time elapsed: 162.892 sec
> Running org.apache.hadoop.hbase.regionserver.wal.TestLogRolling
> Tests run: 3, Failures: 0, Errors: 0, Skipped: 0, Time elapsed: 424.84 sec
> Running org.apache.hadoop.hbase.regionserver.wal.TestHLog
> Tests run: 9, Failures: 0, Errors: 0, Skipped: 0, Time elapsed: 51.636 sec
> Running org.apache.hadoop.hbase.regionserver.wal.TestHLogSplit
> Tests run: 30, Failures: 0, Errors: 0, Skipped: 1, Time elapsed: 244.281 sec
> Running org.apache.hadoop.hbase.regionserver.wal.TestWALReplay
> Tests run: 5, Failures: 0, Errors: 0, Skipped: 0, Time elapsed: 23.476 sec
> Running org.apache.hadoop.hbase.regionserver.TestStoreScanner
> Tests run: 16, Failures: 0, Errors: 0, Skipped: 0, Time elapsed: 0.051 sec
> Running org.apache.hadoop.hbase.regionserver.TestEndToEndSplitTransaction
> Tests run: 1, Failures: 0, Errors: 0, Skipped: 0, Time elapsed: 28.782 sec
> Running org.apache.hadoop.hbase.regionserver.TestRpcMetrics
> Tests run: 1, Failures: 0, Errors: 0, Skipped: 0, Time elapsed: 1.619 sec
> Running org.apache.hadoop.hbase.regionserver.TestMultiColumnScanner
> Tests run: 6, Failures: 0, Errors: 0, Skipped: 0, Time elapsed: 20.974 sec
> Running org.apache.hadoop.hbase.mapred.TestTableMapReduce
> Tests run: 1, Failures: 0, Errors: 0, Skipped: 0, Time elapsed: 36.706 sec
> Running org.apache.hadoop.hbase.mapred.TestTableInputFormat
> Tests run: 6, Failures: 0, Errors: 0, Skipped: 0, Time elapsed: 7.61 sec
> Running org.apache.hadoop.hbase.TestDrainingServer
> Tests run: 2, Failures: 0, Errors: 0, Skipped: 0, Time elapsed: 2.396 sec
> Running org.apache.hadoop.hbase.mapreduce.TestTimeRangeMapRed
> Tests run: 1, Failures: 0, Errors: 0, Skipped: 0, Time elapsed: 30.208 sec
> Running org.apache.hadoop.hbase.mapreduce.TestHFileOutputFormat
> Tests run: 9, Failures: 0, Errors: 0, Skipped: 0, Time elapsed: 207.481 sec
> Running org.apache.hadoop.hbase.mapreduce.TestImportTsv
> Tests run: 8, Failures: 0, Errors: 0, Skipped: 0, Time elapsed: 35.712 sec
> Running org.apache.hadoop.hbase.mapreduce.TestTableInputFormatScan
> Tests run: 11, Failures: 0, Errors: 0, Skipped: 0, Time elapsed: 452.891 sec
> Running org.apache.hadoop.hbase.mapreduce.TestImportExport
> Tests run: 2, Failures: 0, Errors: 0, Skipped: 0, Time elapsed: 29.931 sec
> Running org.apache.hadoop.hbase.mapreduce.TestLoadIncrementalHFilesSplitRecovery
> Tests run: 4, Failures: 0, Errors: 0, Skipped: 0, Time elapsed: 36.392 sec
> Running org.apache.hadoop.hbase.mapreduce.TestTableMapReduce
> Tests run: 1, Failures: 0, Errors: 0, Skipped: 0, Time elapsed: 67.171 sec
> Running org.apache.hadoop.hbase.mapreduce.TestLoadIncrementalHFiles
> Tests run: 6, Failures: 0, Errors: 0, Skipped: 0, Time elapsed: 18.904 sec
>
> Results :
>
> Tests run: 780, Failures: 0, Errors: 0, Skipped: 10
>
> [INFO] ------------------------------------------------------------------------
> [INFO] BUILD FAILURE
> [INFO] ------------------------------------------------------------------------
> [INFO] Total time: 2:05:51.175s
> [INFO] Finished at: Tue Dec 20 01:27:27 UTC 2011
> [INFO] Final Memory: 56M/604M
> [INFO] ------------------------------------------------------------------------
> [ERROR] Failed to execute goal org.apache.maven.plugins:maven-surefire-plugin:2.11-TRUNK-HBASE-2:test
(secondPartTestsExecution) on project hbase: Failure or timeout -> [Help 1]
> org.apache.maven.lifecycle.LifecycleExecutionException: Failed to execute goal org.apache.maven.plugins:maven-surefire-plugin:2.11-TRUNK-HBASE-2:test
(secondPartTestsExecution) on project hbase: Failure or timeout
>        at org.apache.maven.lifecycle.internal.MojoExecutor.execute(MojoExecutor.java:217)
>        at org.apache.maven.lifecycle.internal.MojoExecutor.execute(MojoExecutor.java:153)
>        at org.apache.maven.lifecycle.internal.MojoExecutor.execute(MojoExecutor.java:145)
>        at org.apache.maven.lifecycle.internal.MojoExecutor.executeForkedExecutions(MojoExecutor.java:365)
>        at org.apache.maven.lifecycle.internal.MojoExecutor.execute(MojoExecutor.java:199)
>        at org.apache.maven.lifecycle.internal.MojoExecutor.execute(MojoExecutor.java:153)
>        at org.apache.maven.lifecycle.internal.MojoExecutor.execute(MojoExecutor.java:145)
>        at org.apache.maven.lifecycle.internal.LifecycleModuleBuilder.buildProject(LifecycleModuleBuilder.java:84)
>        at org.apache.maven.lifecycle.internal.LifecycleModuleBuilder.buildProject(LifecycleModuleBuilder.java:59)
>        at org.apache.maven.lifecycle.internal.LifecycleStarter.singleThreadedBuild(LifecycleStarter.java:183)
>        at org.apache.maven.lifecycle.internal.LifecycleStarter.execute(LifecycleStarter.java:161)
>        at org.apache.maven.DefaultMaven.doExecute(DefaultMaven.java:319)
>        at org.apache.maven.DefaultMaven.execute(DefaultMaven.java:156)
>        at org.apache.maven.cli.MavenCli.execute(MavenCli.java:537)
>        at org.apache.maven.cli.MavenCli.doMain(MavenCli.java:196)
>        at org.apache.maven.cli.MavenCli.main(MavenCli.java:141)
>        at sun.reflect.NativeMethodAccessorImpl.invoke0(Native Method)
>        at sun.reflect.NativeMethodAccessorImpl.invoke(NativeMethodAccessorImpl.java:39)
>        at sun.reflect.DelegatingMethodAccessorImpl.invoke(DelegatingMethodAccessorImpl.java:25)
>        at java.lang.reflect.Method.invoke(Method.java:597)
>        at org.codehaus.plexus.classworlds.launcher.Launcher.launchEnhanced(Launcher.java:290)
>        at org.codehaus.plexus.classworlds.launcher.Launcher.launch(Launcher.java:230)
>        at org.codehaus.plexus.classworlds.launcher.Launcher.mainWithExitCode(Launcher.java:409)
>        at org.codehaus.plexus.classworlds.launcher.Launcher.main(Launcher.java:352)
> Caused by: org.apache.maven.plugin.MojoExecutionException: Failure or timeout
>        at org.apache.maven.plugin.surefire.SurefirePlugin.assertNoFailureOrTimeout(SurefirePlugin.java:633)
>        at org.apache.maven.plugin.surefire.SurefirePlugin.handleSummary(SurefirePlugin.java:614)
>        at org.apache.maven.plugin.surefire.AbstractSurefireMojo.executeAfterPreconditionsChecked(AbstractSurefireMojo.java:137)
>        at org.apache.maven.plugin.surefire.AbstractSurefireMojo.execute(AbstractSurefireMojo.java:98)
>        at org.apache.maven.plugin.DefaultBuildPluginManager.executeMojo(DefaultBuildPluginManager.java:101)
>        at org.apache.maven.lifecycle.internal.MojoExecutor.execute(MojoExecutor.java:209)
>        ... 23 more
> [ERROR]
> [ERROR] Re-run Maven using the -X switch to enable full debug logging.
> [ERROR]
> [ERROR] For more information about the errors and possible solutions, please read the
following articles:
> [ERROR] [Help 1] http://cwiki.apache.org/confluence/display/MAVEN/MojoExecutionException
> Build step 'Invoke top-level Maven targets' marked build as failure
> [locks-and-latches] Releasing all the locks
> [locks-and-latches] All the locks released
> Archiving artifacts
> Recording test results
> Updating HBASE-5029
>
Mime
  • Unnamed multipart/alternative (inline, None, 0 bytes)
View raw message