hbase-dev mailing list archives

Site index · List index
Message view « Date » · « Thread »
Top « Date » · « Thread »
From Apache Jenkins Server <jenk...@builds.apache.org>
Subject Build failed in Jenkins: HBase-0.92-security #43
Date Sun, 18 Dec 2011 17:10:21 GMT
See <https://builds.apache.org/job/HBase-0.92-security/43/>

------------------------------------------
[...truncated 6622 lines...]
Forking command line: /bin/sh -c cd /x1/jenkins/jenkins-slave/workspace/HBase-0.92-security/trunk
&& /x1/jenkins/tools/java/jdk1.6.0_27-32/jre/bin/java -enableassertions -Xmx1400m
-Djava.security.egd=file:/dev/./urandom -jar /x1/jenkins/jenkins-slave/workspace/HBase-0.92-security/trunk/target/surefire/surefirebooter7110764308717934462.jar
/x1/jenkins/jenkins-slave/workspace/HBase-0.92-security/trunk/target/surefire/surefire1794157206325205821tmp
/x1/jenkins/jenkins-slave/workspace/HBase-0.92-security/trunk/target/surefire/surefire7712670183392541178tmp
Running org.apache.hadoop.hbase.rest.TestScannersWithFilters
Tests run: 10, Failures: 0, Errors: 0, Skipped: 0, Time elapsed: 21.66 sec
Forking command line: /bin/sh -c cd /x1/jenkins/jenkins-slave/workspace/HBase-0.92-security/trunk
&& /x1/jenkins/tools/java/jdk1.6.0_27-32/jre/bin/java -enableassertions -Xmx1400m
-Djava.security.egd=file:/dev/./urandom -jar /x1/jenkins/jenkins-slave/workspace/HBase-0.92-security/trunk/target/surefire/surefirebooter6248037947747940486.jar
/x1/jenkins/jenkins-slave/workspace/HBase-0.92-security/trunk/target/surefire/surefire2921581158471837096tmp
/x1/jenkins/jenkins-slave/workspace/HBase-0.92-security/trunk/target/surefire/surefire1094480891535444374tmp
Running org.apache.hadoop.hbase.metrics.TestMetricsMBeanBase
Tests run: 2, Failures: 0, Errors: 0, Skipped: 0, Time elapsed: 1.101 sec
Forking command line: /bin/sh -c cd /x1/jenkins/jenkins-slave/workspace/HBase-0.92-security/trunk
&& /x1/jenkins/tools/java/jdk1.6.0_27-32/jre/bin/java -enableassertions -Xmx1400m
-Djava.security.egd=file:/dev/./urandom -jar /x1/jenkins/jenkins-slave/workspace/HBase-0.92-security/trunk/target/surefire/surefirebooter8156876647373305369.jar
/x1/jenkins/jenkins-slave/workspace/HBase-0.92-security/trunk/target/surefire/surefire9078880746965790204tmp
/x1/jenkins/jenkins-slave/workspace/HBase-0.92-security/trunk/target/surefire/surefire1561468978987413087tmp
Running org.apache.hadoop.hbase.io.hfile.TestHFileWriterV2
Tests run: 1, Failures: 0, Errors: 0, Skipped: 0, Time elapsed: 0.833 sec
Forking command line: /bin/sh -c cd /x1/jenkins/jenkins-slave/workspace/HBase-0.92-security/trunk
&& /x1/jenkins/tools/java/jdk1.6.0_27-32/jre/bin/java -enableassertions -Xmx1400m
-Djava.security.egd=file:/dev/./urandom -jar /x1/jenkins/jenkins-slave/workspace/HBase-0.92-security/trunk/target/surefire/surefirebooter5988045568600546241.jar
/x1/jenkins/jenkins-slave/workspace/HBase-0.92-security/trunk/target/surefire/surefire4429398209463575035tmp
/x1/jenkins/jenkins-slave/workspace/HBase-0.92-security/trunk/target/surefire/surefire6601866117898083501tmp
Running org.apache.hadoop.hbase.io.hfile.TestHFile
Tests run: 6, Failures: 0, Errors: 0, Skipped: 0, Time elapsed: 0.643 sec
Forking command line: /bin/sh -c cd /x1/jenkins/jenkins-slave/workspace/HBase-0.92-security/trunk
&& /x1/jenkins/tools/java/jdk1.6.0_27-32/jre/bin/java -enableassertions -Xmx1400m
-Djava.security.egd=file:/dev/./urandom -jar /x1/jenkins/jenkins-slave/workspace/HBase-0.92-security/trunk/target/surefire/surefirebooter5590402144792669365.jar
/x1/jenkins/jenkins-slave/workspace/HBase-0.92-security/trunk/target/surefire/surefire4241271196090498283tmp
/x1/jenkins/jenkins-slave/workspace/HBase-0.92-security/trunk/target/surefire/surefire9070770210107647258tmp
Running org.apache.hadoop.hbase.io.hfile.TestHFileBlockIndex
Tests run: 10, Failures: 0, Errors: 0, Skipped: 0, Time elapsed: 6.984 sec
Forking command line: /bin/sh -c cd /x1/jenkins/jenkins-slave/workspace/HBase-0.92-security/trunk
&& /x1/jenkins/tools/java/jdk1.6.0_27-32/jre/bin/java -enableassertions -Xmx1400m
-Djava.security.egd=file:/dev/./urandom -jar /x1/jenkins/jenkins-slave/workspace/HBase-0.92-security/trunk/target/surefire/surefirebooter3198771658460303741.jar
/x1/jenkins/jenkins-slave/workspace/HBase-0.92-security/trunk/target/surefire/surefire1562500705111206059tmp
/x1/jenkins/jenkins-slave/workspace/HBase-0.92-security/trunk/target/surefire/surefire3540549051525892224tmp
Running org.apache.hadoop.hbase.io.hfile.TestHFileSeek
Tests run: 1, Failures: 0, Errors: 0, Skipped: 0, Time elapsed: 4.078 sec
Forking command line: /bin/sh -c cd /x1/jenkins/jenkins-slave/workspace/HBase-0.92-security/trunk
&& /x1/jenkins/tools/java/jdk1.6.0_27-32/jre/bin/java -enableassertions -Xmx1400m
-Djava.security.egd=file:/dev/./urandom -jar /x1/jenkins/jenkins-slave/workspace/HBase-0.92-security/trunk/target/surefire/surefirebooter8619291706352178967.jar
/x1/jenkins/jenkins-slave/workspace/HBase-0.92-security/trunk/target/surefire/surefire1139755754314075728tmp
/x1/jenkins/jenkins-slave/workspace/HBase-0.92-security/trunk/target/surefire/surefire1787974781437433991tmp
Running org.apache.hadoop.hbase.io.hfile.TestLruBlockCache
Tests run: 7, Failures: 0, Errors: 0, Skipped: 0, Time elapsed: 0.346 sec
Forking command line: /bin/sh -c cd /x1/jenkins/jenkins-slave/workspace/HBase-0.92-security/trunk
&& /x1/jenkins/tools/java/jdk1.6.0_27-32/jre/bin/java -enableassertions -Xmx1400m
-Djava.security.egd=file:/dev/./urandom -jar /x1/jenkins/jenkins-slave/workspace/HBase-0.92-security/trunk/target/surefire/surefirebooter4419222692010020212.jar
/x1/jenkins/jenkins-slave/workspace/HBase-0.92-security/trunk/target/surefire/surefire375129941839529583tmp
/x1/jenkins/jenkins-slave/workspace/HBase-0.92-security/trunk/target/surefire/surefire2335223185317362960tmp
Running org.apache.hadoop.hbase.io.hfile.TestFixedFileTrailer
Tests run: 2, Failures: 0, Errors: 0, Skipped: 0, Time elapsed: 0.537 sec
Forking command line: /bin/sh -c cd /x1/jenkins/jenkins-slave/workspace/HBase-0.92-security/trunk
&& /x1/jenkins/tools/java/jdk1.6.0_27-32/jre/bin/java -enableassertions -Xmx1400m
-Djava.security.egd=file:/dev/./urandom -jar /x1/jenkins/jenkins-slave/workspace/HBase-0.92-security/trunk/target/surefire/surefirebooter4678854779865396424.jar
/x1/jenkins/jenkins-slave/workspace/HBase-0.92-security/trunk/target/surefire/surefire8184104076134863455tmp
/x1/jenkins/jenkins-slave/workspace/HBase-0.92-security/trunk/target/surefire/surefire5003017622778259849tmp
Running org.apache.hadoop.hbase.io.hfile.TestCachedBlockQueue
Tests run: 2, Failures: 0, Errors: 0, Skipped: 0, Time elapsed: 0.079 sec
Forking command line: /bin/sh -c cd /x1/jenkins/jenkins-slave/workspace/HBase-0.92-security/trunk
&& /x1/jenkins/tools/java/jdk1.6.0_27-32/jre/bin/java -enableassertions -Xmx1400m
-Djava.security.egd=file:/dev/./urandom -jar /x1/jenkins/jenkins-slave/workspace/HBase-0.92-security/trunk/target/surefire/surefirebooter2264142430369473803.jar
/x1/jenkins/jenkins-slave/workspace/HBase-0.92-security/trunk/target/surefire/surefire8842973015061747618tmp
/x1/jenkins/jenkins-slave/workspace/HBase-0.92-security/trunk/target/surefire/surefire1761503118751204134tmp
Running org.apache.hadoop.hbase.io.hfile.TestHFilePerformance
Tests run: 1, Failures: 0, Errors: 0, Skipped: 0, Time elapsed: 4.06 sec
Forking command line: /bin/sh -c cd /x1/jenkins/jenkins-slave/workspace/HBase-0.92-security/trunk
&& /x1/jenkins/tools/java/jdk1.6.0_27-32/jre/bin/java -enableassertions -Xmx1400m
-Djava.security.egd=file:/dev/./urandom -jar /x1/jenkins/jenkins-slave/workspace/HBase-0.92-security/trunk/target/surefire/surefirebooter4942196724785464333.jar
/x1/jenkins/jenkins-slave/workspace/HBase-0.92-security/trunk/target/surefire/surefire4202646004212319319tmp
/x1/jenkins/jenkins-slave/workspace/HBase-0.92-security/trunk/target/surefire/surefire7278950926182484548tmp
Running org.apache.hadoop.hbase.io.hfile.TestCacheOnWrite
Tests run: 6, Failures: 0, Errors: 0, Skipped: 0, Time elapsed: 5.352 sec
Forking command line: /bin/sh -c cd /x1/jenkins/jenkins-slave/workspace/HBase-0.92-security/trunk
&& /x1/jenkins/tools/java/jdk1.6.0_27-32/jre/bin/java -enableassertions -Xmx1400m
-Djava.security.egd=file:/dev/./urandom -jar /x1/jenkins/jenkins-slave/workspace/HBase-0.92-security/trunk/target/surefire/surefirebooter2154575352837070546.jar
/x1/jenkins/jenkins-slave/workspace/HBase-0.92-security/trunk/target/surefire/surefire2090509670650717094tmp
/x1/jenkins/jenkins-slave/workspace/HBase-0.92-security/trunk/target/surefire/surefire1722241658126860917tmp
Running org.apache.hadoop.hbase.io.hfile.TestReseekTo
Tests run: 1, Failures: 0, Errors: 0, Skipped: 0, Time elapsed: 0.592 sec
Forking command line: /bin/sh -c cd /x1/jenkins/jenkins-slave/workspace/HBase-0.92-security/trunk
&& /x1/jenkins/tools/java/jdk1.6.0_27-32/jre/bin/java -enableassertions -Xmx1400m
-Djava.security.egd=file:/dev/./urandom -jar /x1/jenkins/jenkins-slave/workspace/HBase-0.92-security/trunk/target/surefire/surefirebooter8706535159130645155.jar
/x1/jenkins/jenkins-slave/workspace/HBase-0.92-security/trunk/target/surefire/surefire5927514424403974821tmp
/x1/jenkins/jenkins-slave/workspace/HBase-0.92-security/trunk/target/surefire/surefire4079586061262213116tmp
Running org.apache.hadoop.hbase.io.hfile.TestSeekTo
Tests run: 3, Failures: 0, Errors: 0, Skipped: 0, Time elapsed: 0.503 sec
Forking command line: /bin/sh -c cd /x1/jenkins/jenkins-slave/workspace/HBase-0.92-security/trunk
&& /x1/jenkins/tools/java/jdk1.6.0_27-32/jre/bin/java -enableassertions -Xmx1400m
-Djava.security.egd=file:/dev/./urandom -jar /x1/jenkins/jenkins-slave/workspace/HBase-0.92-security/trunk/target/surefire/surefirebooter6905652043628870.jar
/x1/jenkins/jenkins-slave/workspace/HBase-0.92-security/trunk/target/surefire/surefire3334671940872848679tmp
/x1/jenkins/jenkins-slave/workspace/HBase-0.92-security/trunk/target/surefire/surefire4631075212812379475tmp
Running org.apache.hadoop.hbase.io.hfile.TestBlockCacheColumnFamilySummary
Tests run: 4, Failures: 0, Errors: 0, Skipped: 0, Time elapsed: 0.065 sec
Forking command line: /bin/sh -c cd /x1/jenkins/jenkins-slave/workspace/HBase-0.92-security/trunk
&& /x1/jenkins/tools/java/jdk1.6.0_27-32/jre/bin/java -enableassertions -Xmx1400m
-Djava.security.egd=file:/dev/./urandom -jar /x1/jenkins/jenkins-slave/workspace/HBase-0.92-security/trunk/target/surefire/surefirebooter590173692450135768.jar
/x1/jenkins/jenkins-slave/workspace/HBase-0.92-security/trunk/target/surefire/surefire5549463118146736353tmp
/x1/jenkins/jenkins-slave/workspace/HBase-0.92-security/trunk/target/surefire/surefire5472058723371279979tmp
Running org.apache.hadoop.hbase.io.hfile.TestHFileBlock
Tests run: 7, Failures: 0, Errors: 0, Skipped: 0, Time elapsed: 23.88 sec
Forking command line: /bin/sh -c cd /x1/jenkins/jenkins-slave/workspace/HBase-0.92-security/trunk
&& /x1/jenkins/tools/java/jdk1.6.0_27-32/jre/bin/java -enableassertions -Xmx1400m
-Djava.security.egd=file:/dev/./urandom -jar /x1/jenkins/jenkins-slave/workspace/HBase-0.92-security/trunk/target/surefire/surefirebooter2696945662872213573.jar
/x1/jenkins/jenkins-slave/workspace/HBase-0.92-security/trunk/target/surefire/surefire8362497315244483654tmp
/x1/jenkins/jenkins-slave/workspace/HBase-0.92-security/trunk/target/surefire/surefire1287131888993092007tmp
Running org.apache.hadoop.hbase.io.hfile.slab.TestSlabCache
Tests run: 7, Failures: 0, Errors: 0, Skipped: 0, Time elapsed: 14.841 sec
Forking command line: /bin/sh -c cd /x1/jenkins/jenkins-slave/workspace/HBase-0.92-security/trunk
&& /x1/jenkins/tools/java/jdk1.6.0_27-32/jre/bin/java -enableassertions -Xmx1400m
-Djava.security.egd=file:/dev/./urandom -jar /x1/jenkins/jenkins-slave/workspace/HBase-0.92-security/trunk/target/surefire/surefirebooter7979249968430380382.jar
/x1/jenkins/jenkins-slave/workspace/HBase-0.92-security/trunk/target/surefire/surefire4983248757974053032tmp
/x1/jenkins/jenkins-slave/workspace/HBase-0.92-security/trunk/target/surefire/surefire6718472760568320047tmp
Running org.apache.hadoop.hbase.io.hfile.slab.TestSingleSizeCache
Tests run: 5, Failures: 0, Errors: 0, Skipped: 0, Time elapsed: 18.519 sec
Forking command line: /bin/sh -c cd /x1/jenkins/jenkins-slave/workspace/HBase-0.92-security/trunk
&& /x1/jenkins/tools/java/jdk1.6.0_27-32/jre/bin/java -enableassertions -Xmx1400m
-Djava.security.egd=file:/dev/./urandom -jar /x1/jenkins/jenkins-slave/workspace/HBase-0.92-security/trunk/target/surefire/surefirebooter181906781939662464.jar
/x1/jenkins/jenkins-slave/workspace/HBase-0.92-security/trunk/target/surefire/surefire4468389492327042923tmp
/x1/jenkins/jenkins-slave/workspace/HBase-0.92-security/trunk/target/surefire/surefire7941710338881772948tmp
Running org.apache.hadoop.hbase.io.hfile.slab.TestSlab
Tests run: 1, Failures: 0, Errors: 0, Skipped: 0, Time elapsed: 0.111 sec
Forking command line: /bin/sh -c cd /x1/jenkins/jenkins-slave/workspace/HBase-0.92-security/trunk
&& /x1/jenkins/tools/java/jdk1.6.0_27-32/jre/bin/java -enableassertions -Xmx1400m
-Djava.security.egd=file:/dev/./urandom -jar /x1/jenkins/jenkins-slave/workspace/HBase-0.92-security/trunk/target/surefire/surefirebooter8811811856208149118.jar
/x1/jenkins/jenkins-slave/workspace/HBase-0.92-security/trunk/target/surefire/surefire6475599235990624461tmp
/x1/jenkins/jenkins-slave/workspace/HBase-0.92-security/trunk/target/surefire/surefire1958633123807781309tmp
Running org.apache.hadoop.hbase.io.hfile.TestHFileReaderV1
Tests run: 1, Failures: 0, Errors: 0, Skipped: 0, Time elapsed: 0.44 sec
Forking command line: /bin/sh -c cd /x1/jenkins/jenkins-slave/workspace/HBase-0.92-security/trunk
&& /x1/jenkins/tools/java/jdk1.6.0_27-32/jre/bin/java -enableassertions -Xmx1400m
-Djava.security.egd=file:/dev/./urandom -jar /x1/jenkins/jenkins-slave/workspace/HBase-0.92-security/trunk/target/surefire/surefirebooter8315849887059928697.jar
/x1/jenkins/jenkins-slave/workspace/HBase-0.92-security/trunk/target/surefire/surefire7746711814158740132tmp
/x1/jenkins/jenkins-slave/workspace/HBase-0.92-security/trunk/target/surefire/surefire5559325044613022708tmp
Running org.apache.hadoop.hbase.io.TestHalfStoreFileReader
Tests run: 1, Failures: 0, Errors: 0, Skipped: 0, Time elapsed: 0.6 sec
Forking command line: /bin/sh -c cd /x1/jenkins/jenkins-slave/workspace/HBase-0.92-security/trunk
&& /x1/jenkins/tools/java/jdk1.6.0_27-32/jre/bin/java -enableassertions -Xmx1400m
-Djava.security.egd=file:/dev/./urandom -jar /x1/jenkins/jenkins-slave/workspace/HBase-0.92-security/trunk/target/surefire/surefirebooter6834625040737573076.jar
/x1/jenkins/jenkins-slave/workspace/HBase-0.92-security/trunk/target/surefire/surefire2319197642121024451tmp
/x1/jenkins/jenkins-slave/workspace/HBase-0.92-security/trunk/target/surefire/surefire4220643093860887354tmp
Running org.apache.hadoop.hbase.io.TestHbaseObjectWritable
Tests run: 4, Failures: 0, Errors: 0, Skipped: 0, Time elapsed: 0.346 sec
Forking command line: /bin/sh -c cd /x1/jenkins/jenkins-slave/workspace/HBase-0.92-security/trunk
&& /x1/jenkins/tools/java/jdk1.6.0_27-32/jre/bin/java -enableassertions -Xmx1400m
-Djava.security.egd=file:/dev/./urandom -jar /x1/jenkins/jenkins-slave/workspace/HBase-0.92-security/trunk/target/surefire/surefirebooter1280013950601131056.jar
/x1/jenkins/jenkins-slave/workspace/HBase-0.92-security/trunk/target/surefire/surefire3603651398595026241tmp
/x1/jenkins/jenkins-slave/workspace/HBase-0.92-security/trunk/target/surefire/surefire8950522065628385677tmp
Running org.apache.hadoop.hbase.io.TestImmutableBytesWritable
Tests run: 3, Failures: 0, Errors: 0, Skipped: 0, Time elapsed: 0.084 sec
Forking command line: /bin/sh -c cd /x1/jenkins/jenkins-slave/workspace/HBase-0.92-security/trunk
&& /x1/jenkins/tools/java/jdk1.6.0_27-32/jre/bin/java -enableassertions -Xmx1400m
-Djava.security.egd=file:/dev/./urandom -jar /x1/jenkins/jenkins-slave/workspace/HBase-0.92-security/trunk/target/surefire/surefirebooter7544104109601173221.jar
/x1/jenkins/jenkins-slave/workspace/HBase-0.92-security/trunk/target/surefire/surefire8342448561296093762tmp
/x1/jenkins/jenkins-slave/workspace/HBase-0.92-security/trunk/target/surefire/surefire3860068311734001385tmp
Running org.apache.hadoop.hbase.io.TestHeapSize
Tests run: 2, Failures: 0, Errors: 0, Skipped: 0, Time elapsed: 0.121 sec
Forking command line: /bin/sh -c cd /x1/jenkins/jenkins-slave/workspace/HBase-0.92-security/trunk
&& /x1/jenkins/tools/java/jdk1.6.0_27-32/jre/bin/java -enableassertions -Xmx1400m
-Djava.security.egd=file:/dev/./urandom -jar /x1/jenkins/jenkins-slave/workspace/HBase-0.92-security/trunk/target/surefire/surefirebooter3386671511794816884.jar
/x1/jenkins/jenkins-slave/workspace/HBase-0.92-security/trunk/target/surefire/surefire2416831861509100127tmp
/x1/jenkins/jenkins-slave/workspace/HBase-0.92-security/trunk/target/surefire/surefire4104154938260129830tmp
Running org.apache.hadoop.hbase.TestRegionRebalancing
Tests run: 1, Failures: 0, Errors: 0, Skipped: 0, Time elapsed: 45.303 sec
Forking command line: /bin/sh -c cd /x1/jenkins/jenkins-slave/workspace/HBase-0.92-security/trunk
&& /x1/jenkins/tools/java/jdk1.6.0_27-32/jre/bin/java -enableassertions -Xmx1400m
-Djava.security.egd=file:/dev/./urandom -jar /x1/jenkins/jenkins-slave/workspace/HBase-0.92-security/trunk/target/surefire/surefirebooter1713168134775172529.jar
/x1/jenkins/jenkins-slave/workspace/HBase-0.92-security/trunk/target/surefire/surefire6477962241266345137tmp
/x1/jenkins/jenkins-slave/workspace/HBase-0.92-security/trunk/target/surefire/surefire9025518908885480260tmp
Running org.apache.hadoop.hbase.mapred.TestTableInputFormat
Tests run: 6, Failures: 0, Errors: 0, Skipped: 0, Time elapsed: 26.462 sec
Forking command line: /bin/sh -c cd /x1/jenkins/jenkins-slave/workspace/HBase-0.92-security/trunk
&& /x1/jenkins/tools/java/jdk1.6.0_27-32/jre/bin/java -enableassertions -Xmx1400m
-Djava.security.egd=file:/dev/./urandom -jar /x1/jenkins/jenkins-slave/workspace/HBase-0.92-security/trunk/target/surefire/surefirebooter8278107985962749697.jar
/x1/jenkins/jenkins-slave/workspace/HBase-0.92-security/trunk/target/surefire/surefire6731376510960402946tmp
/x1/jenkins/jenkins-slave/workspace/HBase-0.92-security/trunk/target/surefire/surefire6273495324487125303tmp
Running org.apache.hadoop.hbase.mapred.TestTableMapReduce
Tests run: 1, Failures: 0, Errors: 0, Skipped: 0, Time elapsed: 69.468 sec
Forking command line: /bin/sh -c cd /x1/jenkins/jenkins-slave/workspace/HBase-0.92-security/trunk
&& /x1/jenkins/tools/java/jdk1.6.0_27-32/jre/bin/java -enableassertions -Xmx1400m
-Djava.security.egd=file:/dev/./urandom -jar /x1/jenkins/jenkins-slave/workspace/HBase-0.92-security/trunk/target/surefire/surefirebooter3220769825542047740.jar
/x1/jenkins/jenkins-slave/workspace/HBase-0.92-security/trunk/target/surefire/surefire5536533775829668965tmp
/x1/jenkins/jenkins-slave/workspace/HBase-0.92-security/trunk/target/surefire/surefire2457322906530608045tmp
Running org.apache.hadoop.hbase.replication.regionserver.TestReplicationSink
Tests run: 5, Failures: 0, Errors: 0, Skipped: 0, Time elapsed: 21.274 sec
Forking command line: /bin/sh -c cd /x1/jenkins/jenkins-slave/workspace/HBase-0.92-security/trunk
&& /x1/jenkins/tools/java/jdk1.6.0_27-32/jre/bin/java -enableassertions -Xmx1400m
-Djava.security.egd=file:/dev/./urandom -jar /x1/jenkins/jenkins-slave/workspace/HBase-0.92-security/trunk/target/surefire/surefirebooter6113215817186349111.jar
/x1/jenkins/jenkins-slave/workspace/HBase-0.92-security/trunk/target/surefire/surefire9135887131173610133tmp
/x1/jenkins/jenkins-slave/workspace/HBase-0.92-security/trunk/target/surefire/surefire8754395302982935399tmp
Running org.apache.hadoop.hbase.replication.regionserver.TestReplicationSourceManager
Tests run: 1, Failures: 0, Errors: 0, Skipped: 0, Time elapsed: 0.864 sec
Forking command line: /bin/sh -c cd /x1/jenkins/jenkins-slave/workspace/HBase-0.92-security/trunk
&& /x1/jenkins/tools/java/jdk1.6.0_27-32/jre/bin/java -enableassertions -Xmx1400m
-Djava.security.egd=file:/dev/./urandom -jar /x1/jenkins/jenkins-slave/workspace/HBase-0.92-security/trunk/target/surefire/surefirebooter5690065799452015244.jar
/x1/jenkins/jenkins-slave/workspace/HBase-0.92-security/trunk/target/surefire/surefire5007920581745553511tmp
/x1/jenkins/jenkins-slave/workspace/HBase-0.92-security/trunk/target/surefire/surefire7575083428674768557tmp
Running org.apache.hadoop.hbase.replication.TestReplicationSource
Tests run: 1, Failures: 0, Errors: 0, Skipped: 0, Time elapsed: 2.185 sec
Forking command line: /bin/sh -c cd /x1/jenkins/jenkins-slave/workspace/HBase-0.92-security/trunk
&& /x1/jenkins/tools/java/jdk1.6.0_27-32/jre/bin/java -enableassertions -Xmx1400m
-Djava.security.egd=file:/dev/./urandom -jar /x1/jenkins/jenkins-slave/workspace/HBase-0.92-security/trunk/target/surefire/surefirebooter4705738924818329937.jar
/x1/jenkins/jenkins-slave/workspace/HBase-0.92-security/trunk/target/surefire/surefire574433019058232697tmp
/x1/jenkins/jenkins-slave/workspace/HBase-0.92-security/trunk/target/surefire/surefire498227183551195857tmp
Running org.apache.hadoop.hbase.replication.TestReplication
Tests run: 7, Failures: 0, Errors: 0, Skipped: 0, Time elapsed: 120.698 sec
Forking command line: /bin/sh -c cd /x1/jenkins/jenkins-slave/workspace/HBase-0.92-security/trunk
&& /x1/jenkins/tools/java/jdk1.6.0_27-32/jre/bin/java -enableassertions -Xmx1400m
-Djava.security.egd=file:/dev/./urandom -jar /x1/jenkins/jenkins-slave/workspace/HBase-0.92-security/trunk/target/surefire/surefirebooter2115451983440393617.jar
/x1/jenkins/jenkins-slave/workspace/HBase-0.92-security/trunk/target/surefire/surefire9220219972741188740tmp
/x1/jenkins/jenkins-slave/workspace/HBase-0.92-security/trunk/target/surefire/surefire570022786268570024tmp
Running org.apache.hadoop.hbase.replication.TestReplicationPeer
Tests run: 1, Failures: 0, Errors: 0, Skipped: 0, Time elapsed: 25.487 sec
Forking command line: /bin/sh -c cd /x1/jenkins/jenkins-slave/workspace/HBase-0.92-security/trunk
&& /x1/jenkins/tools/java/jdk1.6.0_27-32/jre/bin/java -enableassertions -Xmx1400m
-Djava.security.egd=file:/dev/./urandom -jar /x1/jenkins/jenkins-slave/workspace/HBase-0.92-security/trunk/target/surefire/surefirebooter6036476298888410318.jar
/x1/jenkins/jenkins-slave/workspace/HBase-0.92-security/trunk/target/surefire/surefire4615702885130103244tmp
/x1/jenkins/jenkins-slave/workspace/HBase-0.92-security/trunk/target/surefire/surefire7549991131250111460tmp
Running org.apache.hadoop.hbase.replication.TestMultiSlaveReplication
Tests run: 1, Failures: 0, Errors: 0, Skipped: 0, Time elapsed: 59.11 sec
Forking command line: /bin/sh -c cd /x1/jenkins/jenkins-slave/workspace/HBase-0.92-security/trunk
&& /x1/jenkins/tools/java/jdk1.6.0_27-32/jre/bin/java -enableassertions -Xmx1400m
-Djava.security.egd=file:/dev/./urandom -jar /x1/jenkins/jenkins-slave/workspace/HBase-0.92-security/trunk/target/surefire/surefirebooter2184635229773271481.jar
/x1/jenkins/jenkins-slave/workspace/HBase-0.92-security/trunk/target/surefire/surefire3295652386791079912tmp
/x1/jenkins/jenkins-slave/workspace/HBase-0.92-security/trunk/target/surefire/surefire1671527905576411239tmp
Running org.apache.hadoop.hbase.replication.TestMasterReplication
Tests run: 2, Failures: 0, Errors: 0, Skipped: 0, Time elapsed: 90.901 sec
Forking command line: /bin/sh -c cd /x1/jenkins/jenkins-slave/workspace/HBase-0.92-security/trunk
&& /x1/jenkins/tools/java/jdk1.6.0_27-32/jre/bin/java -enableassertions -Xmx1400m
-Djava.security.egd=file:/dev/./urandom -jar /x1/jenkins/jenkins-slave/workspace/HBase-0.92-security/trunk/target/surefire/surefirebooter905181442444770835.jar
/x1/jenkins/jenkins-slave/workspace/HBase-0.92-security/trunk/target/surefire/surefire7961851159031895326tmp
/x1/jenkins/jenkins-slave/workspace/HBase-0.92-security/trunk/target/surefire/surefire8042591243846314445tmp
Running org.apache.hadoop.hbase.util.TestHBaseFsckComparator
Tests run: 7, Failures: 0, Errors: 0, Skipped: 0, Time elapsed: 0.128 sec
Forking command line: /bin/sh -c cd /x1/jenkins/jenkins-slave/workspace/HBase-0.92-security/trunk
&& /x1/jenkins/tools/java/jdk1.6.0_27-32/jre/bin/java -enableassertions -Xmx1400m
-Djava.security.egd=file:/dev/./urandom -jar /x1/jenkins/jenkins-slave/workspace/HBase-0.92-security/trunk/target/surefire/surefirebooter8236882710200212555.jar
/x1/jenkins/jenkins-slave/workspace/HBase-0.92-security/trunk/target/surefire/surefire3165818463548089555tmp
/x1/jenkins/jenkins-slave/workspace/HBase-0.92-security/trunk/target/surefire/surefire2836056062384079038tmp
Running org.apache.hadoop.hbase.util.TestMergeTool
Tests run: 1, Failures: 0, Errors: 0, Skipped: 0, Time elapsed: 338.756 sec
Forking command line: /bin/sh -c cd /x1/jenkins/jenkins-slave/workspace/HBase-0.92-security/trunk
&& /x1/jenkins/tools/java/jdk1.6.0_27-32/jre/bin/java -enableassertions -Xmx1400m
-Djava.security.egd=file:/dev/./urandom -jar /x1/jenkins/jenkins-slave/workspace/HBase-0.92-security/trunk/target/surefire/surefirebooter7384376538250210264.jar
/x1/jenkins/jenkins-slave/workspace/HBase-0.92-security/trunk/target/surefire/surefire5144175227373894768tmp
/x1/jenkins/jenkins-slave/workspace/HBase-0.92-security/trunk/target/surefire/surefire1247083833095712488tmp
Running org.apache.hadoop.hbase.util.TestFSTableDescriptors
Tests run: 10, Failures: 0, Errors: 0, Skipped: 0, Time elapsed: 0.723 sec
Forking command line: /bin/sh -c cd /x1/jenkins/jenkins-slave/workspace/HBase-0.92-security/trunk
&& /x1/jenkins/tools/java/jdk1.6.0_27-32/jre/bin/java -enableassertions -Xmx1400m
-Djava.security.egd=file:/dev/./urandom -jar /x1/jenkins/jenkins-slave/workspace/HBase-0.92-security/trunk/target/surefire/surefirebooter3384731568094142927.jar
/x1/jenkins/jenkins-slave/workspace/HBase-0.92-security/trunk/target/surefire/surefire3490782152676336762tmp
/x1/jenkins/jenkins-slave/workspace/HBase-0.92-security/trunk/target/surefire/surefire4289157845326424658tmp
Running org.apache.hadoop.hbase.util.TestIdLock
Tests run: 1, Failures: 0, Errors: 0, Skipped: 0, Time elapsed: 15.219 sec
Forking command line: /bin/sh -c cd /x1/jenkins/jenkins-slave/workspace/HBase-0.92-security/trunk
&& /x1/jenkins/tools/java/jdk1.6.0_27-32/jre/bin/java -enableassertions -Xmx1400m
-Djava.security.egd=file:/dev/./urandom -jar /x1/jenkins/jenkins-slave/workspace/HBase-0.92-security/trunk/target/surefire/surefirebooter2007491073972851083.jar
/x1/jenkins/jenkins-slave/workspace/HBase-0.92-security/trunk/target/surefire/surefire5650883933837245386tmp
/x1/jenkins/jenkins-slave/workspace/HBase-0.92-security/trunk/target/surefire/surefire4683122348761390748tmp
Running org.apache.hadoop.hbase.util.TestCompressionTest
Tests run: 1, Failures: 0, Errors: 0, Skipped: 0, Time elapsed: 0.29 sec
Forking command line: /bin/sh -c cd /x1/jenkins/jenkins-slave/workspace/HBase-0.92-security/trunk
&& /x1/jenkins/tools/java/jdk1.6.0_27-32/jre/bin/java -enableassertions -Xmx1400m
-Djava.security.egd=file:/dev/./urandom -jar /x1/jenkins/jenkins-slave/workspace/HBase-0.92-security/trunk/target/surefire/surefirebooter450420001757607988.jar
/x1/jenkins/jenkins-slave/workspace/HBase-0.92-security/trunk/target/surefire/surefire1013814457783927373tmp
/x1/jenkins/jenkins-slave/workspace/HBase-0.92-security/trunk/target/surefire/surefire3847537528512508881tmp
Running org.apache.hadoop.hbase.util.TestBytes
Tests run: 13, Failures: 0, Errors: 0, Skipped: 0, Time elapsed: 0.09 sec
Forking command line: /bin/sh -c cd /x1/jenkins/jenkins-slave/workspace/HBase-0.92-security/trunk
&& /x1/jenkins/tools/java/jdk1.6.0_27-32/jre/bin/java -enableassertions -Xmx1400m
-Djava.security.egd=file:/dev/./urandom -jar /x1/jenkins/jenkins-slave/workspace/HBase-0.92-security/trunk/target/surefire/surefirebooter3842429548949714381.jar
/x1/jenkins/jenkins-slave/workspace/HBase-0.92-security/trunk/target/surefire/surefire7012188058660432674tmp
/x1/jenkins/jenkins-slave/workspace/HBase-0.92-security/trunk/target/surefire/surefire8464933175594907016tmp
Running org.apache.hadoop.hbase.util.TestSortedCopyOnWriteSet
Tests run: 2, Failures: 0, Errors: 0, Skipped: 0, Time elapsed: 0.059 sec
Forking command line: /bin/sh -c cd /x1/jenkins/jenkins-slave/workspace/HBase-0.92-security/trunk
&& /x1/jenkins/tools/java/jdk1.6.0_27-32/jre/bin/java -enableassertions -Xmx1400m
-Djava.security.egd=file:/dev/./urandom -jar /x1/jenkins/jenkins-slave/workspace/HBase-0.92-security/trunk/target/surefire/surefirebooter7854319759722052594.jar
/x1/jenkins/jenkins-slave/workspace/HBase-0.92-security/trunk/target/surefire/surefire7505089852522283607tmp
/x1/jenkins/jenkins-slave/workspace/HBase-0.92-security/trunk/target/surefire/surefire1595558585669543303tmp
Running org.apache.hadoop.hbase.util.TestEnvironmentEdgeManager
Tests run: 2, Failures: 0, Errors: 0, Skipped: 0, Time elapsed: 0.165 sec
Forking command line: /bin/sh -c cd /x1/jenkins/jenkins-slave/workspace/HBase-0.92-security/trunk
&& /x1/jenkins/tools/java/jdk1.6.0_27-32/jre/bin/java -enableassertions -Xmx1400m
-Djava.security.egd=file:/dev/./urandom -jar /x1/jenkins/jenkins-slave/workspace/HBase-0.92-security/trunk/target/surefire/surefirebooter590702726749407148.jar
/x1/jenkins/jenkins-slave/workspace/HBase-0.92-security/trunk/target/surefire/surefire6222063491303851276tmp
/x1/jenkins/jenkins-slave/workspace/HBase-0.92-security/trunk/target/surefire/surefire6348803901895653556tmp
Running org.apache.hadoop.hbase.util.TestKeying
Tests run: 1, Failures: 0, Errors: 0, Skipped: 0, Time elapsed: 0.021 sec
Forking command line: /bin/sh -c cd /x1/jenkins/jenkins-slave/workspace/HBase-0.92-security/trunk
&& /x1/jenkins/tools/java/jdk1.6.0_27-32/jre/bin/java -enableassertions -Xmx1400m
-Djava.security.egd=file:/dev/./urandom -jar /x1/jenkins/jenkins-slave/workspace/HBase-0.92-security/trunk/target/surefire/surefirebooter552773955867726647.jar
/x1/jenkins/jenkins-slave/workspace/HBase-0.92-security/trunk/target/surefire/surefire1242592445072221326tmp
/x1/jenkins/jenkins-slave/workspace/HBase-0.92-security/trunk/target/surefire/surefire8250195707544392933tmp
Running org.apache.hadoop.hbase.util.TestByteBloomFilter
Tests run: 5, Failures: 0, Errors: 0, Skipped: 0, Time elapsed: 0.94 sec
Forking command line: /bin/sh -c cd /x1/jenkins/jenkins-slave/workspace/HBase-0.92-security/trunk
&& /x1/jenkins/tools/java/jdk1.6.0_27-32/jre/bin/java -enableassertions -Xmx1400m
-Djava.security.egd=file:/dev/./urandom -jar /x1/jenkins/jenkins-slave/workspace/HBase-0.92-security/trunk/target/surefire/surefirebooter4347442318972465666.jar
/x1/jenkins/jenkins-slave/workspace/HBase-0.92-security/trunk/target/surefire/surefire7763702994820314334tmp
/x1/jenkins/jenkins-slave/workspace/HBase-0.92-security/trunk/target/surefire/surefire6399487132978566535tmp
Running org.apache.hadoop.hbase.util.TestRootPath
Tests run: 1, Failures: 0, Errors: 0, Skipped: 0, Time elapsed: 0.085 sec
Forking command line: /bin/sh -c cd /x1/jenkins/jenkins-slave/workspace/HBase-0.92-security/trunk
&& /x1/jenkins/tools/java/jdk1.6.0_27-32/jre/bin/java -enableassertions -Xmx1400m
-Djava.security.egd=file:/dev/./urandom -jar /x1/jenkins/jenkins-slave/workspace/HBase-0.92-security/trunk/target/surefire/surefirebooter8271735710100068979.jar
/x1/jenkins/jenkins-slave/workspace/HBase-0.92-security/trunk/target/surefire/surefire6537585047702710958tmp
/x1/jenkins/jenkins-slave/workspace/HBase-0.92-security/trunk/target/surefire/surefire142750036767461146tmp
Running org.apache.hadoop.hbase.util.TestMergeTable
Tests run: 1, Failures: 0, Errors: 0, Skipped: 0, Time elapsed: 29.894 sec
Forking command line: /bin/sh -c cd /x1/jenkins/jenkins-slave/workspace/HBase-0.92-security/trunk
&& /x1/jenkins/tools/java/jdk1.6.0_27-32/jre/bin/java -enableassertions -Xmx1400m
-Djava.security.egd=file:/dev/./urandom -jar /x1/jenkins/jenkins-slave/workspace/HBase-0.92-security/trunk/target/surefire/surefirebooter6689505904106921562.jar
/x1/jenkins/jenkins-slave/workspace/HBase-0.92-security/trunk/target/surefire/surefire591111518827573743tmp
/x1/jenkins/jenkins-slave/workspace/HBase-0.92-security/trunk/target/surefire/surefire2628387141692063811tmp
Running org.apache.hadoop.hbase.util.TestHBaseFsck
Tests run: 6, Failures: 0, Errors: 0, Skipped: 0, Time elapsed: 41.809 sec
Forking command line: /bin/sh -c cd /x1/jenkins/jenkins-slave/workspace/HBase-0.92-security/trunk
&& /x1/jenkins/tools/java/jdk1.6.0_27-32/jre/bin/java -enableassertions -Xmx1400m
-Djava.security.egd=file:/dev/./urandom -jar /x1/jenkins/jenkins-slave/workspace/HBase-0.92-security/trunk/target/surefire/surefirebooter7369512524394903282.jar
/x1/jenkins/jenkins-slave/workspace/HBase-0.92-security/trunk/target/surefire/surefire7054160574229406332tmp
/x1/jenkins/jenkins-slave/workspace/HBase-0.92-security/trunk/target/surefire/surefire4607218785425797746tmp
Running org.apache.hadoop.hbase.util.TestFSUtils
Tests run: 2, Failures: 0, Errors: 0, Skipped: 0, Time elapsed: 19.662 sec
Forking command line: /bin/sh -c cd /x1/jenkins/jenkins-slave/workspace/HBase-0.92-security/trunk
&& /x1/jenkins/tools/java/jdk1.6.0_27-32/jre/bin/java -enableassertions -Xmx1400m
-Djava.security.egd=file:/dev/./urandom -jar /x1/jenkins/jenkins-slave/workspace/HBase-0.92-security/trunk/target/surefire/surefirebooter998830907875707385.jar
/x1/jenkins/jenkins-slave/workspace/HBase-0.92-security/trunk/target/surefire/surefire6678731254730192297tmp
/x1/jenkins/jenkins-slave/workspace/HBase-0.92-security/trunk/target/surefire/surefire6191553736477005368tmp
Running org.apache.hadoop.hbase.util.TestPoolMap
Tests run: 9, Failures: 0, Errors: 0, Skipped: 0, Time elapsed: 0.054 sec
Forking command line: /bin/sh -c cd /x1/jenkins/jenkins-slave/workspace/HBase-0.92-security/trunk
&& /x1/jenkins/tools/java/jdk1.6.0_27-32/jre/bin/java -enableassertions -Xmx1400m
-Djava.security.egd=file:/dev/./urandom -jar /x1/jenkins/jenkins-slave/workspace/HBase-0.92-security/trunk/target/surefire/surefirebooter1245710295347116662.jar
/x1/jenkins/jenkins-slave/workspace/HBase-0.92-security/trunk/target/surefire/surefire3816610150515946694tmp
/x1/jenkins/jenkins-slave/workspace/HBase-0.92-security/trunk/target/surefire/surefire7365383401251562143tmp
Running org.apache.hadoop.hbase.util.TestBase64
Tests run: 1, Failures: 0, Errors: 0, Skipped: 0, Time elapsed: 0.077 sec
Forking command line: /bin/sh -c cd /x1/jenkins/jenkins-slave/workspace/HBase-0.92-security/trunk
&& /x1/jenkins/tools/java/jdk1.6.0_27-32/jre/bin/java -enableassertions -Xmx1400m
-Djava.security.egd=file:/dev/./urandom -jar /x1/jenkins/jenkins-slave/workspace/HBase-0.92-security/trunk/target/surefire/surefirebooter5869230688912258599.jar
/x1/jenkins/jenkins-slave/workspace/HBase-0.92-security/trunk/target/surefire/surefire2513918377277012267tmp
/x1/jenkins/jenkins-slave/workspace/HBase-0.92-security/trunk/target/surefire/surefire5890462117766056923tmp
Running org.apache.hadoop.hbase.util.hbck.TestOfflineMetaRebuildBase
Tests run: 1, Failures: 0, Errors: 0, Skipped: 0, Time elapsed: 34.132 sec
Forking command line: /bin/sh -c cd /x1/jenkins/jenkins-slave/workspace/HBase-0.92-security/trunk
&& /x1/jenkins/tools/java/jdk1.6.0_27-32/jre/bin/java -enableassertions -Xmx1400m
-Djava.security.egd=file:/dev/./urandom -jar /x1/jenkins/jenkins-slave/workspace/HBase-0.92-security/trunk/target/surefire/surefirebooter3689762555498149357.jar
/x1/jenkins/jenkins-slave/workspace/HBase-0.92-security/trunk/target/surefire/surefire7363333005310698769tmp
/x1/jenkins/jenkins-slave/workspace/HBase-0.92-security/trunk/target/surefire/surefire3888044111225020294tmp
Running org.apache.hadoop.hbase.util.hbck.TestOfflineMetaRebuildOverlap
Tests run: 1, Failures: 0, Errors: 0, Skipped: 0, Time elapsed: 32.41 sec
Forking command line: /bin/sh -c cd /x1/jenkins/jenkins-slave/workspace/HBase-0.92-security/trunk
&& /x1/jenkins/tools/java/jdk1.6.0_27-32/jre/bin/java -enableassertions -Xmx1400m
-Djava.security.egd=file:/dev/./urandom -jar /x1/jenkins/jenkins-slave/workspace/HBase-0.92-security/trunk/target/surefire/surefirebooter1775212234548540559.jar
/x1/jenkins/jenkins-slave/workspace/HBase-0.92-security/trunk/target/surefire/surefire6840948790237796706tmp
/x1/jenkins/jenkins-slave/workspace/HBase-0.92-security/trunk/target/surefire/surefire882303808521494454tmp
Running org.apache.hadoop.hbase.util.hbck.TestOfflineMetaRebuildHole
Tests run: 1, Failures: 0, Errors: 0, Skipped: 0, Time elapsed: 31.985 sec
Forking command line: /bin/sh -c cd /x1/jenkins/jenkins-slave/workspace/HBase-0.92-security/trunk
&& /x1/jenkins/tools/java/jdk1.6.0_27-32/jre/bin/java -enableassertions -Xmx1400m
-Djava.security.egd=file:/dev/./urandom -jar /x1/jenkins/jenkins-slave/workspace/HBase-0.92-security/trunk/target/surefire/surefirebooter3993532586929234831.jar
/x1/jenkins/jenkins-slave/workspace/HBase-0.92-security/trunk/target/surefire/surefire3278760214884207506tmp
/x1/jenkins/jenkins-slave/workspace/HBase-0.92-security/trunk/target/surefire/surefire3526022047160831147tmp
Running org.apache.hadoop.hbase.util.TestDefaultEnvironmentEdge
Tests run: 1, Failures: 0, Errors: 0, Skipped: 0, Time elapsed: 0.044 sec
Forking command line: /bin/sh -c cd /x1/jenkins/jenkins-slave/workspace/HBase-0.92-security/trunk
&& /x1/jenkins/tools/java/jdk1.6.0_27-32/jre/bin/java -enableassertions -Xmx1400m
-Djava.security.egd=file:/dev/./urandom -jar /x1/jenkins/jenkins-slave/workspace/HBase-0.92-security/trunk/target/surefire/surefirebooter150547586850958720.jar
/x1/jenkins/jenkins-slave/workspace/HBase-0.92-security/trunk/target/surefire/surefire4697773914270444718tmp
/x1/jenkins/jenkins-slave/workspace/HBase-0.92-security/trunk/target/surefire/surefire2846938421077535505tmp
Running org.apache.hadoop.hbase.util.TestIncrementingEnvironmentEdge
Tests run: 1, Failures: 0, Errors: 0, Skipped: 0, Time elapsed: 0.044 sec
Forking command line: /bin/sh -c cd /x1/jenkins/jenkins-slave/workspace/HBase-0.92-security/trunk
&& /x1/jenkins/tools/java/jdk1.6.0_27-32/jre/bin/java -enableassertions -Xmx1400m
-Djava.security.egd=file:/dev/./urandom -jar /x1/jenkins/jenkins-slave/workspace/HBase-0.92-security/trunk/target/surefire/surefirebooter8210813219889541507.jar
/x1/jenkins/jenkins-slave/workspace/HBase-0.92-security/trunk/target/surefire/surefire4460421336690066010tmp
/x1/jenkins/jenkins-slave/workspace/HBase-0.92-security/trunk/target/surefire/surefire4094973096903277816tmp
Running org.apache.hadoop.hbase.util.TestRegionSplitCalculator
Tests run: 14, Failures: 0, Errors: 0, Skipped: 0, Time elapsed: 0.143 sec
Forking command line: /bin/sh -c cd /x1/jenkins/jenkins-slave/workspace/HBase-0.92-security/trunk
&& /x1/jenkins/tools/java/jdk1.6.0_27-32/jre/bin/java -enableassertions -Xmx1400m
-Djava.security.egd=file:/dev/./urandom -jar /x1/jenkins/jenkins-slave/workspace/HBase-0.92-security/trunk/target/surefire/surefirebooter6227141711582509566.jar
/x1/jenkins/jenkins-slave/workspace/HBase-0.92-security/trunk/target/surefire/surefire8583648993917579678tmp
/x1/jenkins/jenkins-slave/workspace/HBase-0.92-security/trunk/target/surefire/surefire1201108926600090790tmp
Running org.apache.hadoop.hbase.TestHRegionLocation
Tests run: 3, Failures: 0, Errors: 0, Skipped: 0, Time elapsed: 0.108 sec
Forking command line: /bin/sh -c cd /x1/jenkins/jenkins-slave/workspace/HBase-0.92-security/trunk
&& /x1/jenkins/tools/java/jdk1.6.0_27-32/jre/bin/java -enableassertions -Xmx1400m
-Djava.security.egd=file:/dev/./urandom -jar /x1/jenkins/jenkins-slave/workspace/HBase-0.92-security/trunk/target/surefire/surefirebooter8970915190464307603.jar
/x1/jenkins/jenkins-slave/workspace/HBase-0.92-security/trunk/target/surefire/surefire4942305908060771570tmp
/x1/jenkins/jenkins-slave/workspace/HBase-0.92-security/trunk/target/surefire/surefire8188821403588841835tmp
Running org.apache.hadoop.hbase.migration.TestMigrationFrom090To092
Tests run: 1, Failures: 0, Errors: 0, Skipped: 0, Time elapsed: 0.215 sec
Forking command line: /bin/sh -c cd /x1/jenkins/jenkins-slave/workspace/HBase-0.92-security/trunk
&& /x1/jenkins/tools/java/jdk1.6.0_27-32/jre/bin/java -enableassertions -Xmx1400m
-Djava.security.egd=file:/dev/./urandom -jar /x1/jenkins/jenkins-slave/workspace/HBase-0.92-security/trunk/target/surefire/surefirebooter1703968596454358453.jar
/x1/jenkins/jenkins-slave/workspace/HBase-0.92-security/trunk/target/surefire/surefire6195273762311790155tmp
/x1/jenkins/jenkins-slave/workspace/HBase-0.92-security/trunk/target/surefire/surefire8807832244311641935tmp
Running org.apache.hadoop.hbase.TestCompare
Tests run: 1, Failures: 0, Errors: 0, Skipped: 0, Time elapsed: 0.183 sec
Forking command line: /bin/sh -c cd /x1/jenkins/jenkins-slave/workspace/HBase-0.92-security/trunk
&& /x1/jenkins/tools/java/jdk1.6.0_27-32/jre/bin/java -enableassertions -Xmx1400m
-Djava.security.egd=file:/dev/./urandom -jar /x1/jenkins/jenkins-slave/workspace/HBase-0.92-security/trunk/target/surefire/surefirebooter274877780499933671.jar
/x1/jenkins/jenkins-slave/workspace/HBase-0.92-security/trunk/target/surefire/surefire7903095052579948065tmp
/x1/jenkins/jenkins-slave/workspace/HBase-0.92-security/trunk/target/surefire/surefire5917677354738038590tmp
Running org.apache.hadoop.hbase.TestInfoServers
Tests run: 2, Failures: 0, Errors: 0, Skipped: 0, Time elapsed: 16.634 sec
Forking command line: /bin/sh -c cd /x1/jenkins/jenkins-slave/workspace/HBase-0.92-security/trunk
&& /x1/jenkins/tools/java/jdk1.6.0_27-32/jre/bin/java -enableassertions -Xmx1400m
-Djava.security.egd=file:/dev/./urandom -jar /x1/jenkins/jenkins-slave/workspace/HBase-0.92-security/trunk/target/surefire/surefirebooter6816651799577452431.jar
/x1/jenkins/jenkins-slave/workspace/HBase-0.92-security/trunk/target/surefire/surefire5713642377590367557tmp
/x1/jenkins/jenkins-slave/workspace/HBase-0.92-security/trunk/target/surefire/surefire7683860126078480777tmp
Running org.apache.hadoop.hbase.TestHServerAddress
Tests run: 6, Failures: 0, Errors: 0, Skipped: 0, Time elapsed: 0.053 sec
Forking command line: /bin/sh -c cd /x1/jenkins/jenkins-slave/workspace/HBase-0.92-security/trunk
&& /x1/jenkins/tools/java/jdk1.6.0_27-32/jre/bin/java -enableassertions -Xmx1400m
-Djava.security.egd=file:/dev/./urandom -jar /x1/jenkins/jenkins-slave/workspace/HBase-0.92-security/trunk/target/surefire/surefirebooter3825551299974440784.jar
/x1/jenkins/jenkins-slave/workspace/HBase-0.92-security/trunk/target/surefire/surefire8290774652239357951tmp
/x1/jenkins/jenkins-slave/workspace/HBase-0.92-security/trunk/target/surefire/surefire4060777610061494850tmp
Running org.apache.hadoop.hbase.TestServerName
Tests run: 4, Failures: 0, Errors: 0, Skipped: 0, Time elapsed: 0.135 sec

Results :

Tests in error: 
  testMasterFailoverWithMockedRIT(org.apache.hadoop.hbase.master.TestMasterFailover): test
timed out after 180000 milliseconds

Tests run: 1101, Failures: 0, Errors: 1, Skipped: 8

[INFO] ------------------------------------------------------------------------
[INFO] BUILD FAILURE
[INFO] ------------------------------------------------------------------------
[INFO] Total time: 1:48:08.911s
[INFO] Finished at: Sun Dec 18 17:10:10 UTC 2011
[INFO] Final Memory: 39M/694M
[INFO] ------------------------------------------------------------------------
[ERROR] Failed to execute goal org.apache.maven.plugins:maven-surefire-plugin:2.10:test (default-test)
on project hbase: There are test failures.
[ERROR] 
[ERROR] Please refer to /x1/jenkins/jenkins-slave/workspace/HBase-0.92-security/trunk/target/surefire-reports
for the individual test results.
[ERROR] -> [Help 1]
org.apache.maven.lifecycle.LifecycleExecutionException: Failed to execute goal org.apache.maven.plugins:maven-surefire-plugin:2.10:test
(default-test) on project hbase: There are test failures.

Please refer to /x1/jenkins/jenkins-slave/workspace/HBase-0.92-security/trunk/target/surefire-reports
for the individual test results.
	at org.apache.maven.lifecycle.internal.MojoExecutor.execute(MojoExecutor.java:213)
	at org.apache.maven.lifecycle.internal.MojoExecutor.execute(MojoExecutor.java:153)
	at org.apache.maven.lifecycle.internal.MojoExecutor.execute(MojoExecutor.java:145)
	at org.apache.maven.lifecycle.internal.MojoExecutor.executeForkedExecutions(MojoExecutor.java:365)
	at org.apache.maven.lifecycle.internal.MojoExecutor.execute(MojoExecutor.java:199)
	at org.apache.maven.lifecycle.internal.MojoExecutor.execute(MojoExecutor.java:153)
	at org.apache.maven.lifecycle.internal.MojoExecutor.execute(MojoExecutor.java:145)
	at org.apache.maven.lifecycle.internal.LifecycleModuleBuilder.buildProject(LifecycleModuleBuilder.java:84)
	at org.apache.maven.lifecycle.internal.LifecycleModuleBuilder.buildProject(LifecycleModuleBuilder.java:59)
	at org.apache.maven.lifecycle.internal.LifecycleStarter.singleThreadedBuild(LifecycleStarter.java:183)
	at org.apache.maven.lifecycle.internal.LifecycleStarter.execute(LifecycleStarter.java:161)
	at org.apache.maven.DefaultMaven.doExecute(DefaultMaven.java:319)
	at org.apache.maven.DefaultMaven.execute(DefaultMaven.java:156)
	at org.apache.maven.cli.MavenCli.execute(MavenCli.java:537)
	at org.apache.maven.cli.MavenCli.doMain(MavenCli.java:196)
	at org.apache.maven.cli.MavenCli.main(MavenCli.java:141)
	at sun.reflect.NativeMethodAccessorImpl.invoke0(Native Method)
	at sun.reflect.NativeMethodAccessorImpl.invoke(NativeMethodAccessorImpl.java:39)
	at sun.reflect.DelegatingMethodAccessorImpl.invoke(DelegatingMethodAccessorImpl.java:25)
	at java.lang.reflect.Method.invoke(Method.java:597)
	at org.codehaus.plexus.classworlds.launcher.Launcher.launchEnhanced(Launcher.java:290)
	at org.codehaus.plexus.classworlds.launcher.Launcher.launch(Launcher.java:230)
	at org.codehaus.plexus.classworlds.launcher.Launcher.mainWithExitCode(Launcher.java:409)
	at org.codehaus.plexus.classworlds.launcher.Launcher.main(Launcher.java:352)
Caused by: org.apache.maven.plugin.MojoFailureException: There are test failures.

Please refer to /x1/jenkins/jenkins-slave/workspace/HBase-0.92-security/trunk/target/surefire-reports
for the individual test results.
	at org.apache.maven.plugin.surefire.SurefireHelper.reportExecution(SurefireHelper.java:87)
	at org.apache.maven.plugin.surefire.SurefirePlugin.writeSummary(SurefirePlugin.java:641)
	at org.apache.maven.plugin.surefire.SurefirePlugin.handleSummary(SurefirePlugin.java:615)
	at org.apache.maven.plugin.surefire.AbstractSurefireMojo.executeAfterPreconditionsChecked(AbstractSurefireMojo.java:137)
	at org.apache.maven.plugin.surefire.AbstractSurefireMojo.execute(AbstractSurefireMojo.java:98)
	at org.apache.maven.plugin.DefaultBuildPluginManager.executeMojo(DefaultBuildPluginManager.java:101)
	at org.apache.maven.lifecycle.internal.MojoExecutor.execute(MojoExecutor.java:209)
	... 23 more
[ERROR] 
[ERROR] 
[ERROR] For more information about the errors and possible solutions, please read the following
articles:
[ERROR] [Help 1] http://cwiki.apache.org/confluence/display/MAVEN/MojoFailureException
Build step 'Invoke top-level Maven targets' marked build as failure
[locks-and-latches] Releasing all the locks
[locks-and-latches] All the locks released
Archiving artifacts
Recording test results


Mime
View raw message