hbase-dev mailing list archives

Site index · List index
Message view « Date » · « Thread »
Top « Date » · « Thread »
From Stack <st...@duboce.net>
Subject Re: Build failed in Jenkins: HBase-TRUNK #2468
Date Mon, 21 Nov 2011 19:41:41 GMT
Is this the just committed online schema change test that is failing?

On Mon, Nov 21, 2011 at 11:30 AM, Apache Jenkins Server
<jenkins@builds.apache.org> wrote:
> See <https://builds.apache.org/job/HBase-TRUNK/2468/changes>
>
> Changes:
>
> [tedyu] HBASE-4213 Support for fault tolerant, instant schema updates with out master's
intervention through ZK
>
> ------------------------------------------
> [...truncated 2133 lines...]
> Running org.apache.hadoop.hbase.coprocessor.TestAggregateProtocol
> Tests run: 44, Failures: 0, Errors: 0, Skipped: 0, Time elapsed: 1.369 sec
> Running org.apache.hadoop.hbase.coprocessor.TestMasterObserver
> Tests run: 3, Failures: 0, Errors: 0, Skipped: 0, Time elapsed: 14.969 sec
> Running org.apache.hadoop.hbase.coprocessor.TestCoprocessorEndpoint
> Tests run: 2, Failures: 0, Errors: 0, Skipped: 0, Time elapsed: 0.515 sec
> Running org.apache.hadoop.hbase.coprocessor.TestRegionObserverStacking
> Tests run: 1, Failures: 0, Errors: 0, Skipped: 0, Time elapsed: 0.638 sec
> Running org.apache.hadoop.hbase.coprocessor.TestClassLoading
> Tests run: 5, Failures: 0, Errors: 0, Skipped: 0, Time elapsed: 17.493 sec
> Running org.apache.hadoop.hbase.coprocessor.TestRegionObserverInterface
> Tests run: 5, Failures: 0, Errors: 0, Skipped: 0, Time elapsed: 19.19 sec
> Running org.apache.hadoop.hbase.coprocessor.TestMasterCoprocessorExceptionWithRemove
> Tests run: 1, Failures: 0, Errors: 0, Skipped: 0, Time elapsed: 4.09 sec
> Running org.apache.hadoop.hbase.coprocessor.TestRegionServerCoprocessorExceptionWithRemove
> Tests run: 1, Failures: 0, Errors: 0, Skipped: 0, Time elapsed: 5.627 sec
> Running org.apache.hadoop.hbase.coprocessor.TestMasterCoprocessorExceptionWithAbort
> Tests run: 1, Failures: 0, Errors: 0, Skipped: 0, Time elapsed: 1.01 sec
> Running org.apache.hadoop.hbase.coprocessor.TestWALObserver
> Tests run: 3, Failures: 0, Errors: 0, Skipped: 0, Time elapsed: 3.903 sec
> Running org.apache.hadoop.hbase.coprocessor.TestCoprocessorInterface
> Tests run: 1, Failures: 0, Errors: 0, Skipped: 0, Time elapsed: 3.37 sec
> Running org.apache.hadoop.hbase.coprocessor.TestRegionServerCoprocessorExceptionWithAbort
> Tests run: 1, Failures: 0, Errors: 0, Skipped: 0, Time elapsed: 2.673 sec
> Running org.apache.hadoop.hbase.coprocessor.TestRegionObserverBypass
> Tests run: 2, Failures: 0, Errors: 0, Skipped: 0, Time elapsed: 0.057 sec
> Running org.apache.hadoop.hbase.thrift2.TestThriftHBaseServiceHandler
> Tests run: 11, Failures: 0, Errors: 0, Skipped: 0, Time elapsed: 0.142 sec
> Running org.apache.hadoop.hbase.TestCompare
> Tests run: 1, Failures: 0, Errors: 0, Skipped: 0, Time elapsed: 0.224 sec
> Running org.apache.hadoop.hbase.avro.TestAvroServer
> Tests run: 3, Failures: 0, Errors: 0, Skipped: 0, Time elapsed: 15.421 sec
> Running org.apache.hadoop.hbase.avro.TestAvroUtil
> Tests run: 1, Failures: 0, Errors: 0, Skipped: 0, Time elapsed: 0.579 sec
> Running org.apache.hadoop.hbase.thrift.TestThriftServer
> Tests run: 1, Failures: 0, Errors: 0, Skipped: 0, Time elapsed: 7.291 sec
> Running org.apache.hadoop.hbase.monitoring.TestTaskMonitor
> Tests run: 3, Failures: 0, Errors: 0, Skipped: 0, Time elapsed: 0.172 sec
> Running org.apache.hadoop.hbase.monitoring.TestMemoryBoundedLogMessageBuffer
> Tests run: 2, Failures: 0, Errors: 0, Skipped: 0, Time elapsed: 0.045 sec
> Running org.apache.hadoop.hbase.regionserver.TestHRegionInfo
> Tests run: 3, Failures: 0, Errors: 0, Skipped: 0, Time elapsed: 0.549 sec
> Running org.apache.hadoop.hbase.regionserver.TestMemStore
> Tests run: 21, Failures: 0, Errors: 0, Skipped: 0, Time elapsed: 31.266 sec
> Running org.apache.hadoop.hbase.regionserver.TestHRegion
> Tests run: 57, Failures: 0, Errors: 0, Skipped: 0, Time elapsed: 30.045 sec
> Running org.apache.hadoop.hbase.regionserver.TestMasterAddressManager
> Tests run: 1, Failures: 0, Errors: 0, Skipped: 0, Time elapsed: 0.114 sec
> Running org.apache.hadoop.hbase.regionserver.TestRegionServerMetrics
> Tests run: 1, Failures: 0, Errors: 0, Skipped: 0, Time elapsed: 34.582 sec
> Running org.apache.hadoop.hbase.regionserver.TestCompoundBloomFilter
> Tests run: 3, Failures: 0, Errors: 0, Skipped: 0, Time elapsed: 24.652 sec
> Running org.apache.hadoop.hbase.regionserver.TestSplitLogWorker
> Tests run: 5, Failures: 0, Errors: 0, Skipped: 0, Time elapsed: 1.804 sec
> Running org.apache.hadoop.hbase.regionserver.TestServerCustomProtocol
> Tests run: 7, Failures: 0, Errors: 0, Skipped: 0, Time elapsed: 0.92 sec
> Running org.apache.hadoop.hbase.regionserver.TestScanWithBloomError
> Tests run: 3, Failures: 0, Errors: 0, Skipped: 0, Time elapsed: 0.752 sec
> Running org.apache.hadoop.hbase.regionserver.TestStoreFileBlockCacheSummary
> Tests run: 1, Failures: 0, Errors: 0, Skipped: 0, Time elapsed: 3.942 sec
> Running org.apache.hadoop.hbase.regionserver.TestStore
> Tests run: 11, Failures: 0, Errors: 0, Skipped: 0, Time elapsed: 1.285 sec
> Running org.apache.hadoop.hbase.regionserver.TestAtomicOperation
> Tests run: 3, Failures: 0, Errors: 0, Skipped: 0, Time elapsed: 6.695 sec
> Running org.apache.hadoop.hbase.regionserver.TestBlocksRead
> Tests run: 4, Failures: 0, Errors: 0, Skipped: 0, Time elapsed: 0.912 sec
> Running org.apache.hadoop.hbase.regionserver.TestFSErrorsExposed
> Tests run: 3, Failures: 0, Errors: 0, Skipped: 0, Time elapsed: 29.014 sec
> Running org.apache.hadoop.hbase.regionserver.TestSeekOptimizations
> Tests run: 6, Failures: 0, Errors: 0, Skipped: 0, Time elapsed: 2.897 sec
> Running org.apache.hadoop.hbase.regionserver.TestKeepDeletes
> Tests run: 11, Failures: 0, Errors: 0, Skipped: 0, Time elapsed: 1.128 sec
> Running org.apache.hadoop.hbase.regionserver.metrics.TestSchemaConfigured
> Tests run: 11, Failures: 0, Errors: 0, Skipped: 0, Time elapsed: 0.112 sec
> Running org.apache.hadoop.hbase.regionserver.metrics.TestSchemaMetrics
> Tests run: 4, Failures: 0, Errors: 0, Skipped: 0, Time elapsed: 16.925 sec
> Running org.apache.hadoop.hbase.regionserver.handler.TestCloseRegionHandler
> Tests run: 1, Failures: 0, Errors: 0, Skipped: 0, Time elapsed: 0.558 sec
> Running org.apache.hadoop.hbase.regionserver.handler.TestOpenRegionHandler
> Tests run: 3, Failures: 0, Errors: 0, Skipped: 0, Time elapsed: 0.47 sec
> Running org.apache.hadoop.hbase.regionserver.TestScanDeleteTracker
> Tests run: 6, Failures: 0, Errors: 0, Skipped: 0, Time elapsed: 0.232 sec
> Running org.apache.hadoop.hbase.regionserver.TestSplitTransactionOnCluster
> Tests run: 4, Failures: 0, Errors: 0, Skipped: 0, Time elapsed: 29.614 sec
> Running org.apache.hadoop.hbase.regionserver.TestHRegionServerBulkLoad
> Tests run: 1, Failures: 0, Errors: 0, Skipped: 0, Time elapsed: 46.079 sec
> Running org.apache.hadoop.hbase.regionserver.TestSplitTransaction
> Tests run: 6, Failures: 0, Errors: 0, Skipped: 0, Time elapsed: 3.404 sec
> Running org.apache.hadoop.hbase.regionserver.TestReadWriteConsistencyControl
> Tests run: 1, Failures: 0, Errors: 0, Skipped: 0, Time elapsed: 10.083 sec
> Running org.apache.hadoop.hbase.regionserver.TestKeyValueHeap
> Tests run: 3, Failures: 0, Errors: 0, Skipped: 0, Time elapsed: 0.24 sec
> Running org.apache.hadoop.hbase.regionserver.TestCompactSelection
> Tests run: 1, Failures: 0, Errors: 0, Skipped: 0, Time elapsed: 0.391 sec
> Running org.apache.hadoop.hbase.regionserver.TestMinVersions
> Tests run: 6, Failures: 0, Errors: 0, Skipped: 0, Time elapsed: 0.856 sec
> Running org.apache.hadoop.hbase.regionserver.TestWideScanner
> Tests run: 1, Failures: 0, Errors: 0, Skipped: 0, Time elapsed: 1.634 sec
> Running org.apache.hadoop.hbase.regionserver.TestColumnSeeking
> Tests run: 2, Failures: 0, Errors: 0, Skipped: 0, Time elapsed: 4.465 sec
> Running org.apache.hadoop.hbase.regionserver.TestGetClosestAtOrBefore
> Tests run: 3, Failures: 0, Errors: 0, Skipped: 0, Time elapsed: 0.908 sec
> Running org.apache.hadoop.hbase.regionserver.TestExplicitColumnTracker
> Tests run: 4, Failures: 0, Errors: 0, Skipped: 0, Time elapsed: 0.584 sec
> Running org.apache.hadoop.hbase.regionserver.TestMemStoreLAB
> Tests run: 3, Failures: 0, Errors: 0, Skipped: 0, Time elapsed: 1.429 sec
> Running org.apache.hadoop.hbase.regionserver.TestParallelPut
> Tests run: 2, Failures: 0, Errors: 0, Skipped: 0, Time elapsed: 5.002 sec
> Running org.apache.hadoop.hbase.regionserver.TestKeyValueScanFixture
> Tests run: 1, Failures: 0, Errors: 0, Skipped: 0, Time elapsed: 0.103 sec
> Running org.apache.hadoop.hbase.regionserver.wal.TestHLogBench
> Tests run: 1, Failures: 0, Errors: 0, Skipped: 0, Time elapsed: 0.99 sec
> Running org.apache.hadoop.hbase.regionserver.wal.TestLogRollAbort
> Tests run: 1, Failures: 0, Errors: 0, Skipped: 0, Time elapsed: 160.95 sec
> Running org.apache.hadoop.hbase.regionserver.wal.TestWALActionsListener
> Tests run: 1, Failures: 0, Errors: 0, Skipped: 0, Time elapsed: 0.134 sec
> Running org.apache.hadoop.hbase.regionserver.wal.TestLogRolling
> Tests run: 3, Failures: 0, Errors: 0, Skipped: 0, Time elapsed: 322.632 sec
> Running org.apache.hadoop.hbase.regionserver.wal.TestHLog
> Tests run: 9, Failures: 0, Errors: 0, Skipped: 0, Time elapsed: 51.682 sec
> Running org.apache.hadoop.hbase.regionserver.wal.TestHLogSplit
> Tests run: 29, Failures: 0, Errors: 0, Skipped: 1, Time elapsed: 227.502 sec
> Running org.apache.hadoop.hbase.regionserver.wal.TestWALReplay
> Tests run: 5, Failures: 0, Errors: 0, Skipped: 0, Time elapsed: 22.055 sec
> Running org.apache.hadoop.hbase.regionserver.wal.TestHLogMethods
> Tests run: 3, Failures: 0, Errors: 0, Skipped: 0, Time elapsed: 0.491 sec
> Running org.apache.hadoop.hbase.regionserver.TestRSStatusServlet
> Tests run: 2, Failures: 0, Errors: 0, Skipped: 0, Time elapsed: 0.467 sec
> Running org.apache.hadoop.hbase.regionserver.TestStoreScanner
> Tests run: 14, Failures: 0, Errors: 0, Skipped: 0, Time elapsed: 0.027 sec
> Running org.apache.hadoop.hbase.regionserver.TestResettingCounters
> Tests run: 1, Failures: 0, Errors: 0, Skipped: 0, Time elapsed: 0.707 sec
> Running org.apache.hadoop.hbase.regionserver.TestStoreFile
> Tests run: 9, Failures: 0, Errors: 0, Skipped: 0, Time elapsed: 1.472 sec
> Running org.apache.hadoop.hbase.regionserver.TestEndToEndSplitTransaction
> Tests run: 1, Failures: 0, Errors: 0, Skipped: 0, Time elapsed: 29.673 sec
> Running org.apache.hadoop.hbase.regionserver.TestScanWildcardColumnTracker
> Tests run: 2, Failures: 0, Errors: 0, Skipped: 0, Time elapsed: 0.231 sec
> Running org.apache.hadoop.hbase.regionserver.TestCompaction
> Tests run: 10, Failures: 0, Errors: 0, Skipped: 0, Time elapsed: 11.927 sec
> Running org.apache.hadoop.hbase.regionserver.TestQueryMatcher
> Tests run: 4, Failures: 0, Errors: 0, Skipped: 0, Time elapsed: 0.235 sec
> Running org.apache.hadoop.hbase.regionserver.TestRpcMetrics
> Tests run: 1, Failures: 0, Errors: 0, Skipped: 0, Time elapsed: 1.598 sec
> Running org.apache.hadoop.hbase.regionserver.TestScanner
> Tests run: 6, Failures: 0, Errors: 0, Skipped: 0, Time elapsed: 4.16 sec
> Running org.apache.hadoop.hbase.regionserver.TestMultiColumnScanner
> Tests run: 6, Failures: 0, Errors: 0, Skipped: 0, Time elapsed: 20.119 sec
> Running org.apache.hadoop.hbase.regionserver.TestRegionSplitPolicy
> Tests run: 3, Failures: 0, Errors: 0, Skipped: 0, Time elapsed: 0.672 sec
> Running org.apache.hadoop.hbase.regionserver.TestKeyValueSkipListSet
> Tests run: 4, Failures: 0, Errors: 0, Skipped: 0, Time elapsed: 0.008 sec
> Running org.apache.hadoop.hbase.mapred.TestTableMapReduce
> Tests run: 1, Failures: 0, Errors: 0, Skipped: 0, Time elapsed: 36.679 sec
> Running org.apache.hadoop.hbase.mapred.TestTableInputFormat
> Tests run: 6, Failures: 0, Errors: 0, Skipped: 0, Time elapsed: 10.634 sec
> Running org.apache.hadoop.hbase.TestDrainingServer
> Tests run: 2, Failures: 0, Errors: 0, Skipped: 0, Time elapsed: 2.239 sec
> Running org.apache.hadoop.hbase.TestFSTableDescriptorForceCreation
> Tests run: 3, Failures: 0, Errors: 0, Skipped: 0, Time elapsed: 0.243 sec
> Running org.apache.hadoop.hbase.executor.TestExecutorService
> Tests run: 1, Failures: 0, Errors: 0, Skipped: 0, Time elapsed: 2.317 sec
> Running org.apache.hadoop.hbase.mapreduce.TestTimeRangeMapRed
> Tests run: 1, Failures: 0, Errors: 0, Skipped: 0, Time elapsed: 27.581 sec
> Running org.apache.hadoop.hbase.mapreduce.TestHFileOutputFormat
> Tests run: 9, Failures: 0, Errors: 0, Skipped: 0, Time elapsed: 202.698 sec
> Running org.apache.hadoop.hbase.mapreduce.TestImportTsv
> Tests run: 8, Failures: 0, Errors: 0, Skipped: 0, Time elapsed: 37.468 sec
> Running org.apache.hadoop.hbase.mapreduce.TestTableInputFormatScan
> Tests run: 11, Failures: 0, Errors: 0, Skipped: 0, Time elapsed: 431.943 sec
> Running org.apache.hadoop.hbase.mapreduce.TestLoadIncrementalHFilesSplitRecovery
> Tests run: 4, Failures: 0, Errors: 0, Skipped: 0, Time elapsed: 38.671 sec
> Running org.apache.hadoop.hbase.mapreduce.TestTableSplit
> Tests run: 1, Failures: 0, Errors: 0, Skipped: 0, Time elapsed: 0.083 sec
> Running org.apache.hadoop.hbase.mapreduce.TestSimpleTotalOrderPartitioner
> Tests run: 1, Failures: 0, Errors: 0, Skipped: 0, Time elapsed: 0.226 sec
> Running org.apache.hadoop.hbase.mapreduce.TestTableMapReduce
> Tests run: 1, Failures: 0, Errors: 0, Skipped: 0, Time elapsed: 66.572 sec
> Running org.apache.hadoop.hbase.mapreduce.TestLoadIncrementalHFiles
> Tests run: 6, Failures: 0, Errors: 0, Skipped: 0, Time elapsed: 19.363 sec
> Running org.apache.hadoop.hbase.TestHRegionLocation
> Tests run: 3, Failures: 0, Errors: 0, Skipped: 0, Time elapsed: 0.088 sec
>
> Results :
>
> Failed tests:   testInstantSchemaOperationsInZKForMasterFailover(org.apache.hadoop.hbase.client.TestInstantSchemaChangeFailover)
>
> Tests run: 1151, Failures: 1, Errors: 0, Skipped: 7
>
> [INFO] ------------------------------------------------------------------------
> [INFO] BUILD FAILURE
> [INFO] ------------------------------------------------------------------------
> [INFO] Total time: 1:48:30.894s
> [INFO] Finished at: Mon Nov 21 19:29:42 UTC 2011
> [INFO] Final Memory: 38M/962M
> [INFO] ------------------------------------------------------------------------
> [ERROR] Failed to execute goal org.apache.maven.plugins:maven-surefire-plugin:2.11-TRUNK-HBASE-2:test
(default-test) on project hbase: There are test failures.
> [ERROR]
> [ERROR] Please refer to <https://builds.apache.org/job/HBase-TRUNK/ws/trunk/target/surefire-reports>
for the individual test results.
> [ERROR] -> [Help 1]
> org.apache.maven.lifecycle.LifecycleExecutionException: Failed to execute goal org.apache.maven.plugins:maven-surefire-plugin:2.11-TRUNK-HBASE-2:test
(default-test) on project hbase: There are test failures.
>
> Please refer to <https://builds.apache.org/job/HBase-TRUNK/ws/trunk/target/surefire-reports>
for the individual test results.
>        at org.apache.maven.lifecycle.internal.MojoExecutor.execute(MojoExecutor.java:213)
>        at org.apache.maven.lifecycle.internal.MojoExecutor.execute(MojoExecutor.java:153)
>        at org.apache.maven.lifecycle.internal.MojoExecutor.execute(MojoExecutor.java:145)
>        at org.apache.maven.lifecycle.internal.MojoExecutor.executeForkedExecutions(MojoExecutor.java:365)
>        at org.apache.maven.lifecycle.internal.MojoExecutor.execute(MojoExecutor.java:199)
>        at org.apache.maven.lifecycle.internal.MojoExecutor.execute(MojoExecutor.java:153)
>        at org.apache.maven.lifecycle.internal.MojoExecutor.execute(MojoExecutor.java:145)
>        at org.apache.maven.lifecycle.internal.LifecycleModuleBuilder.buildProject(LifecycleModuleBuilder.java:84)
>        at org.apache.maven.lifecycle.internal.LifecycleModuleBuilder.buildProject(LifecycleModuleBuilder.java:59)
>        at org.apache.maven.lifecycle.internal.LifecycleStarter.singleThreadedBuild(LifecycleStarter.java:183)
>        at org.apache.maven.lifecycle.internal.LifecycleStarter.execute(LifecycleStarter.java:161)
>        at org.apache.maven.DefaultMaven.doExecute(DefaultMaven.java:319)
>        at org.apache.maven.DefaultMaven.execute(DefaultMaven.java:156)
>        at org.apache.maven.cli.MavenCli.execute(MavenCli.java:537)
>        at org.apache.maven.cli.MavenCli.doMain(MavenCli.java:196)
>        at org.apache.maven.cli.MavenCli.main(MavenCli.java:141)
>        at sun.reflect.NativeMethodAccessorImpl.invoke0(Native Method)
>        at sun.reflect.NativeMethodAccessorImpl.invoke(NativeMethodAccessorImpl.java:39)
>        at sun.reflect.DelegatingMethodAccessorImpl.invoke(DelegatingMethodAccessorImpl.java:25)
>        at java.lang.reflect.Method.invoke(Method.java:597)
>        at org.codehaus.plexus.classworlds.launcher.Launcher.launchEnhanced(Launcher.java:290)
>        at org.codehaus.plexus.classworlds.launcher.Launcher.launch(Launcher.java:230)
>        at org.codehaus.plexus.classworlds.launcher.Launcher.mainWithExitCode(Launcher.java:409)
>        at org.codehaus.plexus.classworlds.launcher.Launcher.main(Launcher.java:352)
> Caused by: org.apache.maven.plugin.MojoFailureException: There are test failures.
>
> Please refer to <https://builds.apache.org/job/HBase-TRUNK/ws/trunk/target/surefire-reports>
for the individual test results.
>        at org.apache.maven.plugin.surefire.SurefireHelper.reportExecution(SurefireHelper.java:87)
>        at org.apache.maven.plugin.surefire.SurefirePlugin.writeSummary(SurefirePlugin.java:641)
>        at org.apache.maven.plugin.surefire.SurefirePlugin.handleSummary(SurefirePlugin.java:615)
>        at org.apache.maven.plugin.surefire.AbstractSurefireMojo.executeAfterPreconditionsChecked(AbstractSurefireMojo.java:137)
>        at org.apache.maven.plugin.surefire.AbstractSurefireMojo.execute(AbstractSurefireMojo.java:98)
>        at org.apache.maven.plugin.DefaultBuildPluginManager.executeMojo(DefaultBuildPluginManager.java:101)
>        at org.apache.maven.lifecycle.internal.MojoExecutor.execute(MojoExecutor.java:209)
>        ... 23 more
> [ERROR]
> [ERROR] Re-run Maven using the -X switch to enable full debug logging.
> [ERROR]
> [ERROR] For more information about the errors and possible solutions, please read the
following articles:
> [ERROR] [Help 1] http://cwiki.apache.org/confluence/display/MAVEN/MojoFailureException
> Build step 'Invoke top-level Maven targets' marked build as failure
> [locks-and-latches] Releasing all the locks
> [locks-and-latches] All the locks released
> Archiving artifacts
> Recording test results
> Updating HBASE-4213
>
>

Mime
View raw message