hbase-dev mailing list archives

Site index · List index
Message view « Date » · « Thread »
Top « Date » · « Thread »
From Stack <st...@duboce.net>
Subject Re: Build failed in Jenkins: HBase-0.92-security #3
Date Mon, 21 Nov 2011 04:31:24 GMT
We fixed the pom reference to gary's repo here?
St.Ack

On Sun, Nov 20, 2011 at 8:18 PM, Apache Jenkins Server
<jenkins@builds.apache.org> wrote:
> See <https://builds.apache.org/job/HBase-0.92-security/3/changes>
>
> Changes:
>
> [apurtell] Amend HBASE-2418 Add pluginRepositories to POM
>
> ------------------------------------------
> [...truncated 1811 lines...]
> [DEBUG] Writing resolution tracking file /home/hudson/.m2/repository/org/apache/hadoop/hadoop-test/0.20.205.1-7070-SNAPSHOT/resolver-status.properties
> [DEBUG] Could not find metadata org.apache.hadoop:hadoop-test:0.20.205.1-7070-SNAPSHOT/maven-metadata.xml
in apache release (https://repository.apache.org/content/repositories/releases/)
> [WARNING] Could not transfer metadata org.apache.hadoop:hadoop-test:0.20.205.1-7070-SNAPSHOT/maven-metadata.xml
from/to ghelmling.testing (http://people.apache.org/~garyh/mvn/): Error transferring file:
Connection timed out
> org.sonatype.aether.transfer.MetadataTransferException: Could not transfer metadata org.apache.hadoop:hadoop-test:0.20.205.1-7070-SNAPSHOT/maven-metadata.xml
from/to ghelmling.testing (http://people.apache.org/~garyh/mvn/): Error transferring file:
Connection timed out
>        at org.sonatype.aether.connector.wagon.WagonRepositoryConnector$3.wrap(WagonRepositoryConnector.java:932)
>        at org.sonatype.aether.connector.wagon.WagonRepositoryConnector$3.wrap(WagonRepositoryConnector.java:923)
>        at org.sonatype.aether.connector.wagon.WagonRepositoryConnector$GetTask.flush(WagonRepositoryConnector.java:695)
>        at org.sonatype.aether.connector.wagon.WagonRepositoryConnector$GetTask.flush(WagonRepositoryConnector.java:689)
>        at org.sonatype.aether.connector.wagon.WagonRepositoryConnector.get(WagonRepositoryConnector.java:445)
>        at org.sonatype.aether.impl.internal.DefaultMetadataResolver$ResolveTask.run(DefaultMetadataResolver.java:567)
>        at org.sonatype.aether.util.concurrency.RunnableErrorForwarder$1.run(RunnableErrorForwarder.java:64)
>        at java.util.concurrent.ThreadPoolExecutor$Worker.runTask(ThreadPoolExecutor.java:886)
>        at java.util.concurrent.ThreadPoolExecutor$Worker.run(ThreadPoolExecutor.java:908)
>        at java.lang.Thread.run(Thread.java:662)
> Caused by: org.apache.maven.wagon.TransferFailedException: Error transferring file: Connection
timed out
>        at org.apache.maven.wagon.providers.http.LightweightHttpWagon.fillInputData(LightweightHttpWagon.java:143)
>        at org.apache.maven.wagon.StreamWagon.getInputStream(StreamWagon.java:116)
>        at org.apache.maven.wagon.StreamWagon.getIfNewer(StreamWagon.java:88)
>        at org.apache.maven.wagon.StreamWagon.get(StreamWagon.java:61)
>        at org.sonatype.aether.connector.wagon.WagonRepositoryConnector$GetTask.run(WagonRepositoryConnector.java:608)
>        ... 4 more
> Caused by: java.net.ConnectException: Connection timed out
>        at java.net.PlainSocketImpl.socketConnect(Native Method)
>        at java.net.PlainSocketImpl.doConnect(PlainSocketImpl.java:351)
>        at java.net.PlainSocketImpl.connectToAddress(PlainSocketImpl.java:213)
>        at java.net.PlainSocketImpl.connect(PlainSocketImpl.java:200)
>        at java.net.SocksSocketImpl.connect(SocksSocketImpl.java:366)
>        at java.net.Socket.connect(Socket.java:529)
>        at java.net.Socket.connect(Socket.java:478)
>        at sun.net.NetworkClient.doConnect(NetworkClient.java:163)
>        at sun.net.www.http.HttpClient.openServer(HttpClient.java:395)
>        at sun.net.www.http.HttpClient.openServer(HttpClient.java:530)
>        at sun.net.www.http.HttpClient.<init>(HttpClient.java:234)
>        at sun.net.www.http.HttpClient.New(HttpClient.java:307)
>        at sun.net.www.http.HttpClient.New(HttpClient.java:324)
>        at sun.net.www.protocol.http.HttpURLConnection.getNewHttpClient(HttpURLConnection.java:970)
>        at sun.net.www.protocol.http.HttpURLConnection.plainConnect(HttpURLConnection.java:911)
>        at sun.net.www.protocol.http.HttpURLConnection.connect(HttpURLConnection.java:836)
>        at sun.net.www.protocol.http.HttpURLConnection.getInputStream(HttpURLConnection.java:1172)
>        at java.net.HttpURLConnection.getResponseCode(HttpURLConnection.java:379)
>        at org.apache.maven.wagon.providers.http.LightweightHttpWagon.fillInputData(LightweightHttpWagon.java:115)
>        ... 8 more
> [DEBUG] Could not find metadata org.apache.hadoop:hadoop-test:0.20.205.1-7070-SNAPSHOT/maven-metadata.xml
in Nexus (http://repository.apache.org/snapshots)
> [DEBUG] Could not find metadata org.apache.hadoop:hadoop-test:0.20.205.1-7070-SNAPSHOT/maven-metadata.xml
in local (/home/hudson/.m2/repository)
> [DEBUG] Failure to find org.apache.hadoop:hadoop-test:0.20.205.1-7070-SNAPSHOT/maven-metadata.xml
in https://repository.apache.org/content/repositories/releases/ was cached in the local repository,
resolution will not be reattempted until the update interval of apache release has elapsed
or updates are forced
> [DEBUG] Failure to find org.apache.hadoop:hadoop-test:0.20.205.1-7070-SNAPSHOT/maven-metadata.xml
in http://repository.apache.org/snapshots was cached in the local repository, resolution will
not be reattempted until the update interval of Nexus has elapsed or updates are forced
> [DEBUG] Using connector WagonRepositoryConnector with priority 0 for http://people.apache.org/~garyh/mvn/
> Downloading: http://people.apache.org/~garyh/mvn/org/apache/hadoop/hadoop-test/0.20.205.1-7070-SNAPSHOT/maven-metadata.xml
>
> [DEBUG] Reading resolution tracking file /home/hudson/.m2/repository/org/apache/hadoop/hadoop-test/0.20.205.1-7070-SNAPSHOT/resolver-status.properties
> [DEBUG] Writing resolution tracking file /home/hudson/.m2/repository/org/apache/hadoop/hadoop-test/0.20.205.1-7070-SNAPSHOT/resolver-status.properties
> [WARNING] Could not transfer metadata org.apache.hadoop:hadoop-test:0.20.205.1-7070-SNAPSHOT/maven-metadata.xml
from/to ghelmling.testing (http://people.apache.org/~garyh/mvn/): Error transferring file:
Connection timed out
> org.sonatype.aether.transfer.MetadataTransferException: Could not transfer metadata org.apache.hadoop:hadoop-test:0.20.205.1-7070-SNAPSHOT/maven-metadata.xml
from/to ghelmling.testing (http://people.apache.org/~garyh/mvn/): Error transferring file:
Connection timed out
>        at org.sonatype.aether.connector.wagon.WagonRepositoryConnector$3.wrap(WagonRepositoryConnector.java:932)
>        at org.sonatype.aether.connector.wagon.WagonRepositoryConnector$3.wrap(WagonRepositoryConnector.java:923)
>        at org.sonatype.aether.connector.wagon.WagonRepositoryConnector$GetTask.flush(WagonRepositoryConnector.java:695)
>        at org.sonatype.aether.connector.wagon.WagonRepositoryConnector$GetTask.flush(WagonRepositoryConnector.java:689)
>        at org.sonatype.aether.connector.wagon.WagonRepositoryConnector.get(WagonRepositoryConnector.java:445)
>        at org.sonatype.aether.impl.internal.DefaultMetadataResolver$ResolveTask.run(DefaultMetadataResolver.java:567)
>        at org.sonatype.aether.util.concurrency.RunnableErrorForwarder$1.run(RunnableErrorForwarder.java:64)
>        at org.sonatype.aether.impl.internal.DefaultMetadataResolver$1.execute(DefaultMetadataResolver.java:490)
>        at org.sonatype.aether.impl.internal.DefaultMetadataResolver.resolve(DefaultMetadataResolver.java:349)
>        at org.sonatype.aether.impl.internal.DefaultMetadataResolver.resolveMetadata(DefaultMetadataResolver.java:177)
>        at org.apache.maven.repository.internal.DefaultVersionResolver.resolveVersion(DefaultVersionResolver.java:211)
>        at org.sonatype.aether.impl.internal.DefaultArtifactResolver.resolve(DefaultArtifactResolver.java:276)
>        at org.sonatype.aether.impl.internal.DefaultArtifactResolver.resolveArtifacts(DefaultArtifactResolver.java:220)
>        at org.sonatype.aether.impl.internal.DefaultArtifactResolver.resolveArtifact(DefaultArtifactResolver.java:197)
>        at org.apache.maven.repository.internal.DefaultArtifactDescriptorReader.loadPom(DefaultArtifactDescriptorReader.java:267)
>        at org.apache.maven.repository.internal.DefaultArtifactDescriptorReader.readArtifactDescriptor(DefaultArtifactDescriptorReader.java:172)
>        at org.sonatype.aether.impl.internal.DefaultDependencyCollector.process(DefaultDependencyCollector.java:419)
>        at org.sonatype.aether.impl.internal.DefaultDependencyCollector.collectDependencies(DefaultDependencyCollector.java:243)
>        at org.sonatype.aether.impl.internal.DefaultRepositorySystem.collectDependencies(DefaultRepositorySystem.java:345)
>        at org.apache.maven.project.DefaultProjectDependenciesResolver.resolve(DefaultProjectDependenciesResolver.java:131)
>        at org.apache.maven.lifecycle.internal.LifecycleDependencyResolver.getDependencies(LifecycleDependencyResolver.java:171)
>        at org.apache.maven.lifecycle.internal.LifecycleDependencyResolver.resolveProjectDependencies(LifecycleDependencyResolver.java:108)
>        at org.apache.maven.lifecycle.internal.MojoExecutor.ensureDependenciesAreResolved(MojoExecutor.java:258)
>        at org.apache.maven.lifecycle.internal.MojoExecutor.execute(MojoExecutor.java:201)
>        at org.apache.maven.lifecycle.internal.MojoExecutor.execute(MojoExecutor.java:153)
>        at org.apache.maven.lifecycle.internal.MojoExecutor.execute(MojoExecutor.java:145)
>        at org.apache.maven.lifecycle.internal.LifecycleModuleBuilder.buildProject(LifecycleModuleBuilder.java:84)
>        at org.apache.maven.lifecycle.internal.LifecycleModuleBuilder.buildProject(LifecycleModuleBuilder.java:59)
>        at org.apache.maven.lifecycle.internal.LifecycleStarter.singleThreadedBuild(LifecycleStarter.java:183)
>        at org.apache.maven.lifecycle.internal.LifecycleStarter.execute(LifecycleStarter.java:161)
>        at org.apache.maven.DefaultMaven.doExecute(DefaultMaven.java:319)
>        at org.apache.maven.DefaultMaven.execute(DefaultMaven.java:156)
>        at org.apache.maven.cli.MavenCli.execute(MavenCli.java:537)
>        at org.apache.maven.cli.MavenCli.doMain(MavenCli.java:196)
>        at org.apache.maven.cli.MavenCli.main(MavenCli.java:141)
>        at sun.reflect.NativeMethodAccessorImpl.invoke0(Native Method)
>        at sun.reflect.NativeMethodAccessorImpl.invoke(NativeMethodAccessorImpl.java:39)
>        at sun.reflect.DelegatingMethodAccessorImpl.invoke(DelegatingMethodAccessorImpl.java:25)
>        at java.lang.reflect.Method.invoke(Method.java:597)
>        at org.codehaus.plexus.classworlds.launcher.Launcher.launchEnhanced(Launcher.java:290)
>        at org.codehaus.plexus.classworlds.launcher.Launcher.launch(Launcher.java:230)
>        at org.codehaus.plexus.classworlds.launcher.Launcher.mainWithExitCode(Launcher.java:409)
>        at org.codehaus.plexus.classworlds.launcher.Launcher.main(Launcher.java:352)
> Caused by: org.apache.maven.wagon.TransferFailedException: Error transferring file: Connection
timed out
>        at org.apache.maven.wagon.providers.http.LightweightHttpWagon.fillInputData(LightweightHttpWagon.java:143)
>        at org.apache.maven.wagon.StreamWagon.getInputStream(StreamWagon.java:116)
>        at org.apache.maven.wagon.StreamWagon.getIfNewer(StreamWagon.java:88)
>        at org.apache.maven.wagon.StreamWagon.get(StreamWagon.java:61)
>        at org.sonatype.aether.connector.wagon.WagonRepositoryConnector$GetTask.run(WagonRepositoryConnector.java:608)
>        at org.sonatype.aether.util.concurrency.RunnableErrorForwarder$1.run(RunnableErrorForwarder.java:64)
>        at java.util.concurrent.ThreadPoolExecutor$Worker.runTask(ThreadPoolExecutor.java:886)
>        at java.util.concurrent.ThreadPoolExecutor$Worker.run(ThreadPoolExecutor.java:908)
>        at java.lang.Thread.run(Thread.java:662)
> Caused by: java.net.ConnectException: Connection timed out
>        at java.net.PlainSocketImpl.socketConnect(Native Method)
>        at java.net.PlainSocketImpl.doConnect(PlainSocketImpl.java:351)
>        at java.net.PlainSocketImpl.connectToAddress(PlainSocketImpl.java:213)
>        at java.net.PlainSocketImpl.connect(PlainSocketImpl.java:200)
>        at java.net.SocksSocketImpl.connect(SocksSocketImpl.java:366)
>        at java.net.Socket.connect(Socket.java:529)
>        at java.net.Socket.connect(Socket.java:478)
>        at sun.net.NetworkClient.doConnect(NetworkClient.java:163)
>        at sun.net.www.http.HttpClient.openServer(HttpClient.java:395)
>        at sun.net.www.http.HttpClient.openServer(HttpClient.java:530)
>        at sun.net.www.http.HttpClient.<init>(HttpClient.java:234)
>        at sun.net.www.http.HttpClient.New(HttpClient.java:307)
>        at sun.net.www.http.HttpClient.New(HttpClient.java:324)
>        at sun.net.www.protocol.http.HttpURLConnection.getNewHttpClient(HttpURLConnection.java:970)
>        at sun.net.www.protocol.http.HttpURLConnection.plainConnect(HttpURLConnection.java:911)
>        at sun.net.www.protocol.http.HttpURLConnection.connect(HttpURLConnection.java:836)
>        at sun.net.www.protocol.http.HttpURLConnection.getInputStream(HttpURLConnection.java:1172)
>        at java.net.HttpURLConnection.getResponseCode(HttpURLConnection.java:379)
>        at org.apache.maven.wagon.providers.http.LightweightHttpWagon.fillInputData(LightweightHttpWagon.java:115)
>        ... 8 more
> [DEBUG] Using connector WagonRepositoryConnector with priority 0 for https://repository.apache.org/content/repositories/releases/
> Downloading: https://repository.apache.org/content/repositories/releases/org/apache/hadoop/hadoop-test/0.20.205.1-7070-SNAPSHOT/hadoop-test-0.20.205.1-7070-SNAPSHOT.pom
>
> [DEBUG] Reading resolution tracking file /home/hudson/.m2/repository/org/apache/hadoop/hadoop-test/0.20.205.1-7070-SNAPSHOT/hadoop-test-0.20.205.1-7070-SNAPSHOT.pom.lastUpdated
> [DEBUG] Writing resolution tracking file /home/hudson/.m2/repository/org/apache/hadoop/hadoop-test/0.20.205.1-7070-SNAPSHOT/hadoop-test-0.20.205.1-7070-SNAPSHOT.pom.lastUpdated
> [DEBUG] Using connector WagonRepositoryConnector with priority 0 for http://people.apache.org/~garyh/mvn/
> Downloading: http://people.apache.org/~garyh/mvn/org/apache/hadoop/hadoop-test/0.20.205.1-7070-SNAPSHOT/hadoop-test-0.20.205.1-7070-SNAPSHOT.pom
>
> [DEBUG] Reading resolution tracking file /home/hudson/.m2/repository/org/apache/hadoop/hadoop-test/0.20.205.1-7070-SNAPSHOT/hadoop-test-0.20.205.1-7070-SNAPSHOT.pom.lastUpdated
> [DEBUG] Writing resolution tracking file /home/hudson/.m2/repository/org/apache/hadoop/hadoop-test/0.20.205.1-7070-SNAPSHOT/hadoop-test-0.20.205.1-7070-SNAPSHOT.pom.lastUpdated
> [DEBUG] Using connector WagonRepositoryConnector with priority 0 for http://repository.apache.org/snapshots
> Downloading: http://repository.apache.org/snapshots/org/apache/hadoop/hadoop-test/0.20.205.1-7070-SNAPSHOT/hadoop-test-0.20.205.1-7070-SNAPSHOT.pom
>
> [DEBUG] Reading resolution tracking file /home/hudson/.m2/repository/org/apache/hadoop/hadoop-test/0.20.205.1-7070-SNAPSHOT/hadoop-test-0.20.205.1-7070-SNAPSHOT.pom.lastUpdated
> [DEBUG] Writing resolution tracking file /home/hudson/.m2/repository/org/apache/hadoop/hadoop-test/0.20.205.1-7070-SNAPSHOT/hadoop-test-0.20.205.1-7070-SNAPSHOT.pom.lastUpdated
> [INFO]
> [INFO] ------------------------------------------------------------------------
> [INFO] Skipping HBase
> [INFO] This project has been banned from the build due to previous failures.
> [INFO] ------------------------------------------------------------------------
> [INFO] ------------------------------------------------------------------------
> [INFO] BUILD FAILURE
> [INFO] ------------------------------------------------------------------------
> [INFO] Total time: 2:59.478s
> [INFO] Finished at: Mon Nov 21 04:18:23 UTC 2011
> [INFO] Final Memory: 9M/79M
> [INFO] ------------------------------------------------------------------------
> [ERROR] Failed to execute goal on project hbase: Could not resolve dependencies for project
org.apache.hbase:hbase:jar:0.92.0-SNAPSHOT: Failed to collect dependencies for [com.google.guava:guava:jar:r09
(compile), commons-cli:commons-cli:jar:1.2 (compile), com.github.stephenc.high-scale-lib:high-scale-lib:jar:1.1.1
(compile), commons-codec:commons-codec:jar:1.4 (compile), commons-httpclient:commons-httpclient:jar:3.1
(compile), commons-lang:commons-lang:jar:2.5 (compile), commons-logging:commons-logging:jar:1.1.1
(compile), log4j:log4j:jar:1.2.16 (compile), org.apache.avro:avro:jar:1.5.3 (compile), org.apache.avro:avro-ipc:jar:1.5.3
(compile), org.apache.zookeeper:zookeeper:jar:3.4.0-SNAPSHOT (compile), org.apache.thrift:libthrift:jar:0.7.0
(compile), org.jruby:jruby-complete:jar:1.6.0 (compile), org.mortbay.jetty:jetty:jar:6.1.26
(compile), org.mortbay.jetty:jetty-util:jar:6.1.26 (compile), org.mortbay.jetty:jsp-2.1:jar:6.1.14
(compile), org.mortbay.jetty:jsp-api-2.1:jar:6.1.14 (compile), org.mortbay.jetty:servlet-api-2.5:jar:6.1.14
(compile), org.codehaus.jackson:jackson-core-asl:jar:1.5.5 (compile), org.codehaus.jackson:jackson-mapper-asl:jar:1.5.5
(compile), org.codehaus.jackson:jackson-jaxrs:jar:1.5.5 (compile), org.codehaus.jackson:jackson-xc:jar:1.5.5
(compile), org.slf4j:slf4j-api:jar:1.5.8 (compile), org.slf4j:slf4j-log4j12:jar:1.5.8 (compile),
tomcat:jasper-compiler:jar:5.5.23 (runtime), tomcat:jasper-runtime:jar:5.5.23 (runtime), org.jamon:jamon-runtime:jar:2.3.1
(compile), com.google.protobuf:protobuf-java:jar:2.4.0a (compile), com.sun.jersey:jersey-core:jar:1.4
(compile), com.sun.jersey:jersey-json:jar:1.4 (compile), com.sun.jersey:jersey-server:jar:1.4
(compile), javax.xml.bind:jaxb-api:jar:2.1 (compile), stax:stax-api:jar:1.0.1 (compile), junit:junit:jar:4.10
(test), org.mockito:mockito-all:jar:1.8.5 (test), org.apache.commons:commons-math:jar:2.1
(test), org.apache.hadoop:hadoop-core:jar:0.20.205.1-7070-SNAPSHOT (compile), org.apache.hadoop:hadoop-test:jar:0.20.205.1-7070-SNAPSHOT
(test)]: Failed to read artifact descriptor for org.apache.zookeeper:zookeeper:jar:3.4.0-SNAPSHOT:
Could not transfer artifact org.apache.zookeeper:zookeeper:pom:3.4.0-SNAPSHOT from/to ghelmling.testing
(http://people.apache.org/~garyh/mvn/): Error transferring file: Connection timed out ->
[Help 1]
> org.apache.maven.lifecycle.LifecycleExecutionException: Failed to execute goal on project
hbase: Could not resolve dependencies for project org.apache.hbase:hbase:jar:0.92.0-SNAPSHOT:
Failed to collect dependencies for [com.google.guava:guava:jar:r09 (compile), commons-cli:commons-cli:jar:1.2
(compile), com.github.stephenc.high-scale-lib:high-scale-lib:jar:1.1.1 (compile), commons-codec:commons-codec:jar:1.4
(compile), commons-httpclient:commons-httpclient:jar:3.1 (compile), commons-lang:commons-lang:jar:2.5
(compile), commons-logging:commons-logging:jar:1.1.1 (compile), log4j:log4j:jar:1.2.16 (compile),
org.apache.avro:avro:jar:1.5.3 (compile), org.apache.avro:avro-ipc:jar:1.5.3 (compile), org.apache.zookeeper:zookeeper:jar:3.4.0-SNAPSHOT
(compile), org.apache.thrift:libthrift:jar:0.7.0 (compile), org.jruby:jruby-complete:jar:1.6.0
(compile), org.mortbay.jetty:jetty:jar:6.1.26 (compile), org.mortbay.jetty:jetty-util:jar:6.1.26
(compile), org.mortbay.jetty:jsp-2.1:jar:6.1.14 (compile), org.mortbay.jetty:jsp-api-2.1:jar:6.1.14
(compile), org.mortbay.jetty:servlet-api-2.5:jar:6.1.14 (compile), org.codehaus.jackson:jackson-core-asl:jar:1.5.5
(compile), org.codehaus.jackson:jackson-mapper-asl:jar:1.5.5 (compile), org.codehaus.jackson:jackson-jaxrs:jar:1.5.5
(compile), org.codehaus.jackson:jackson-xc:jar:1.5.5 (compile), org.slf4j:slf4j-api:jar:1.5.8
(compile), org.slf4j:slf4j-log4j12:jar:1.5.8 (compile), tomcat:jasper-compiler:jar:5.5.23
(runtime), tomcat:jasper-runtime:jar:5.5.23 (runtime), org.jamon:jamon-runtime:jar:2.3.1 (compile),
com.google.protobuf:protobuf-java:jar:2.4.0a (compile), com.sun.jersey:jersey-core:jar:1.4
(compile), com.sun.jersey:jersey-json:jar:1.4 (compile), com.sun.jersey:jersey-server:jar:1.4
(compile), javax.xml.bind:jaxb-api:jar:2.1 (compile), stax:stax-api:jar:1.0.1 (compile), junit:junit:jar:4.10
(test), org.mockito:mockito-all:jar:1.8.5 (test), org.apache.commons:commons-math:jar:2.1
(test), org.apache.hadoop:hadoop-core:jar:0.20.205.1-7070-SNAPSHOT (compile), org.apache.hadoop:hadoop-test:jar:0.20.205.1-7070-SNAPSHOT
(test)]
>        at org.apache.maven.lifecycle.internal.LifecycleDependencyResolver.getDependencies(LifecycleDependencyResolver.java:196)
>        at org.apache.maven.lifecycle.internal.LifecycleDependencyResolver.resolveProjectDependencies(LifecycleDependencyResolver.java:108)
>        at org.apache.maven.lifecycle.internal.MojoExecutor.ensureDependenciesAreResolved(MojoExecutor.java:258)
>        at org.apache.maven.lifecycle.internal.MojoExecutor.execute(MojoExecutor.java:201)
>        at org.apache.maven.lifecycle.internal.MojoExecutor.execute(MojoExecutor.java:153)
>        at org.apache.maven.lifecycle.internal.MojoExecutor.execute(MojoExecutor.java:145)
>        at org.apache.maven.lifecycle.internal.LifecycleModuleBuilder.buildProject(LifecycleModuleBuilder.java:84)
>        at org.apache.maven.lifecycle.internal.LifecycleModuleBuilder.buildProject(LifecycleModuleBuilder.java:59)
>        at org.apache.maven.lifecycle.internal.LifecycleStarter.singleThreadedBuild(LifecycleStarter.java:183)
>        at org.apache.maven.lifecycle.internal.LifecycleStarter.execute(LifecycleStarter.java:161)
>        at org.apache.maven.DefaultMaven.doExecute(DefaultMaven.java:319)
>        at org.apache.maven.DefaultMaven.execute(DefaultMaven.java:156)
>        at org.apache.maven.cli.MavenCli.execute(MavenCli.java:537)
>        at org.apache.maven.cli.MavenCli.doMain(MavenCli.java:196)
>        at org.apache.maven.cli.MavenCli.main(MavenCli.java:141)
>        at sun.reflect.NativeMethodAccessorImpl.invoke0(Native Method)
>        at sun.reflect.NativeMethodAccessorImpl.invoke(NativeMethodAccessorImpl.java:39)
>        at sun.reflect.DelegatingMethodAccessorImpl.invoke(DelegatingMethodAccessorImpl.java:25)
>        at java.lang.reflect.Method.invoke(Method.java:597)
>        at org.codehaus.plexus.classworlds.launcher.Launcher.launchEnhanced(Launcher.java:290)
>        at org.codehaus.plexus.classworlds.launcher.Launcher.launch(Launcher.java:230)
>        at org.codehaus.plexus.classworlds.launcher.Launcher.mainWithExitCode(Launcher.java:409)
>        at org.codehaus.plexus.classworlds.launcher.Launcher.main(Launcher.java:352)
> Caused by: org.apache.maven.project.DependencyResolutionException: Could not resolve
dependencies for project org.apache.hbase:hbase:jar:0.92.0-SNAPSHOT: Failed to collect dependencies
for [com.google.guava:guava:jar:r09 (compile), commons-cli:commons-cli:jar:1.2 (compile),
com.github.stephenc.high-scale-lib:high-scale-lib:jar:1.1.1 (compile), commons-codec:commons-codec:jar:1.4
(compile), commons-httpclient:commons-httpclient:jar:3.1 (compile), commons-lang:commons-lang:jar:2.5
(compile), commons-logging:commons-logging:jar:1.1.1 (compile), log4j:log4j:jar:1.2.16 (compile),
org.apache.avro:avro:jar:1.5.3 (compile), org.apache.avro:avro-ipc:jar:1.5.3 (compile), org.apache.zookeeper:zookeeper:jar:3.4.0-SNAPSHOT
(compile), org.apache.thrift:libthrift:jar:0.7.0 (compile), org.jruby:jruby-complete:jar:1.6.0
(compile), org.mortbay.jetty:jetty:jar:6.1.26 (compile), org.mortbay.jetty:jetty-util:jar:6.1.26
(compile), org.mortbay.jetty:jsp-2.1:jar:6.1.14 (compile), org.mortbay.jetty:jsp-api-2.1:jar:6.1.14
(compile), org.mortbay.jetty:servlet-api-2.5:jar:6.1.14 (compile), org.codehaus.jackson:jackson-core-asl:jar:1.5.5
(compile), org.codehaus.jackson:jackson-mapper-asl:jar:1.5.5 (compile), org.codehaus.jackson:jackson-jaxrs:jar:1.5.5
(compile), org.codehaus.jackson:jackson-xc:jar:1.5.5 (compile), org.slf4j:slf4j-api:jar:1.5.8
(compile), org.slf4j:slf4j-log4j12:jar:1.5.8 (compile), tomcat:jasper-compiler:jar:5.5.23
(runtime), tomcat:jasper-runtime:jar:5.5.23 (runtime), org.jamon:jamon-runtime:jar:2.3.1 (compile),
com.google.protobuf:protobuf-java:jar:2.4.0a (compile), com.sun.jersey:jersey-core:jar:1.4
(compile), com.sun.jersey:jersey-json:jar:1.4 (compile), com.sun.jersey:jersey-server:jar:1.4
(compile), javax.xml.bind:jaxb-api:jar:2.1 (compile), stax:stax-api:jar:1.0.1 (compile), junit:junit:jar:4.10
(test), org.mockito:mockito-all:jar:1.8.5 (test), org.apache.commons:commons-math:jar:2.1
(test), org.apache.hadoop:hadoop-core:jar:0.20.205.1-7070-SNAPSHOT (compile), org.apache.hadoop:hadoop-test:jar:0.20.205.1-7070-SNAPSHOT
(test)]
>        at org.apache.maven.project.DefaultProjectDependenciesResolver.resolve(DefaultProjectDependenciesResolver.java:139)
>        at org.apache.maven.lifecycle.internal.LifecycleDependencyResolver.getDependencies(LifecycleDependencyResolver.java:171)
>        ... 22 more
> Caused by: org.sonatype.aether.collection.DependencyCollectionException: Failed to collect
dependencies for [com.google.guava:guava:jar:r09 (compile), commons-cli:commons-cli:jar:1.2
(compile), com.github.stephenc.high-scale-lib:high-scale-lib:jar:1.1.1 (compile), commons-codec:commons-codec:jar:1.4
(compile), commons-httpclient:commons-httpclient:jar:3.1 (compile), commons-lang:commons-lang:jar:2.5
(compile), commons-logging:commons-logging:jar:1.1.1 (compile), log4j:log4j:jar:1.2.16 (compile),
org.apache.avro:avro:jar:1.5.3 (compile), org.apache.avro:avro-ipc:jar:1.5.3 (compile), org.apache.zookeeper:zookeeper:jar:3.4.0-SNAPSHOT
(compile), org.apache.thrift:libthrift:jar:0.7.0 (compile), org.jruby:jruby-complete:jar:1.6.0
(compile), org.mortbay.jetty:jetty:jar:6.1.26 (compile), org.mortbay.jetty:jetty-util:jar:6.1.26
(compile), org.mortbay.jetty:jsp-2.1:jar:6.1.14 (compile), org.mortbay.jetty:jsp-api-2.1:jar:6.1.14
(compile), org.mortbay.jetty:servlet-api-2.5:jar:6.1.14 (compile), org.codehaus.jackson:jackson-core-asl:jar:1.5.5
(compile), org.codehaus.jackson:jackson-mapper-asl:jar:1.5.5 (compile), org.codehaus.jackson:jackson-jaxrs:jar:1.5.5
(compile), org.codehaus.jackson:jackson-xc:jar:1.5.5 (compile), org.slf4j:slf4j-api:jar:1.5.8
(compile), org.slf4j:slf4j-log4j12:jar:1.5.8 (compile), tomcat:jasper-compiler:jar:5.5.23
(runtime), tomcat:jasper-runtime:jar:5.5.23 (runtime), org.jamon:jamon-runtime:jar:2.3.1 (compile),
com.google.protobuf:protobuf-java:jar:2.4.0a (compile), com.sun.jersey:jersey-core:jar:1.4
(compile), com.sun.jersey:jersey-json:jar:1.4 (compile), com.sun.jersey:jersey-server:jar:1.4
(compile), javax.xml.bind:jaxb-api:jar:2.1 (compile), stax:stax-api:jar:1.0.1 (compile), junit:junit:jar:4.10
(test), org.mockito:mockito-all:jar:1.8.5 (test), org.apache.commons:commons-math:jar:2.1
(test), org.apache.hadoop:hadoop-core:jar:0.20.205.1-7070-SNAPSHOT (compile), org.apache.hadoop:hadoop-test:jar:0.20.205.1-7070-SNAPSHOT
(test)]
>        at org.sonatype.aether.impl.internal.DefaultDependencyCollector.collectDependencies(DefaultDependencyCollector.java:262)
>        at org.sonatype.aether.impl.internal.DefaultRepositorySystem.collectDependencies(DefaultRepositorySystem.java:345)
>        at org.apache.maven.project.DefaultProjectDependenciesResolver.resolve(DefaultProjectDependenciesResolver.java:131)
>        ... 23 more
> Caused by: org.sonatype.aether.resolution.ArtifactDescriptorException: Failed to read
artifact descriptor for org.apache.zookeeper:zookeeper:jar:3.4.0-SNAPSHOT
>        at org.apache.maven.repository.internal.DefaultArtifactDescriptorReader.loadPom(DefaultArtifactDescriptorReader.java:282)
>        at org.apache.maven.repository.internal.DefaultArtifactDescriptorReader.readArtifactDescriptor(DefaultArtifactDescriptorReader.java:172)
>        at org.sonatype.aether.impl.internal.DefaultDependencyCollector.process(DefaultDependencyCollector.java:419)
>        at org.sonatype.aether.impl.internal.DefaultDependencyCollector.collectDependencies(DefaultDependencyCollector.java:243)
>        ... 25 more
> Caused by: org.sonatype.aether.resolution.ArtifactResolutionException: Could not transfer
artifact org.apache.zookeeper:zookeeper:pom:3.4.0-SNAPSHOT from/to ghelmling.testing (http://people.apache.org/~garyh/mvn/):
Error transferring file: Connection timed out
>        at org.sonatype.aether.impl.internal.DefaultArtifactResolver.resolve(DefaultArtifactResolver.java:541)
>        at org.sonatype.aether.impl.internal.DefaultArtifactResolver.resolveArtifacts(DefaultArtifactResolver.java:220)
>        at org.sonatype.aether.impl.internal.DefaultArtifactResolver.resolveArtifact(DefaultArtifactResolver.java:197)
>        at org.apache.maven.repository.internal.DefaultArtifactDescriptorReader.loadPom(DefaultArtifactDescriptorReader.java:267)
>        ... 28 more
> Caused by: org.sonatype.aether.transfer.ArtifactTransferException: Could not transfer
artifact org.apache.zookeeper:zookeeper:pom:3.4.0-SNAPSHOT from/to ghelmling.testing (http://people.apache.org/~garyh/mvn/):
Error transferring file: Connection timed out
>        at org.sonatype.aether.connector.wagon.WagonRepositoryConnector$4.wrap(WagonRepositoryConnector.java:949)
>        at org.sonatype.aether.connector.wagon.WagonRepositoryConnector$4.wrap(WagonRepositoryConnector.java:940)
>        at org.sonatype.aether.connector.wagon.WagonRepositoryConnector$GetTask.flush(WagonRepositoryConnector.java:695)
>        at org.sonatype.aether.connector.wagon.WagonRepositoryConnector$GetTask.flush(WagonRepositoryConnector.java:689)
>        at org.sonatype.aether.connector.wagon.WagonRepositoryConnector.get(WagonRepositoryConnector.java:445)
>        at org.sonatype.aether.impl.internal.DefaultArtifactResolver.resolve(DefaultArtifactResolver.java:460)
>        ... 31 more
> Caused by: org.apache.maven.wagon.TransferFailedException: Error transferring file: Connection
timed out
>        at org.apache.maven.wagon.providers.http.LightweightHttpWagon.fillInputData(LightweightHttpWagon.java:143)
>        at org.apache.maven.wagon.StreamWagon.getInputStream(StreamWagon.java:116)
>        at org.apache.maven.wagon.StreamWagon.getIfNewer(StreamWagon.java:88)
>        at org.apache.maven.wagon.StreamWagon.get(StreamWagon.java:61)
>        at org.sonatype.aether.connector.wagon.WagonRepositoryConnector$GetTask.run(WagonRepositoryConnector.java:608)
>        at org.sonatype.aether.util.concurrency.RunnableErrorForwarder$1.run(RunnableErrorForwarder.java:64)
>        at java.util.concurrent.ThreadPoolExecutor$Worker.runTask(ThreadPoolExecutor.java:886)
>        at java.util.concurrent.ThreadPoolExecutor$Worker.run(ThreadPoolExecutor.java:908)
>        at java.lang.Thread.run(Thread.java:662)
> Caused by: java.net.ConnectException: Connection timed out
>        at java.net.PlainSocketImpl.socketConnect(Native Method)
>        at java.net.PlainSocketImpl.doConnect(PlainSocketImpl.java:351)
>        at java.net.PlainSocketImpl.connectToAddress(PlainSocketImpl.java:213)
>        at java.net.PlainSocketImpl.connect(PlainSocketImpl.java:200)
>        at java.net.SocksSocketImpl.connect(SocksSocketImpl.java:366)
>        at java.net.Socket.connect(Socket.java:529)
>        at java.net.Socket.connect(Socket.java:478)
>        at sun.net.NetworkClient.doConnect(NetworkClient.java:163)
>        at sun.net.www.http.HttpClient.openServer(HttpClient.java:395)
>        at sun.net.www.http.HttpClient.openServer(HttpClient.java:530)
>        at sun.net.www.http.HttpClient.<init>(HttpClient.java:234)
>        at sun.net.www.http.HttpClient.New(HttpClient.java:307)
>        at sun.net.www.http.HttpClient.New(HttpClient.java:324)
>        at sun.net.www.protocol.http.HttpURLConnection.getNewHttpClient(HttpURLConnection.java:970)
>        at sun.net.www.protocol.http.HttpURLConnection.plainConnect(HttpURLConnection.java:911)
>        at sun.net.www.protocol.http.HttpURLConnection.connect(HttpURLConnection.java:836)
>        at sun.net.www.protocol.http.HttpURLConnection.getInputStream(HttpURLConnection.java:1172)
>        at java.net.HttpURLConnection.getResponseCode(HttpURLConnection.java:379)
>        at org.apache.maven.wagon.providers.http.LightweightHttpWagon.fillInputData(LightweightHttpWagon.java:115)
>        ... 8 more
> [ERROR]
> [ERROR]
> [ERROR] For more information about the errors and possible solutions, please read the
following articles:
> [ERROR] [Help 1] http://cwiki.apache.org/confluence/display/MAVEN/DependencyResolutionException
> Build step 'Invoke top-level Maven targets' marked build as failure
> [locks-and-latches] Releasing all the locks
> [locks-and-latches] All the locks released
> Archiving artifacts
> Recording test results
> Updating HBASE-2418
>
>

Mime
View raw message