hbase-dev mailing list archives

Site index · List index
Message view « Date » · « Thread »
Top « Date » · « Thread »
From Apache Jenkins Server <jenk...@builds.apache.org>
Subject Build failed in Jenkins: HBase-0.92 #126
Date Sat, 12 Nov 2011 06:28:23 GMT
See <https://builds.apache.org/job/HBase-0.92/126/changes>

Changes:

[tedyu] HBASE-4478  Improve AssignmentManager.handleRegion so that it can process certain
ZK state
               in the case of RS offline

------------------------------------------
[...truncated 6465 lines...]
Forking command line: /bin/sh -c cd <https://builds.apache.org/job/HBase-0.92/ws/trunk>
&& /home/jenkins/tools/java/jdk1.6.0_27-32/jre/bin/java -enableassertions -Xmx1400m
-jar <https://builds.apache.org/job/HBase-0.92/ws/trunk/target/surefire/surefirebooter6171657529796108909.jar>
<https://builds.apache.org/job/HBase-0.92/ws/trunk/target/surefire/surefire2353287050958480803tmp>
<https://builds.apache.org/job/HBase-0.92/ws/trunk/target/surefire/surefire8975697860680135751tmp>
Running org.apache.hadoop.hbase.filter.TestRandomRowFilter
Tests run: 2, Failures: 0, Errors: 0, Skipped: 0, Time elapsed: 0.576 sec
Forking command line: /bin/sh -c cd <https://builds.apache.org/job/HBase-0.92/ws/trunk>
&& /home/jenkins/tools/java/jdk1.6.0_27-32/jre/bin/java -enableassertions -Xmx1400m
-jar <https://builds.apache.org/job/HBase-0.92/ws/trunk/target/surefire/surefirebooter7603607971730833910.jar>
<https://builds.apache.org/job/HBase-0.92/ws/trunk/target/surefire/surefire4291893550429769216tmp>
<https://builds.apache.org/job/HBase-0.92/ws/trunk/target/surefire/surefire4555819730120692014tmp>
Running org.apache.hadoop.hbase.filter.TestPrefixFilter
Tests run: 3, Failures: 0, Errors: 0, Skipped: 0, Time elapsed: 0.111 sec
Forking command line: /bin/sh -c cd <https://builds.apache.org/job/HBase-0.92/ws/trunk>
&& /home/jenkins/tools/java/jdk1.6.0_27-32/jre/bin/java -enableassertions -Xmx1400m
-jar <https://builds.apache.org/job/HBase-0.92/ws/trunk/target/surefire/surefirebooter8249344449168659014.jar>
<https://builds.apache.org/job/HBase-0.92/ws/trunk/target/surefire/surefire2604286667756534376tmp>
<https://builds.apache.org/job/HBase-0.92/ws/trunk/target/surefire/surefire4424461151203536289tmp>
Running org.apache.hadoop.hbase.filter.TestBitComparator
Tests run: 3, Failures: 0, Errors: 0, Skipped: 0, Time elapsed: 0.029 sec
Forking command line: /bin/sh -c cd <https://builds.apache.org/job/HBase-0.92/ws/trunk>
&& /home/jenkins/tools/java/jdk1.6.0_27-32/jre/bin/java -enableassertions -Xmx1400m
-jar <https://builds.apache.org/job/HBase-0.92/ws/trunk/target/surefire/surefirebooter8566252833166012476.jar>
<https://builds.apache.org/job/HBase-0.92/ws/trunk/target/surefire/surefire5585299820651743861tmp>
<https://builds.apache.org/job/HBase-0.92/ws/trunk/target/surefire/surefire6008596652153426378tmp>
Running org.apache.hadoop.hbase.filter.TestDependentColumnFilter
Tests run: 2, Failures: 0, Errors: 0, Skipped: 0, Time elapsed: 0.76 sec
Forking command line: /bin/sh -c cd <https://builds.apache.org/job/HBase-0.92/ws/trunk>
&& /home/jenkins/tools/java/jdk1.6.0_27-32/jre/bin/java -enableassertions -Xmx1400m
-jar <https://builds.apache.org/job/HBase-0.92/ws/trunk/target/surefire/surefirebooter712184810001400106.jar>
<https://builds.apache.org/job/HBase-0.92/ws/trunk/target/surefire/surefire6029834134457614019tmp>
<https://builds.apache.org/job/HBase-0.92/ws/trunk/target/surefire/surefire4886721861039605573tmp>
Running org.apache.hadoop.hbase.filter.TestSingleColumnValueFilter
Tests run: 2, Failures: 0, Errors: 0, Skipped: 0, Time elapsed: 0.157 sec
Forking command line: /bin/sh -c cd <https://builds.apache.org/job/HBase-0.92/ws/trunk>
&& /home/jenkins/tools/java/jdk1.6.0_27-32/jre/bin/java -enableassertions -Xmx1400m
-jar <https://builds.apache.org/job/HBase-0.92/ws/trunk/target/surefire/surefirebooter281585346991456173.jar>
<https://builds.apache.org/job/HBase-0.92/ws/trunk/target/surefire/surefire5318798589333788814tmp>
<https://builds.apache.org/job/HBase-0.92/ws/trunk/target/surefire/surefire2020752156887203948tmp>
Running org.apache.hadoop.hbase.filter.TestInclusiveStopFilter
Tests run: 2, Failures: 0, Errors: 0, Skipped: 0, Time elapsed: 0.11 sec
Forking command line: /bin/sh -c cd <https://builds.apache.org/job/HBase-0.92/ws/trunk>
&& /home/jenkins/tools/java/jdk1.6.0_27-32/jre/bin/java -enableassertions -Xmx1400m
-jar <https://builds.apache.org/job/HBase-0.92/ws/trunk/target/surefire/surefirebooter5848104834814977519.jar>
<https://builds.apache.org/job/HBase-0.92/ws/trunk/target/surefire/surefire4035842395398126200tmp>
<https://builds.apache.org/job/HBase-0.92/ws/trunk/target/surefire/surefire7472114700033766293tmp>
Running org.apache.hadoop.hbase.filter.TestFilterList
Tests run: 5, Failures: 0, Errors: 0, Skipped: 0, Time elapsed: 0.24 sec
Forking command line: /bin/sh -c cd <https://builds.apache.org/job/HBase-0.92/ws/trunk>
&& /home/jenkins/tools/java/jdk1.6.0_27-32/jre/bin/java -enableassertions -Xmx1400m
-jar <https://builds.apache.org/job/HBase-0.92/ws/trunk/target/surefire/surefirebooter2239478717378699226.jar>
<https://builds.apache.org/job/HBase-0.92/ws/trunk/target/surefire/surefire4916742112634124036tmp>
<https://builds.apache.org/job/HBase-0.92/ws/trunk/target/surefire/surefire4142716428314213121tmp>
Running org.apache.hadoop.hbase.filter.TestFilter
Tests run: 18, Failures: 0, Errors: 0, Skipped: 0, Time elapsed: 2.359 sec
Forking command line: /bin/sh -c cd <https://builds.apache.org/job/HBase-0.92/ws/trunk>
&& /home/jenkins/tools/java/jdk1.6.0_27-32/jre/bin/java -enableassertions -Xmx1400m
-jar <https://builds.apache.org/job/HBase-0.92/ws/trunk/target/surefire/surefirebooter6648084744475698261.jar>
<https://builds.apache.org/job/HBase-0.92/ws/trunk/target/surefire/surefire3803835803161287222tmp>
<https://builds.apache.org/job/HBase-0.92/ws/trunk/target/surefire/surefire222998774812526345tmp>
Running org.apache.hadoop.hbase.filter.TestMultipleColumnPrefixFilter
Tests run: 3, Failures: 0, Errors: 0, Skipped: 0, Time elapsed: 3.025 sec
Forking command line: /bin/sh -c cd <https://builds.apache.org/job/HBase-0.92/ws/trunk>
&& /home/jenkins/tools/java/jdk1.6.0_27-32/jre/bin/java -enableassertions -Xmx1400m
-jar <https://builds.apache.org/job/HBase-0.92/ws/trunk/target/surefire/surefirebooter7866531776017071713.jar>
<https://builds.apache.org/job/HBase-0.92/ws/trunk/target/surefire/surefire1821435813273268786tmp>
<https://builds.apache.org/job/HBase-0.92/ws/trunk/target/surefire/surefire6554238977652972980tmp>
Running org.apache.hadoop.hbase.filter.TestColumnPrefixFilter
Tests run: 2, Failures: 0, Errors: 0, Skipped: 0, Time elapsed: 2.539 sec
Forking command line: /bin/sh -c cd <https://builds.apache.org/job/HBase-0.92/ws/trunk>
&& /home/jenkins/tools/java/jdk1.6.0_27-32/jre/bin/java -enableassertions -Xmx1400m
-jar <https://builds.apache.org/job/HBase-0.92/ws/trunk/target/surefire/surefirebooter1227304324483569193.jar>
<https://builds.apache.org/job/HBase-0.92/ws/trunk/target/surefire/surefire4339976078567389775tmp>
<https://builds.apache.org/job/HBase-0.92/ws/trunk/target/surefire/surefire3339631841216507768tmp>
Running org.apache.hadoop.hbase.filter.TestSingleColumnValueExcludeFilter
Tests run: 1, Failures: 0, Errors: 0, Skipped: 0, Time elapsed: 0.117 sec
Forking command line: /bin/sh -c cd <https://builds.apache.org/job/HBase-0.92/ws/trunk>
&& /home/jenkins/tools/java/jdk1.6.0_27-32/jre/bin/java -enableassertions -Xmx1400m
-jar <https://builds.apache.org/job/HBase-0.92/ws/trunk/target/surefire/surefirebooter4472775127771880285.jar>
<https://builds.apache.org/job/HBase-0.92/ws/trunk/target/surefire/surefire3534840808609493836tmp>
<https://builds.apache.org/job/HBase-0.92/ws/trunk/target/surefire/surefire4387141437875808094tmp>
Running org.apache.hadoop.hbase.TestGlobalMemStoreSize
Tests run: 1, Failures: 0, Errors: 0, Skipped: 0, Time elapsed: 17.826 sec
Forking command line: /bin/sh -c cd <https://builds.apache.org/job/HBase-0.92/ws/trunk>
&& /home/jenkins/tools/java/jdk1.6.0_27-32/jre/bin/java -enableassertions -Xmx1400m
-jar <https://builds.apache.org/job/HBase-0.92/ws/trunk/target/surefire/surefirebooter7166529082598641071.jar>
<https://builds.apache.org/job/HBase-0.92/ws/trunk/target/surefire/surefire6265634033872644489tmp>
<https://builds.apache.org/job/HBase-0.92/ws/trunk/target/surefire/surefire2004439214726785890tmp>
Running org.apache.hadoop.hbase.TestHBaseTestingUtility
Tests run: 7, Failures: 0, Errors: 0, Skipped: 0, Time elapsed: 79.171 sec
Forking command line: /bin/sh -c cd <https://builds.apache.org/job/HBase-0.92/ws/trunk>
&& /home/jenkins/tools/java/jdk1.6.0_27-32/jre/bin/java -enableassertions -Xmx1400m
-jar <https://builds.apache.org/job/HBase-0.92/ws/trunk/target/surefire/surefirebooter1338959889113216766.jar>
<https://builds.apache.org/job/HBase-0.92/ws/trunk/target/surefire/surefire8334675394238100523tmp>
<https://builds.apache.org/job/HBase-0.92/ws/trunk/target/surefire/surefire1726335902239213733tmp>
Running org.apache.hadoop.hbase.security.TestUser
Tests run: 3, Failures: 0, Errors: 0, Skipped: 0, Time elapsed: 0.438 sec
Forking command line: /bin/sh -c cd <https://builds.apache.org/job/HBase-0.92/ws/trunk>
&& /home/jenkins/tools/java/jdk1.6.0_27-32/jre/bin/java -enableassertions -Xmx1400m
-jar <https://builds.apache.org/job/HBase-0.92/ws/trunk/target/surefire/surefirebooter5954693632061891919.jar>
<https://builds.apache.org/job/HBase-0.92/ws/trunk/target/surefire/surefire4703141462943743676tmp>
<https://builds.apache.org/job/HBase-0.92/ws/trunk/target/surefire/surefire6391390729074590568tmp>
Running org.apache.hadoop.hbase.TestMultiVersions
Tests run: 3, Failures: 0, Errors: 0, Skipped: 0, Time elapsed: 24.998 sec
Forking command line: /bin/sh -c cd <https://builds.apache.org/job/HBase-0.92/ws/trunk>
&& /home/jenkins/tools/java/jdk1.6.0_27-32/jre/bin/java -enableassertions -Xmx1400m
-jar <https://builds.apache.org/job/HBase-0.92/ws/trunk/target/surefire/surefirebooter7261051656404581269.jar>
<https://builds.apache.org/job/HBase-0.92/ws/trunk/target/surefire/surefire9013944344391602331tmp>
<https://builds.apache.org/job/HBase-0.92/ws/trunk/target/surefire/surefire2157274986712168942tmp>
Running org.apache.hadoop.hbase.TestRegionRebalancing
Tests run: 1, Failures: 0, Errors: 0, Skipped: 0, Time elapsed: 54.334 sec
Forking command line: /bin/sh -c cd <https://builds.apache.org/job/HBase-0.92/ws/trunk>
&& /home/jenkins/tools/java/jdk1.6.0_27-32/jre/bin/java -enableassertions -Xmx1400m
-jar <https://builds.apache.org/job/HBase-0.92/ws/trunk/target/surefire/surefirebooter3381697779265828172.jar>
<https://builds.apache.org/job/HBase-0.92/ws/trunk/target/surefire/surefire7762785761730107095tmp>
<https://builds.apache.org/job/HBase-0.92/ws/trunk/target/surefire/surefire8121583280134265118tmp>
Running org.apache.hadoop.hbase.replication.TestReplication
Tests run: 7, Failures: 0, Errors: 0, Skipped: 0, Time elapsed: 120.172 sec
Forking command line: /bin/sh -c cd <https://builds.apache.org/job/HBase-0.92/ws/trunk>
&& /home/jenkins/tools/java/jdk1.6.0_27-32/jre/bin/java -enableassertions -Xmx1400m
-jar <https://builds.apache.org/job/HBase-0.92/ws/trunk/target/surefire/surefirebooter814266828884979796.jar>
<https://builds.apache.org/job/HBase-0.92/ws/trunk/target/surefire/surefire3579020797286865010tmp>
<https://builds.apache.org/job/HBase-0.92/ws/trunk/target/surefire/surefire6463882689436132731tmp>
Running org.apache.hadoop.hbase.replication.TestMasterReplication
Tests run: 2, Failures: 0, Errors: 0, Skipped: 0, Time elapsed: 75.286 sec
Forking command line: /bin/sh -c cd <https://builds.apache.org/job/HBase-0.92/ws/trunk>
&& /home/jenkins/tools/java/jdk1.6.0_27-32/jre/bin/java -enableassertions -Xmx1400m
-jar <https://builds.apache.org/job/HBase-0.92/ws/trunk/target/surefire/surefirebooter5322727743823069058.jar>
<https://builds.apache.org/job/HBase-0.92/ws/trunk/target/surefire/surefire6639488763506311785tmp>
<https://builds.apache.org/job/HBase-0.92/ws/trunk/target/surefire/surefire5178876740653943957tmp>
Running org.apache.hadoop.hbase.replication.regionserver.TestReplicationSourceManager
Tests run: 1, Failures: 0, Errors: 0, Skipped: 0, Time elapsed: 0.856 sec
Forking command line: /bin/sh -c cd <https://builds.apache.org/job/HBase-0.92/ws/trunk>
&& /home/jenkins/tools/java/jdk1.6.0_27-32/jre/bin/java -enableassertions -Xmx1400m
-jar <https://builds.apache.org/job/HBase-0.92/ws/trunk/target/surefire/surefirebooter7636018967122548431.jar>
<https://builds.apache.org/job/HBase-0.92/ws/trunk/target/surefire/surefire1211119567275022673tmp>
<https://builds.apache.org/job/HBase-0.92/ws/trunk/target/surefire/surefire2104956212241107511tmp>
Running org.apache.hadoop.hbase.replication.regionserver.TestReplicationSink
Tests run: 5, Failures: 0, Errors: 0, Skipped: 0, Time elapsed: 18.776 sec
Forking command line: /bin/sh -c cd <https://builds.apache.org/job/HBase-0.92/ws/trunk>
&& /home/jenkins/tools/java/jdk1.6.0_27-32/jre/bin/java -enableassertions -Xmx1400m
-jar <https://builds.apache.org/job/HBase-0.92/ws/trunk/target/surefire/surefirebooter4474308230148195675.jar>
<https://builds.apache.org/job/HBase-0.92/ws/trunk/target/surefire/surefire6284582097120874185tmp>
<https://builds.apache.org/job/HBase-0.92/ws/trunk/target/surefire/surefire2587474086729704892tmp>
Running org.apache.hadoop.hbase.replication.TestReplicationPeer
Tests run: 1, Failures: 0, Errors: 0, Skipped: 0, Time elapsed: 25.49 sec
Forking command line: /bin/sh -c cd <https://builds.apache.org/job/HBase-0.92/ws/trunk>
&& /home/jenkins/tools/java/jdk1.6.0_27-32/jre/bin/java -enableassertions -Xmx1400m
-jar <https://builds.apache.org/job/HBase-0.92/ws/trunk/target/surefire/surefirebooter3672897315076701280.jar>
<https://builds.apache.org/job/HBase-0.92/ws/trunk/target/surefire/surefire572713206911145017tmp>
<https://builds.apache.org/job/HBase-0.92/ws/trunk/target/surefire/surefire5231004680716243001tmp>
Running org.apache.hadoop.hbase.replication.TestMultiSlaveReplication
Tests run: 1, Failures: 0, Errors: 0, Skipped: 0, Time elapsed: 46.13 sec
Forking command line: /bin/sh -c cd <https://builds.apache.org/job/HBase-0.92/ws/trunk>
&& /home/jenkins/tools/java/jdk1.6.0_27-32/jre/bin/java -enableassertions -Xmx1400m
-jar <https://builds.apache.org/job/HBase-0.92/ws/trunk/target/surefire/surefirebooter6365894691255878908.jar>
<https://builds.apache.org/job/HBase-0.92/ws/trunk/target/surefire/surefire7098578307586268182tmp>
<https://builds.apache.org/job/HBase-0.92/ws/trunk/target/surefire/surefire3918456550445862142tmp>
Running org.apache.hadoop.hbase.replication.TestReplicationSource
Tests run: 1, Failures: 0, Errors: 0, Skipped: 0, Time elapsed: 2.55 sec
Forking command line: /bin/sh -c cd <https://builds.apache.org/job/HBase-0.92/ws/trunk>
&& /home/jenkins/tools/java/jdk1.6.0_27-32/jre/bin/java -enableassertions -Xmx1400m
-jar <https://builds.apache.org/job/HBase-0.92/ws/trunk/target/surefire/surefirebooter1311300630615436875.jar>
<https://builds.apache.org/job/HBase-0.92/ws/trunk/target/surefire/surefire1592251016333667477tmp>
<https://builds.apache.org/job/HBase-0.92/ws/trunk/target/surefire/surefire2485055923217417840tmp>
Running org.apache.hadoop.hbase.avro.TestAvroServer
Tests run: 3, Failures: 0, Errors: 0, Skipped: 0, Time elapsed: 27.469 sec
Forking command line: /bin/sh -c cd <https://builds.apache.org/job/HBase-0.92/ws/trunk>
&& /home/jenkins/tools/java/jdk1.6.0_27-32/jre/bin/java -enableassertions -Xmx1400m
-jar <https://builds.apache.org/job/HBase-0.92/ws/trunk/target/surefire/surefirebooter621651752147478106.jar>
<https://builds.apache.org/job/HBase-0.92/ws/trunk/target/surefire/surefire1579957226531019791tmp>
<https://builds.apache.org/job/HBase-0.92/ws/trunk/target/surefire/surefire5099588572738212070tmp>
Running org.apache.hadoop.hbase.avro.TestAvroUtil
Tests run: 1, Failures: 0, Errors: 0, Skipped: 0, Time elapsed: 0.631 sec
Forking command line: /bin/sh -c cd <https://builds.apache.org/job/HBase-0.92/ws/trunk>
&& /home/jenkins/tools/java/jdk1.6.0_27-32/jre/bin/java -enableassertions -Xmx1400m
-jar <https://builds.apache.org/job/HBase-0.92/ws/trunk/target/surefire/surefirebooter4692042896332271801.jar>
<https://builds.apache.org/job/HBase-0.92/ws/trunk/target/surefire/surefire5411523822441389432tmp>
<https://builds.apache.org/job/HBase-0.92/ws/trunk/target/surefire/surefire3962907847915420991tmp>
Running org.apache.hadoop.hbase.TestAcidGuarantees
Tests run: 3, Failures: 0, Errors: 0, Skipped: 3, Time elapsed: 0.062 sec
Forking command line: /bin/sh -c cd <https://builds.apache.org/job/HBase-0.92/ws/trunk>
&& /home/jenkins/tools/java/jdk1.6.0_27-32/jre/bin/java -enableassertions -Xmx1400m
-jar <https://builds.apache.org/job/HBase-0.92/ws/trunk/target/surefire/surefirebooter5293761995610671454.jar>
<https://builds.apache.org/job/HBase-0.92/ws/trunk/target/surefire/surefire3910022692877818933tmp>
<https://builds.apache.org/job/HBase-0.92/ws/trunk/target/surefire/surefire5143491948103215447tmp>
Running org.apache.hadoop.hbase.TestKeyValue
Tests run: 11, Failures: 0, Errors: 0, Skipped: 0, Time elapsed: 0.13 sec
Forking command line: /bin/sh -c cd <https://builds.apache.org/job/HBase-0.92/ws/trunk>
&& /home/jenkins/tools/java/jdk1.6.0_27-32/jre/bin/java -enableassertions -Xmx1400m
-jar <https://builds.apache.org/job/HBase-0.92/ws/trunk/target/surefire/surefirebooter4440049969578011714.jar>
<https://builds.apache.org/job/HBase-0.92/ws/trunk/target/surefire/surefire5208230163761319974tmp>
<https://builds.apache.org/job/HBase-0.92/ws/trunk/target/surefire/surefire4142736762904609385tmp>
Running org.apache.hadoop.hbase.coprocessor.TestRegionServerCoprocessorExceptionWithRemove
Tests run: 1, Failures: 0, Errors: 0, Skipped: 0, Time elapsed: 19.249 sec
Forking command line: /bin/sh -c cd <https://builds.apache.org/job/HBase-0.92/ws/trunk>
&& /home/jenkins/tools/java/jdk1.6.0_27-32/jre/bin/java -enableassertions -Xmx1400m
-jar <https://builds.apache.org/job/HBase-0.92/ws/trunk/target/surefire/surefirebooter7070163723116658236.jar>
<https://builds.apache.org/job/HBase-0.92/ws/trunk/target/surefire/surefire2865136289775734799tmp>
<https://builds.apache.org/job/HBase-0.92/ws/trunk/target/surefire/surefire8403114237326060126tmp>
Running org.apache.hadoop.hbase.coprocessor.TestRegionObserverInterface
Tests run: 5, Failures: 0, Errors: 0, Skipped: 0, Time elapsed: 28.894 sec
Forking command line: /bin/sh -c cd <https://builds.apache.org/job/HBase-0.92/ws/trunk>
&& /home/jenkins/tools/java/jdk1.6.0_27-32/jre/bin/java -enableassertions -Xmx1400m
-jar <https://builds.apache.org/job/HBase-0.92/ws/trunk/target/surefire/surefirebooter1721848131264052399.jar>
<https://builds.apache.org/job/HBase-0.92/ws/trunk/target/surefire/surefire8687449600002719400tmp>
<https://builds.apache.org/job/HBase-0.92/ws/trunk/target/surefire/surefire4091043399228283537tmp>
Running org.apache.hadoop.hbase.coprocessor.TestCoprocessorInterface
Tests run: 1, Failures: 0, Errors: 0, Skipped: 0, Time elapsed: 3.888 sec
Forking command line: /bin/sh -c cd <https://builds.apache.org/job/HBase-0.92/ws/trunk>
&& /home/jenkins/tools/java/jdk1.6.0_27-32/jre/bin/java -enableassertions -Xmx1400m
-jar <https://builds.apache.org/job/HBase-0.92/ws/trunk/target/surefire/surefirebooter8221719533304904602.jar>
<https://builds.apache.org/job/HBase-0.92/ws/trunk/target/surefire/surefire7505689203065849474tmp>
<https://builds.apache.org/job/HBase-0.92/ws/trunk/target/surefire/surefire1746618032598922072tmp>
Running org.apache.hadoop.hbase.coprocessor.TestMasterObserver
Tests run: 3, Failures: 0, Errors: 0, Skipped: 0, Time elapsed: 29.707 sec
Forking command line: /bin/sh -c cd <https://builds.apache.org/job/HBase-0.92/ws/trunk>
&& /home/jenkins/tools/java/jdk1.6.0_27-32/jre/bin/java -enableassertions -Xmx1400m
-jar <https://builds.apache.org/job/HBase-0.92/ws/trunk/target/surefire/surefirebooter2515911545717488248.jar>
<https://builds.apache.org/job/HBase-0.92/ws/trunk/target/surefire/surefire368777886058067558tmp>
<https://builds.apache.org/job/HBase-0.92/ws/trunk/target/surefire/surefire2749192636055616656tmp>
Running org.apache.hadoop.hbase.coprocessor.TestCoprocessorEndpoint
Tests run: 2, Failures: 1, Errors: 0, Skipped: 0, Time elapsed: 32.936 sec <<< FAILURE!
Forking command line: /bin/sh -c cd <https://builds.apache.org/job/HBase-0.92/ws/trunk>
&& /home/jenkins/tools/java/jdk1.6.0_27-32/jre/bin/java -enableassertions -Xmx1400m
-jar <https://builds.apache.org/job/HBase-0.92/ws/trunk/target/surefire/surefirebooter4849495773927630126.jar>
<https://builds.apache.org/job/HBase-0.92/ws/trunk/target/surefire/surefire1645369452199724780tmp>
<https://builds.apache.org/job/HBase-0.92/ws/trunk/target/surefire/surefire1904033639970181847tmp>
Running org.apache.hadoop.hbase.coprocessor.TestWALObserver
Tests run: 3, Failures: 0, Errors: 0, Skipped: 0, Time elapsed: 18.162 sec
Forking command line: /bin/sh -c cd <https://builds.apache.org/job/HBase-0.92/ws/trunk>
&& /home/jenkins/tools/java/jdk1.6.0_27-32/jre/bin/java -enableassertions -Xmx1400m
-jar <https://builds.apache.org/job/HBase-0.92/ws/trunk/target/surefire/surefirebooter6935795705125955761.jar>
<https://builds.apache.org/job/HBase-0.92/ws/trunk/target/surefire/surefire3393536684770948028tmp>
<https://builds.apache.org/job/HBase-0.92/ws/trunk/target/surefire/surefire762481953569257247tmp>
Running org.apache.hadoop.hbase.coprocessor.TestRegionObserverBypass
Tests run: 2, Failures: 0, Errors: 0, Skipped: 0, Time elapsed: 20.25 sec
Forking command line: /bin/sh -c cd <https://builds.apache.org/job/HBase-0.92/ws/trunk>
&& /home/jenkins/tools/java/jdk1.6.0_27-32/jre/bin/java -enableassertions -Xmx1400m
-jar <https://builds.apache.org/job/HBase-0.92/ws/trunk/target/surefire/surefirebooter538453311865912898.jar>
<https://builds.apache.org/job/HBase-0.92/ws/trunk/target/surefire/surefire3974111023200147816tmp>
<https://builds.apache.org/job/HBase-0.92/ws/trunk/target/surefire/surefire251527060338050001tmp>
Running org.apache.hadoop.hbase.coprocessor.TestMasterCoprocessorExceptionWithAbort
Tests run: 1, Failures: 0, Errors: 0, Skipped: 0, Time elapsed: 13.325 sec
Forking command line: /bin/sh -c cd <https://builds.apache.org/job/HBase-0.92/ws/trunk>
&& /home/jenkins/tools/java/jdk1.6.0_27-32/jre/bin/java -enableassertions -Xmx1400m
-jar <https://builds.apache.org/job/HBase-0.92/ws/trunk/target/surefire/surefirebooter3552798997966993226.jar>
<https://builds.apache.org/job/HBase-0.92/ws/trunk/target/surefire/surefire3531816243023991981tmp>
<https://builds.apache.org/job/HBase-0.92/ws/trunk/target/surefire/surefire7688331092120566882tmp>
Running org.apache.hadoop.hbase.coprocessor.TestRegionServerCoprocessorExceptionWithAbort
Tests run: 1, Failures: 0, Errors: 0, Skipped: 0, Time elapsed: 15.797 sec
Forking command line: /bin/sh -c cd <https://builds.apache.org/job/HBase-0.92/ws/trunk>
&& /home/jenkins/tools/java/jdk1.6.0_27-32/jre/bin/java -enableassertions -Xmx1400m
-jar <https://builds.apache.org/job/HBase-0.92/ws/trunk/target/surefire/surefirebooter3602088157132300929.jar>
<https://builds.apache.org/job/HBase-0.92/ws/trunk/target/surefire/surefire4628432966298313284tmp>
<https://builds.apache.org/job/HBase-0.92/ws/trunk/target/surefire/surefire6019820024939814986tmp>
Running org.apache.hadoop.hbase.coprocessor.TestAggregateProtocol
Tests run: 44, Failures: 0, Errors: 0, Skipped: 0, Time elapsed: 17.785 sec
Forking command line: /bin/sh -c cd <https://builds.apache.org/job/HBase-0.92/ws/trunk>
&& /home/jenkins/tools/java/jdk1.6.0_27-32/jre/bin/java -enableassertions -Xmx1400m
-jar <https://builds.apache.org/job/HBase-0.92/ws/trunk/target/surefire/surefirebooter8984902322627565902.jar>
<https://builds.apache.org/job/HBase-0.92/ws/trunk/target/surefire/surefire595259645509878769tmp>
<https://builds.apache.org/job/HBase-0.92/ws/trunk/target/surefire/surefire8140770647139922726tmp>
Running org.apache.hadoop.hbase.coprocessor.TestMasterCoprocessorExceptionWithRemove
Tests run: 1, Failures: 0, Errors: 0, Skipped: 0, Time elapsed: 16.7 sec
Forking command line: /bin/sh -c cd <https://builds.apache.org/job/HBase-0.92/ws/trunk>
&& /home/jenkins/tools/java/jdk1.6.0_27-32/jre/bin/java -enableassertions -Xmx1400m
-jar <https://builds.apache.org/job/HBase-0.92/ws/trunk/target/surefire/surefirebooter760010536389642827.jar>
<https://builds.apache.org/job/HBase-0.92/ws/trunk/target/surefire/surefire7772816690164533316tmp>
<https://builds.apache.org/job/HBase-0.92/ws/trunk/target/surefire/surefire883675553222096240tmp>
Running org.apache.hadoop.hbase.coprocessor.TestRegionObserverStacking
Tests run: 1, Failures: 0, Errors: 0, Skipped: 0, Time elapsed: 0.655 sec
Forking command line: /bin/sh -c cd <https://builds.apache.org/job/HBase-0.92/ws/trunk>
&& /home/jenkins/tools/java/jdk1.6.0_27-32/jre/bin/java -enableassertions -Xmx1400m
-jar <https://builds.apache.org/job/HBase-0.92/ws/trunk/target/surefire/surefirebooter6407002728453175041.jar>
<https://builds.apache.org/job/HBase-0.92/ws/trunk/target/surefire/surefire493806201562881250tmp>
<https://builds.apache.org/job/HBase-0.92/ws/trunk/target/surefire/surefire1113840297422879652tmp>
Running org.apache.hadoop.hbase.coprocessor.TestClassLoading
Tests run: 5, Failures: 0, Errors: 0, Skipped: 0, Time elapsed: 28.266 sec
Forking command line: /bin/sh -c cd <https://builds.apache.org/job/HBase-0.92/ws/trunk>
&& /home/jenkins/tools/java/jdk1.6.0_27-32/jre/bin/java -enableassertions -Xmx1400m
-jar <https://builds.apache.org/job/HBase-0.92/ws/trunk/target/surefire/surefirebooter377746673988167459.jar>
<https://builds.apache.org/job/HBase-0.92/ws/trunk/target/surefire/surefire5964835680098982217tmp>
<https://builds.apache.org/job/HBase-0.92/ws/trunk/target/surefire/surefire97643796178809460tmp>
Running org.apache.hadoop.hbase.mapred.TestTableMapReduce
Tests run: 1, Failures: 0, Errors: 0, Skipped: 0, Time elapsed: 62.106 sec
Forking command line: /bin/sh -c cd <https://builds.apache.org/job/HBase-0.92/ws/trunk>
&& /home/jenkins/tools/java/jdk1.6.0_27-32/jre/bin/java -enableassertions -Xmx1400m
-jar <https://builds.apache.org/job/HBase-0.92/ws/trunk/target/surefire/surefirebooter2596544375318404665.jar>
<https://builds.apache.org/job/HBase-0.92/ws/trunk/target/surefire/surefire5571217085768117190tmp>
<https://builds.apache.org/job/HBase-0.92/ws/trunk/target/surefire/surefire1627424928292745607tmp>
Running org.apache.hadoop.hbase.mapred.TestTableInputFormat
Tests run: 6, Failures: 0, Errors: 0, Skipped: 0, Time elapsed: 23.241 sec
Forking command line: /bin/sh -c cd <https://builds.apache.org/job/HBase-0.92/ws/trunk>
&& /home/jenkins/tools/java/jdk1.6.0_27-32/jre/bin/java -enableassertions -Xmx1400m
-jar <https://builds.apache.org/job/HBase-0.92/ws/trunk/target/surefire/surefirebooter1860563946142766781.jar>
<https://builds.apache.org/job/HBase-0.92/ws/trunk/target/surefire/surefire1627736933342320751tmp>
<https://builds.apache.org/job/HBase-0.92/ws/trunk/target/surefire/surefire9003477499059710879tmp>
Running org.apache.hadoop.hbase.TestServerName
Tests run: 4, Failures: 0, Errors: 0, Skipped: 0, Time elapsed: 0.14 sec
Forking command line: /bin/sh -c cd <https://builds.apache.org/job/HBase-0.92/ws/trunk>
&& /home/jenkins/tools/java/jdk1.6.0_27-32/jre/bin/java -enableassertions -Xmx1400m
-jar <https://builds.apache.org/job/HBase-0.92/ws/trunk/target/surefire/surefirebooter1413793608150865866.jar>
<https://builds.apache.org/job/HBase-0.92/ws/trunk/target/surefire/surefire5488499917751926469tmp>
<https://builds.apache.org/job/HBase-0.92/ws/trunk/target/surefire/surefire6633347401964452283tmp>
Running org.apache.hadoop.hbase.master.TestOpenedRegionHandler
Tests run: 2, Failures: 0, Errors: 0, Skipped: 0, Time elapsed: 18.583 sec
Forking command line: /bin/sh -c cd <https://builds.apache.org/job/HBase-0.92/ws/trunk>
&& /home/jenkins/tools/java/jdk1.6.0_27-32/jre/bin/java -enableassertions -Xmx1400m
-jar <https://builds.apache.org/job/HBase-0.92/ws/trunk/target/surefire/surefirebooter6038611909802671251.jar>
<https://builds.apache.org/job/HBase-0.92/ws/trunk/target/surefire/surefire1698861259892298025tmp>
<https://builds.apache.org/job/HBase-0.92/ws/trunk/target/surefire/surefire5895068951521054661tmp>
Running org.apache.hadoop.hbase.master.TestActiveMasterManager
Tests run: 2, Failures: 0, Errors: 0, Skipped: 0, Time elapsed: 0.69 sec
Forking command line: /bin/sh -c cd <https://builds.apache.org/job/HBase-0.92/ws/trunk>
&& /home/jenkins/tools/java/jdk1.6.0_27-32/jre/bin/java -enableassertions -Xmx1400m
-jar <https://builds.apache.org/job/HBase-0.92/ws/trunk/target/surefire/surefirebooter7771535186913393115.jar>
<https://builds.apache.org/job/HBase-0.92/ws/trunk/target/surefire/surefire7236807647250039599tmp>
<https://builds.apache.org/job/HBase-0.92/ws/trunk/target/surefire/surefire5244584177832528709tmp>
Running org.apache.hadoop.hbase.master.TestMasterFailover
Tests run: 4, Failures: 0, Errors: 0, Skipped: 0, Time elapsed: 77.515 sec
Forking command line: /bin/sh -c cd <https://builds.apache.org/job/HBase-0.92/ws/trunk>
&& /home/jenkins/tools/java/jdk1.6.0_27-32/jre/bin/java -enableassertions -Xmx1400m
-jar <https://builds.apache.org/job/HBase-0.92/ws/trunk/target/surefire/surefirebooter1672216023810907815.jar>
<https://builds.apache.org/job/HBase-0.92/ws/trunk/target/surefire/surefire9113935108658057087tmp>
<https://builds.apache.org/job/HBase-0.92/ws/trunk/target/surefire/surefire5889569178256500362tmp>
Running org.apache.hadoop.hbase.master.TestMasterRestartAfterDisablingTable
Tests run: 1, Failures: 0, Errors: 0, Skipped: 0, Time elapsed: 20.575 sec
Forking command line: /bin/sh -c cd <https://builds.apache.org/job/HBase-0.92/ws/trunk>
&& /home/jenkins/tools/java/jdk1.6.0_27-32/jre/bin/java -enableassertions -Xmx1400m
-jar <https://builds.apache.org/job/HBase-0.92/ws/trunk/target/surefire/surefirebooter3637795371551057255.jar>
<https://builds.apache.org/job/HBase-0.92/ws/trunk/target/surefire/surefire973968416811379858tmp>
<https://builds.apache.org/job/HBase-0.92/ws/trunk/target/surefire/surefire3447055158066259285tmp>
Running org.apache.hadoop.hbase.master.TestCatalogJanitor
Tests run: 3, Failures: 0, Errors: 0, Skipped: 0, Time elapsed: 4.151 sec
Forking command line: /bin/sh -c cd <https://builds.apache.org/job/HBase-0.92/ws/trunk>
&& /home/jenkins/tools/java/jdk1.6.0_27-32/jre/bin/java -enableassertions -Xmx1400m
-jar <https://builds.apache.org/job/HBase-0.92/ws/trunk/target/surefire/surefirebooter7370899598453217649.jar>
<https://builds.apache.org/job/HBase-0.92/ws/trunk/target/surefire/surefire1807242163899638040tmp>
<https://builds.apache.org/job/HBase-0.92/ws/trunk/target/surefire/surefire471342737056212347tmp>
Running org.apache.hadoop.hbase.master.TestRollingRestart
Tests run: 1, Failures: 0, Errors: 0, Skipped: 0, Time elapsed: 59.606 sec
Forking command line: /bin/sh -c cd <https://builds.apache.org/job/HBase-0.92/ws/trunk>
&& /home/jenkins/tools/java/jdk1.6.0_27-32/jre/bin/java -enableassertions -Xmx1400m
-jar <https://builds.apache.org/job/HBase-0.92/ws/trunk/target/surefire/surefirebooter2741468001916439594.jar>
<https://builds.apache.org/job/HBase-0.92/ws/trunk/target/surefire/surefire6667347306915092460tmp>
<https://builds.apache.org/job/HBase-0.92/ws/trunk/target/surefire/surefire8584496097676006174tmp>
Running org.apache.hadoop.hbase.master.TestMasterTransitions
Tests run: 3, Failures: 0, Errors: 0, Skipped: 3, Time elapsed: 19.645 sec
Forking command line: /bin/sh -c cd <https://builds.apache.org/job/HBase-0.92/ws/trunk>
&& /home/jenkins/tools/java/jdk1.6.0_27-32/jre/bin/java -enableassertions -Xmx1400m
-jar <https://builds.apache.org/job/HBase-0.92/ws/trunk/target/surefire/surefirebooter7402264720498018356.jar>
<https://builds.apache.org/job/HBase-0.92/ws/trunk/target/surefire/surefire8645393890637229646tmp>
<https://builds.apache.org/job/HBase-0.92/ws/trunk/target/surefire/surefire1581274587267574002tmp>
Running org.apache.hadoop.hbase.master.TestRestartCluster
Tests run: 2, Failures: 0, Errors: 0, Skipped: 0, Time elapsed: 41.184 sec
Forking command line: /bin/sh -c cd <https://builds.apache.org/job/HBase-0.92/ws/trunk>
&& /home/jenkins/tools/java/jdk1.6.0_27-32/jre/bin/java -enableassertions -Xmx1400m
-jar <https://builds.apache.org/job/HBase-0.92/ws/trunk/target/surefire/surefirebooter8001045230095569563.jar>
<https://builds.apache.org/job/HBase-0.92/ws/trunk/target/surefire/surefire2614709876288661029tmp>
<https://builds.apache.org/job/HBase-0.92/ws/trunk/target/surefire/surefire4387387828225834687tmp>
Running org.apache.hadoop.hbase.master.TestMasterStatusServlet
Tests run: 5, Failures: 0, Errors: 0, Skipped: 0, Time elapsed: 0.945 sec
Forking command line: /bin/sh -c cd <https://builds.apache.org/job/HBase-0.92/ws/trunk>
&& /home/jenkins/tools/java/jdk1.6.0_27-32/jre/bin/java -enableassertions -Xmx1400m
-jar <https://builds.apache.org/job/HBase-0.92/ws/trunk/target/surefire/surefirebooter1263830808160728618.jar>
<https://builds.apache.org/job/HBase-0.92/ws/trunk/target/surefire/surefire8281347718971690486tmp>
<https://builds.apache.org/job/HBase-0.92/ws/trunk/target/surefire/surefire9126783339868955502tmp>
Running org.apache.hadoop.hbase.master.TestClockSkewDetection
Tests run: 1, Failures: 0, Errors: 0, Skipped: 0, Time elapsed: 0.26 sec
Forking command line: /bin/sh -c cd <https://builds.apache.org/job/HBase-0.92/ws/trunk>
&& /home/jenkins/tools/java/jdk1.6.0_27-32/jre/bin/java -enableassertions -Xmx1400m
-jar <https://builds.apache.org/job/HBase-0.92/ws/trunk/target/surefire/surefirebooter6654305722363144590.jar>
<https://builds.apache.org/job/HBase-0.92/ws/trunk/target/surefire/surefire7495847393978316741tmp>
<https://builds.apache.org/job/HBase-0.92/ws/trunk/target/surefire/surefire3933216352870722311tmp>
Running org.apache.hadoop.hbase.master.TestDefaultLoadBalancer
Tests run: 4, Failures: 0, Errors: 0, Skipped: 0, Time elapsed: 1.439 sec
Forking command line: /bin/sh -c cd <https://builds.apache.org/job/HBase-0.92/ws/trunk>
&& /home/jenkins/tools/java/jdk1.6.0_27-32/jre/bin/java -enableassertions -Xmx1400m
-jar <https://builds.apache.org/job/HBase-0.92/ws/trunk/target/surefire/surefirebooter3463182447905857988.jar>
<https://builds.apache.org/job/HBase-0.92/ws/trunk/target/surefire/surefire3674624587341475071tmp>
<https://builds.apache.org/job/HBase-0.92/ws/trunk/target/surefire/surefire5903223123404573341tmp>
Running org.apache.hadoop.hbase.master.TestHMasterRPCException
Tests run: 1, Failures: 0, Errors: 0, Skipped: 0, Time elapsed: 1.169 sec
Forking command line: /bin/sh -c cd <https://builds.apache.org/job/HBase-0.92/ws/trunk>
&& /home/jenkins/tools/java/jdk1.6.0_27-32/jre/bin/java -enableassertions -Xmx1400m
-jar <https://builds.apache.org/job/HBase-0.92/ws/trunk/target/surefire/surefirebooter8048420641449107481.jar>
<https://builds.apache.org/job/HBase-0.92/ws/trunk/target/surefire/surefire5382607633108653073tmp>
<https://builds.apache.org/job/HBase-0.92/ws/trunk/target/surefire/surefire5076470772566754564tmp>
Running org.apache.hadoop.hbase.master.TestDistributedLogSplitting
Tests run: 4, Failures: 0, Errors: 0, Skipped: 0, Time elapsed: 113.757 sec
Forking command line: /bin/sh -c cd <https://builds.apache.org/job/HBase-0.92/ws/trunk>
&& /home/jenkins/tools/java/jdk1.6.0_27-32/jre/bin/java -enableassertions -Xmx1400m
-jar <https://builds.apache.org/job/HBase-0.92/ws/trunk/target/surefire/surefirebooter5930586929273681903.jar>
<https://builds.apache.org/job/HBase-0.92/ws/trunk/target/surefire/surefire1943684601615205774tmp>
<https://builds.apache.org/job/HBase-0.92/ws/trunk/target/surefire/surefire3052525739718023102tmp>
Running org.apache.hadoop.hbase.master.TestMaster
Tests run: 1, Failures: 0, Errors: 0, Skipped: 0, Time elapsed: 14.402 sec
Forking command line: /bin/sh -c cd <https://builds.apache.org/job/HBase-0.92/ws/trunk>
&& /home/jenkins/tools/java/jdk1.6.0_27-32/jre/bin/java -enableassertions -Xmx1400m
-jar <https://builds.apache.org/job/HBase-0.92/ws/trunk/target/surefire/surefirebooter771806626757189959.jar>
<https://builds.apache.org/job/HBase-0.92/ws/trunk/target/surefire/surefire8608776653852410841tmp>
<https://builds.apache.org/job/HBase-0.92/ws/trunk/target/surefire/surefire2942449963273867189tmp>
Running org.apache.hadoop.hbase.master.TestSplitLogManager
Tests run: 10, Failures: 0, Errors: 0, Skipped: 0, Time elapsed: 13.898 sec
Forking command line: /bin/sh -c cd <https://builds.apache.org/job/HBase-0.92/ws/trunk>
&& /home/jenkins/tools/java/jdk1.6.0_27-32/jre/bin/java -enableassertions -Xmx1400m
-jar <https://builds.apache.org/job/HBase-0.92/ws/trunk/target/surefire/surefirebooter2602139672412956958.jar>
<https://builds.apache.org/job/HBase-0.92/ws/trunk/target/surefire/surefire1745507274087890951tmp>
<https://builds.apache.org/job/HBase-0.92/ws/trunk/target/surefire/surefire3975233682046731702tmp>
Running org.apache.hadoop.hbase.master.TestDeadServer
Tests run: 1, Failures: 0, Errors: 0, Skipped: 0, Time elapsed: 0.135 sec
Forking command line: /bin/sh -c cd <https://builds.apache.org/job/HBase-0.92/ws/trunk>
&& /home/jenkins/tools/java/jdk1.6.0_27-32/jre/bin/java -enableassertions -Xmx1400m
-jar <https://builds.apache.org/job/HBase-0.92/ws/trunk/target/surefire/surefirebooter8434914415346616190.jar>
<https://builds.apache.org/job/HBase-0.92/ws/trunk/target/surefire/surefire7161480712701540177tmp>
<https://builds.apache.org/job/HBase-0.92/ws/trunk/target/surefire/surefire6980831936042980856tmp>
Running org.apache.hadoop.hbase.master.TestLogsCleaner
Tests run: 1, Failures: 0, Errors: 0, Skipped: 0, Time elapsed: 2.918 sec
Forking command line: /bin/sh -c cd <https://builds.apache.org/job/HBase-0.92/ws/trunk>
&& /home/jenkins/tools/java/jdk1.6.0_27-32/jre/bin/java -enableassertions -Xmx1400m
-jar <https://builds.apache.org/job/HBase-0.92/ws/trunk/target/surefire/surefirebooter8623295427049590014.jar>
<https://builds.apache.org/job/HBase-0.92/ws/trunk/target/surefire/surefire2947412498561274668tmp>
<https://builds.apache.org/job/HBase-0.92/ws/trunk/target/surefire/surefire7466092282033920935tmp>
Running org.apache.hadoop.hbase.master.TestZKBasedOpenCloseRegion
Tests run: 3, Failures: 0, Errors: 0, Skipped: 0, Time elapsed: 21.46 sec

Results :

Failed tests:   testAggregation(org.apache.hadoop.hbase.coprocessor.TestCoprocessorEndpoint):
Invalid result expected:<134> but was:<190>

Tests run: 1054, Failures: 1, Errors: 0, Skipped: 10

[INFO] ------------------------------------------------------------------------
[INFO] BUILD FAILURE
[INFO] ------------------------------------------------------------------------
[INFO] Total time: 1:39:08.352s
[INFO] Finished at: Sat Nov 12 06:27:47 UTC 2011
[INFO] Final Memory: 43M/447M
[INFO] ------------------------------------------------------------------------
[ERROR] Failed to execute goal org.apache.maven.plugins:maven-surefire-plugin:2.10:test (default-test)
on project hbase: There are test failures.
[ERROR] 
[ERROR] Please refer to <https://builds.apache.org/job/HBase-0.92/ws/trunk/target/surefire-reports>
for the individual test results.
[ERROR] -> [Help 1]
org.apache.maven.lifecycle.LifecycleExecutionException: Failed to execute goal org.apache.maven.plugins:maven-surefire-plugin:2.10:test
(default-test) on project hbase: There are test failures.

Please refer to <https://builds.apache.org/job/HBase-0.92/ws/trunk/target/surefire-reports>
for the individual test results.
	at org.apache.maven.lifecycle.internal.MojoExecutor.execute(MojoExecutor.java:213)
	at org.apache.maven.lifecycle.internal.MojoExecutor.execute(MojoExecutor.java:153)
	at org.apache.maven.lifecycle.internal.MojoExecutor.execute(MojoExecutor.java:145)
	at org.apache.maven.lifecycle.internal.MojoExecutor.executeForkedExecutions(MojoExecutor.java:365)
	at org.apache.maven.lifecycle.internal.MojoExecutor.execute(MojoExecutor.java:199)
	at org.apache.maven.lifecycle.internal.MojoExecutor.execute(MojoExecutor.java:153)
	at org.apache.maven.lifecycle.internal.MojoExecutor.execute(MojoExecutor.java:145)
	at org.apache.maven.lifecycle.internal.LifecycleModuleBuilder.buildProject(LifecycleModuleBuilder.java:84)
	at org.apache.maven.lifecycle.internal.LifecycleModuleBuilder.buildProject(LifecycleModuleBuilder.java:59)
	at org.apache.maven.lifecycle.internal.LifecycleStarter.singleThreadedBuild(LifecycleStarter.java:183)
	at org.apache.maven.lifecycle.internal.LifecycleStarter.execute(LifecycleStarter.java:161)
	at org.apache.maven.DefaultMaven.doExecute(DefaultMaven.java:319)
	at org.apache.maven.DefaultMaven.execute(DefaultMaven.java:156)
	at org.apache.maven.cli.MavenCli.execute(MavenCli.java:537)
	at org.apache.maven.cli.MavenCli.doMain(MavenCli.java:196)
	at org.apache.maven.cli.MavenCli.main(MavenCli.java:141)
	at sun.reflect.NativeMethodAccessorImpl.invoke0(Native Method)
	at sun.reflect.NativeMethodAccessorImpl.invoke(NativeMethodAccessorImpl.java:39)
	at sun.reflect.DelegatingMethodAccessorImpl.invoke(DelegatingMethodAccessorImpl.java:25)
	at java.lang.reflect.Method.invoke(Method.java:597)
	at org.codehaus.plexus.classworlds.launcher.Launcher.launchEnhanced(Launcher.java:290)
	at org.codehaus.plexus.classworlds.launcher.Launcher.launch(Launcher.java:230)
	at org.codehaus.plexus.classworlds.launcher.Launcher.mainWithExitCode(Launcher.java:409)
	at org.codehaus.plexus.classworlds.launcher.Launcher.main(Launcher.java:352)
Caused by: org.apache.maven.plugin.MojoFailureException: There are test failures.

Please refer to <https://builds.apache.org/job/HBase-0.92/ws/trunk/target/surefire-reports>
for the individual test results.
	at org.apache.maven.plugin.surefire.SurefireHelper.reportExecution(SurefireHelper.java:87)
	at org.apache.maven.plugin.surefire.SurefirePlugin.writeSummary(SurefirePlugin.java:641)
	at org.apache.maven.plugin.surefire.SurefirePlugin.handleSummary(SurefirePlugin.java:615)
	at org.apache.maven.plugin.surefire.AbstractSurefireMojo.executeAfterPreconditionsChecked(AbstractSurefireMojo.java:137)
	at org.apache.maven.plugin.surefire.AbstractSurefireMojo.execute(AbstractSurefireMojo.java:98)
	at org.apache.maven.plugin.DefaultBuildPluginManager.executeMojo(DefaultBuildPluginManager.java:101)
	at org.apache.maven.lifecycle.internal.MojoExecutor.execute(MojoExecutor.java:209)
	... 23 more
[ERROR] 
[ERROR] 
[ERROR] For more information about the errors and possible solutions, please read the following
articles:
[ERROR] [Help 1] http://cwiki.apache.org/confluence/display/MAVEN/MojoFailureException
Build step 'Invoke top-level Maven targets' marked build as failure
[locks-and-latches] Releasing all the locks
[locks-and-latches] All the locks released
Archiving artifacts
Recording test results
Updating HBASE-4478


Mime
View raw message