hbase-dev mailing list archives

Site index · List index
Message view « Date » · « Thread »
Top « Date » · « Thread »
From Apache Jenkins Server <jenk...@builds.apache.org>
Subject Build failed in Jenkins: HBase-0.92 #93
Date Tue, 01 Nov 2011 18:52:03 GMT
See <https://builds.apache.org/job/HBase-0.92/93/changes>

Changes:

[stack] HBASE-4714 Don't ship w/ icms enabled by default; REDO

------------------------------------------
[...truncated 6164 lines...]
Forking command line: /bin/sh -c cd <https://builds.apache.org/job/HBase-0.92/ws/trunk>
&& /home/jenkins/tools/java/jdk1.6.0_27-32/jre/bin/java -enableassertions -Xmx1400m
-jar <https://builds.apache.org/job/HBase-0.92/ws/trunk/target/surefire/surefirebooter4720150843310861421.jar>
<https://builds.apache.org/job/HBase-0.92/ws/trunk/target/surefire/surefire4573903481662926357tmp>
<https://builds.apache.org/job/HBase-0.92/ws/trunk/target/surefire/surefire1655754019844447014tmp>
Running org.apache.hadoop.hbase.rest.TestMultiRowResource
Tests run: 3, Failures: 0, Errors: 0, Skipped: 0, Time elapsed: 19.555 sec
Forking command line: /bin/sh -c cd <https://builds.apache.org/job/HBase-0.92/ws/trunk>
&& /home/jenkins/tools/java/jdk1.6.0_27-32/jre/bin/java -enableassertions -Xmx1400m
-jar <https://builds.apache.org/job/HBase-0.92/ws/trunk/target/surefire/surefirebooter7046750925672801576.jar>
<https://builds.apache.org/job/HBase-0.92/ws/trunk/target/surefire/surefire7266308204721385780tmp>
<https://builds.apache.org/job/HBase-0.92/ws/trunk/target/surefire/surefire3807046146368413270tmp>
Running org.apache.hadoop.hbase.rest.TestScannersWithFilters
Tests run: 10, Failures: 0, Errors: 0, Skipped: 0, Time elapsed: 19.986 sec
Forking command line: /bin/sh -c cd <https://builds.apache.org/job/HBase-0.92/ws/trunk>
&& /home/jenkins/tools/java/jdk1.6.0_27-32/jre/bin/java -enableassertions -Xmx1400m
-jar <https://builds.apache.org/job/HBase-0.92/ws/trunk/target/surefire/surefirebooter2339301243003967766.jar>
<https://builds.apache.org/job/HBase-0.92/ws/trunk/target/surefire/surefire5378958540612487405tmp>
<https://builds.apache.org/job/HBase-0.92/ws/trunk/target/surefire/surefire5167614851267888698tmp>
Running org.apache.hadoop.hbase.rest.TestRowResource
Tests run: 11, Failures: 0, Errors: 0, Skipped: 0, Time elapsed: 15.813 sec
Forking command line: /bin/sh -c cd <https://builds.apache.org/job/HBase-0.92/ws/trunk>
&& /home/jenkins/tools/java/jdk1.6.0_27-32/jre/bin/java -enableassertions -Xmx1400m
-jar <https://builds.apache.org/job/HBase-0.92/ws/trunk/target/surefire/surefirebooter4901887409442924937.jar>
<https://builds.apache.org/job/HBase-0.92/ws/trunk/target/surefire/surefire5825147225228517350tmp>
<https://builds.apache.org/job/HBase-0.92/ws/trunk/target/surefire/surefire189100485405370237tmp>
Running org.apache.hadoop.hbase.rest.model.TestCellModel
Tests run: 3, Failures: 0, Errors: 0, Skipped: 0, Time elapsed: 0.372 sec
Forking command line: /bin/sh -c cd <https://builds.apache.org/job/HBase-0.92/ws/trunk>
&& /home/jenkins/tools/java/jdk1.6.0_27-32/jre/bin/java -enableassertions -Xmx1400m
-jar <https://builds.apache.org/job/HBase-0.92/ws/trunk/target/surefire/surefirebooter1412904913155421380.jar>
<https://builds.apache.org/job/HBase-0.92/ws/trunk/target/surefire/surefire1753246800545796408tmp>
<https://builds.apache.org/job/HBase-0.92/ws/trunk/target/surefire/surefire1050544135154530527tmp>
Running org.apache.hadoop.hbase.rest.model.TestCellSetModel
Tests run: 3, Failures: 0, Errors: 0, Skipped: 0, Time elapsed: 0.407 sec
Forking command line: /bin/sh -c cd <https://builds.apache.org/job/HBase-0.92/ws/trunk>
&& /home/jenkins/tools/java/jdk1.6.0_27-32/jre/bin/java -enableassertions -Xmx1400m
-jar <https://builds.apache.org/job/HBase-0.92/ws/trunk/target/surefire/surefirebooter7658856994394930551.jar>
<https://builds.apache.org/job/HBase-0.92/ws/trunk/target/surefire/surefire2232963619036490255tmp>
<https://builds.apache.org/job/HBase-0.92/ws/trunk/target/surefire/surefire2030085407523314103tmp>
Running org.apache.hadoop.hbase.rest.model.TestTableListModel
Tests run: 3, Failures: 0, Errors: 0, Skipped: 0, Time elapsed: 0.39 sec
Forking command line: /bin/sh -c cd <https://builds.apache.org/job/HBase-0.92/ws/trunk>
&& /home/jenkins/tools/java/jdk1.6.0_27-32/jre/bin/java -enableassertions -Xmx1400m
-jar <https://builds.apache.org/job/HBase-0.92/ws/trunk/target/surefire/surefirebooter1129185066044678484.jar>
<https://builds.apache.org/job/HBase-0.92/ws/trunk/target/surefire/surefire70877043436771753tmp>
<https://builds.apache.org/job/HBase-0.92/ws/trunk/target/surefire/surefire4764508755205090465tmp>
Running org.apache.hadoop.hbase.rest.model.TestVersionModel
Tests run: 3, Failures: 0, Errors: 0, Skipped: 0, Time elapsed: 0.37 sec
Forking command line: /bin/sh -c cd <https://builds.apache.org/job/HBase-0.92/ws/trunk>
&& /home/jenkins/tools/java/jdk1.6.0_27-32/jre/bin/java -enableassertions -Xmx1400m
-jar <https://builds.apache.org/job/HBase-0.92/ws/trunk/target/surefire/surefirebooter4753891583142323020.jar>
<https://builds.apache.org/job/HBase-0.92/ws/trunk/target/surefire/surefire1998209138308707651tmp>
<https://builds.apache.org/job/HBase-0.92/ws/trunk/target/surefire/surefire9114956634801346533tmp>
Running org.apache.hadoop.hbase.rest.model.TestColumnSchemaModel
Tests run: 2, Failures: 0, Errors: 0, Skipped: 0, Time elapsed: 0.276 sec
Forking command line: /bin/sh -c cd <https://builds.apache.org/job/HBase-0.92/ws/trunk>
&& /home/jenkins/tools/java/jdk1.6.0_27-32/jre/bin/java -enableassertions -Xmx1400m
-jar <https://builds.apache.org/job/HBase-0.92/ws/trunk/target/surefire/surefirebooter6860834095742684257.jar>
<https://builds.apache.org/job/HBase-0.92/ws/trunk/target/surefire/surefire6139922464407502661tmp>
<https://builds.apache.org/job/HBase-0.92/ws/trunk/target/surefire/surefire276787168523541063tmp>
Running org.apache.hadoop.hbase.rest.model.TestTableInfoModel
Tests run: 3, Failures: 0, Errors: 0, Skipped: 0, Time elapsed: 0.402 sec
Forking command line: /bin/sh -c cd <https://builds.apache.org/job/HBase-0.92/ws/trunk>
&& /home/jenkins/tools/java/jdk1.6.0_27-32/jre/bin/java -enableassertions -Xmx1400m
-jar <https://builds.apache.org/job/HBase-0.92/ws/trunk/target/surefire/surefirebooter5859479367374127304.jar>
<https://builds.apache.org/job/HBase-0.92/ws/trunk/target/surefire/surefire3060166095993375892tmp>
<https://builds.apache.org/job/HBase-0.92/ws/trunk/target/surefire/surefire4003104117796135226tmp>
Running org.apache.hadoop.hbase.rest.model.TestRowModel
Tests run: 2, Failures: 0, Errors: 0, Skipped: 0, Time elapsed: 0.372 sec
Forking command line: /bin/sh -c cd <https://builds.apache.org/job/HBase-0.92/ws/trunk>
&& /home/jenkins/tools/java/jdk1.6.0_27-32/jre/bin/java -enableassertions -Xmx1400m
-jar <https://builds.apache.org/job/HBase-0.92/ws/trunk/target/surefire/surefirebooter3941037561774913041.jar>
<https://builds.apache.org/job/HBase-0.92/ws/trunk/target/surefire/surefire4776551401937801983tmp>
<https://builds.apache.org/job/HBase-0.92/ws/trunk/target/surefire/surefire6205722699502606649tmp>
Running org.apache.hadoop.hbase.rest.model.TestTableSchemaModel
Tests run: 3, Failures: 0, Errors: 0, Skipped: 0, Time elapsed: 0.411 sec
Forking command line: /bin/sh -c cd <https://builds.apache.org/job/HBase-0.92/ws/trunk>
&& /home/jenkins/tools/java/jdk1.6.0_27-32/jre/bin/java -enableassertions -Xmx1400m
-jar <https://builds.apache.org/job/HBase-0.92/ws/trunk/target/surefire/surefirebooter1859143413680810761.jar>
<https://builds.apache.org/job/HBase-0.92/ws/trunk/target/surefire/surefire8108756068846044598tmp>
<https://builds.apache.org/job/HBase-0.92/ws/trunk/target/surefire/surefire2505029642758461591tmp>
Running org.apache.hadoop.hbase.rest.model.TestStorageClusterVersionModel
Tests run: 2, Failures: 0, Errors: 0, Skipped: 0, Time elapsed: 0.274 sec
Forking command line: /bin/sh -c cd <https://builds.apache.org/job/HBase-0.92/ws/trunk>
&& /home/jenkins/tools/java/jdk1.6.0_27-32/jre/bin/java -enableassertions -Xmx1400m
-jar <https://builds.apache.org/job/HBase-0.92/ws/trunk/target/surefire/surefirebooter8231963772592934311.jar>
<https://builds.apache.org/job/HBase-0.92/ws/trunk/target/surefire/surefire4382567298915500933tmp>
<https://builds.apache.org/job/HBase-0.92/ws/trunk/target/surefire/surefire7080141570054211766tmp>
Running org.apache.hadoop.hbase.rest.model.TestTableRegionModel
Tests run: 4, Failures: 0, Errors: 0, Skipped: 0, Time elapsed: 0.47 sec
Forking command line: /bin/sh -c cd <https://builds.apache.org/job/HBase-0.92/ws/trunk>
&& /home/jenkins/tools/java/jdk1.6.0_27-32/jre/bin/java -enableassertions -Xmx1400m
-jar <https://builds.apache.org/job/HBase-0.92/ws/trunk/target/surefire/surefirebooter2842515327348593974.jar>
<https://builds.apache.org/job/HBase-0.92/ws/trunk/target/surefire/surefire2517018207009502976tmp>
<https://builds.apache.org/job/HBase-0.92/ws/trunk/target/surefire/surefire2410065923810392588tmp>
Running org.apache.hadoop.hbase.rest.model.TestStorageClusterStatusModel
Tests run: 3, Failures: 0, Errors: 0, Skipped: 0, Time elapsed: 0.451 sec
Forking command line: /bin/sh -c cd <https://builds.apache.org/job/HBase-0.92/ws/trunk>
&& /home/jenkins/tools/java/jdk1.6.0_27-32/jre/bin/java -enableassertions -Xmx1400m
-jar <https://builds.apache.org/job/HBase-0.92/ws/trunk/target/surefire/surefirebooter8098158619199411116.jar>
<https://builds.apache.org/job/HBase-0.92/ws/trunk/target/surefire/surefire5237905420369084998tmp>
<https://builds.apache.org/job/HBase-0.92/ws/trunk/target/surefire/surefire7405628876761800250tmp>
Running org.apache.hadoop.hbase.rest.model.TestScannerModel
Tests run: 3, Failures: 0, Errors: 0, Skipped: 0, Time elapsed: 0.409 sec
Forking command line: /bin/sh -c cd <https://builds.apache.org/job/HBase-0.92/ws/trunk>
&& /home/jenkins/tools/java/jdk1.6.0_27-32/jre/bin/java -enableassertions -Xmx1400m
-jar <https://builds.apache.org/job/HBase-0.92/ws/trunk/target/surefire/surefirebooter2571565024700621223.jar>
<https://builds.apache.org/job/HBase-0.92/ws/trunk/target/surefire/surefire2315999042375715294tmp>
<https://builds.apache.org/job/HBase-0.92/ws/trunk/target/surefire/surefire3548744480598229305tmp>
Running org.apache.hadoop.hbase.rest.client.TestRemoteAdmin
Tests run: 1, Failures: 0, Errors: 0, Skipped: 0, Time elapsed: 21.493 sec
Forking command line: /bin/sh -c cd <https://builds.apache.org/job/HBase-0.92/ws/trunk>
&& /home/jenkins/tools/java/jdk1.6.0_27-32/jre/bin/java -enableassertions -Xmx1400m
-jar <https://builds.apache.org/job/HBase-0.92/ws/trunk/target/surefire/surefirebooter6695378596538738789.jar>
<https://builds.apache.org/job/HBase-0.92/ws/trunk/target/surefire/surefire64446623852882904tmp>
<https://builds.apache.org/job/HBase-0.92/ws/trunk/target/surefire/surefire5705863494121230914tmp>
Running org.apache.hadoop.hbase.rest.client.TestRemoteTable
Tests run: 3, Failures: 0, Errors: 0, Skipped: 0, Time elapsed: 17.998 sec
Forking command line: /bin/sh -c cd <https://builds.apache.org/job/HBase-0.92/ws/trunk>
&& /home/jenkins/tools/java/jdk1.6.0_27-32/jre/bin/java -enableassertions -Xmx1400m
-jar <https://builds.apache.org/job/HBase-0.92/ws/trunk/target/surefire/surefirebooter7505836923489102182.jar>
<https://builds.apache.org/job/HBase-0.92/ws/trunk/target/surefire/surefire7866872888554682040tmp>
<https://builds.apache.org/job/HBase-0.92/ws/trunk/target/surefire/surefire1285840299389519699tmp>
Running org.apache.hadoop.hbase.rest.TestVersionResource
Tests run: 7, Failures: 0, Errors: 0, Skipped: 0, Time elapsed: 13.073 sec
Forking command line: /bin/sh -c cd <https://builds.apache.org/job/HBase-0.92/ws/trunk>
&& /home/jenkins/tools/java/jdk1.6.0_27-32/jre/bin/java -enableassertions -Xmx1400m
-jar <https://builds.apache.org/job/HBase-0.92/ws/trunk/target/surefire/surefirebooter4693203035598435697.jar>
<https://builds.apache.org/job/HBase-0.92/ws/trunk/target/surefire/surefire8771521136718374402tmp>
<https://builds.apache.org/job/HBase-0.92/ws/trunk/target/surefire/surefire8171219550722781056tmp>
Running org.apache.hadoop.hbase.rest.TestScannerResource
Tests run: 5, Failures: 0, Errors: 0, Skipped: 0, Time elapsed: 28.163 sec
Forking command line: /bin/sh -c cd <https://builds.apache.org/job/HBase-0.92/ws/trunk>
&& /home/jenkins/tools/java/jdk1.6.0_27-32/jre/bin/java -enableassertions -Xmx1400m
-jar <https://builds.apache.org/job/HBase-0.92/ws/trunk/target/surefire/surefirebooter7693013871084836874.jar>
<https://builds.apache.org/job/HBase-0.92/ws/trunk/target/surefire/surefire4179655945019797742tmp>
<https://builds.apache.org/job/HBase-0.92/ws/trunk/target/surefire/surefire9105711701180296267tmp>
Running org.apache.hadoop.hbase.rest.TestTransform
Tests run: 1, Failures: 0, Errors: 0, Skipped: 0, Time elapsed: 17.051 sec
Forking command line: /bin/sh -c cd <https://builds.apache.org/job/HBase-0.92/ws/trunk>
&& /home/jenkins/tools/java/jdk1.6.0_27-32/jre/bin/java -enableassertions -Xmx1400m
-jar <https://builds.apache.org/job/HBase-0.92/ws/trunk/target/surefire/surefirebooter8999651676541849626.jar>
<https://builds.apache.org/job/HBase-0.92/ws/trunk/target/surefire/surefire5187137202519920768tmp>
<https://builds.apache.org/job/HBase-0.92/ws/trunk/target/surefire/surefire1344320169482151133tmp>
Running org.apache.hadoop.hbase.rest.TestTableResource
Tests run: 8, Failures: 0, Errors: 0, Skipped: 0, Time elapsed: 22.669 sec
Forking command line: /bin/sh -c cd <https://builds.apache.org/job/HBase-0.92/ws/trunk>
&& /home/jenkins/tools/java/jdk1.6.0_27-32/jre/bin/java -enableassertions -Xmx1400m
-jar <https://builds.apache.org/job/HBase-0.92/ws/trunk/target/surefire/surefirebooter8657461522777069614.jar>
<https://builds.apache.org/job/HBase-0.92/ws/trunk/target/surefire/surefire8837386743582197247tmp>
<https://builds.apache.org/job/HBase-0.92/ws/trunk/target/surefire/surefire4797419360714022180tmp>
Running org.apache.hadoop.hbase.rest.TestStatusResource
Tests run: 2, Failures: 0, Errors: 0, Skipped: 0, Time elapsed: 13.084 sec
Forking command line: /bin/sh -c cd <https://builds.apache.org/job/HBase-0.92/ws/trunk>
&& /home/jenkins/tools/java/jdk1.6.0_27-32/jre/bin/java -enableassertions -Xmx1400m
-jar <https://builds.apache.org/job/HBase-0.92/ws/trunk/target/surefire/surefirebooter2638932079245174418.jar>
<https://builds.apache.org/job/HBase-0.92/ws/trunk/target/surefire/surefire5142255443427509941tmp>
<https://builds.apache.org/job/HBase-0.92/ws/trunk/target/surefire/surefire2466164527138204157tmp>
Running org.apache.hadoop.hbase.rest.TestSchemaResource
Tests run: 2, Failures: 0, Errors: 0, Skipped: 0, Time elapsed: 23.354 sec
Forking command line: /bin/sh -c cd <https://builds.apache.org/job/HBase-0.92/ws/trunk>
&& /home/jenkins/tools/java/jdk1.6.0_27-32/jre/bin/java -enableassertions -Xmx1400m
-jar <https://builds.apache.org/job/HBase-0.92/ws/trunk/target/surefire/surefirebooter596134423920582565.jar>
<https://builds.apache.org/job/HBase-0.92/ws/trunk/target/surefire/surefire3707757947292653738tmp>
<https://builds.apache.org/job/HBase-0.92/ws/trunk/target/surefire/surefire6422123299108532375tmp>
Running org.apache.hadoop.hbase.thrift.TestThriftServer
Tests run: 1, Failures: 0, Errors: 0, Skipped: 0, Time elapsed: 18.962 sec
Forking command line: /bin/sh -c cd <https://builds.apache.org/job/HBase-0.92/ws/trunk>
&& /home/jenkins/tools/java/jdk1.6.0_27-32/jre/bin/java -enableassertions -Xmx1400m
-jar <https://builds.apache.org/job/HBase-0.92/ws/trunk/target/surefire/surefirebooter2748016813160977293.jar>
<https://builds.apache.org/job/HBase-0.92/ws/trunk/target/surefire/surefire4670194436516289780tmp>
<https://builds.apache.org/job/HBase-0.92/ws/trunk/target/surefire/surefire3790109162835696026tmp>
Running org.apache.hadoop.hbase.io.TestHeapSize
Tests run: 2, Failures: 0, Errors: 0, Skipped: 0, Time elapsed: 0.161 sec
Forking command line: /bin/sh -c cd <https://builds.apache.org/job/HBase-0.92/ws/trunk>
&& /home/jenkins/tools/java/jdk1.6.0_27-32/jre/bin/java -enableassertions -Xmx1400m
-jar <https://builds.apache.org/job/HBase-0.92/ws/trunk/target/surefire/surefirebooter811094179923756907.jar>
<https://builds.apache.org/job/HBase-0.92/ws/trunk/target/surefire/surefire4692922701525905159tmp>
<https://builds.apache.org/job/HBase-0.92/ws/trunk/target/surefire/surefire40898902284937057tmp>
Running org.apache.hadoop.hbase.io.hfile.TestHFileSeek
Tests run: 1, Failures: 0, Errors: 0, Skipped: 0, Time elapsed: 5.719 sec
Forking command line: /bin/sh -c cd <https://builds.apache.org/job/HBase-0.92/ws/trunk>
&& /home/jenkins/tools/java/jdk1.6.0_27-32/jre/bin/java -enableassertions -Xmx1400m
-jar <https://builds.apache.org/job/HBase-0.92/ws/trunk/target/surefire/surefirebooter3589659904195923178.jar>
<https://builds.apache.org/job/HBase-0.92/ws/trunk/target/surefire/surefire7886903160249481230tmp>
<https://builds.apache.org/job/HBase-0.92/ws/trunk/target/surefire/surefire5450976123230655159tmp>
Running org.apache.hadoop.hbase.io.hfile.slab.TestSlab
Tests run: 1, Failures: 0, Errors: 0, Skipped: 0, Time elapsed: 0.144 sec
Forking command line: /bin/sh -c cd <https://builds.apache.org/job/HBase-0.92/ws/trunk>
&& /home/jenkins/tools/java/jdk1.6.0_27-32/jre/bin/java -enableassertions -Xmx1400m
-jar <https://builds.apache.org/job/HBase-0.92/ws/trunk/target/surefire/surefirebooter2747870443459436314.jar>
<https://builds.apache.org/job/HBase-0.92/ws/trunk/target/surefire/surefire382329534154916129tmp>
<https://builds.apache.org/job/HBase-0.92/ws/trunk/target/surefire/surefire1782055943915531379tmp>
Running org.apache.hadoop.hbase.io.hfile.slab.TestSlabCache
Tests run: 7, Failures: 0, Errors: 0, Skipped: 0, Time elapsed: 19.536 sec
Forking command line: /bin/sh -c cd <https://builds.apache.org/job/HBase-0.92/ws/trunk>
&& /home/jenkins/tools/java/jdk1.6.0_27-32/jre/bin/java -enableassertions -Xmx1400m
-jar <https://builds.apache.org/job/HBase-0.92/ws/trunk/target/surefire/surefirebooter5364172161913264433.jar>
<https://builds.apache.org/job/HBase-0.92/ws/trunk/target/surefire/surefire3361702364946634173tmp>
<https://builds.apache.org/job/HBase-0.92/ws/trunk/target/surefire/surefire4685591996801087939tmp>
Running org.apache.hadoop.hbase.io.hfile.slab.TestSingleSizeCache
Tests run: 5, Failures: 0, Errors: 0, Skipped: 0, Time elapsed: 24.977 sec
Forking command line: /bin/sh -c cd <https://builds.apache.org/job/HBase-0.92/ws/trunk>
&& /home/jenkins/tools/java/jdk1.6.0_27-32/jre/bin/java -enableassertions -Xmx1400m
-jar <https://builds.apache.org/job/HBase-0.92/ws/trunk/target/surefire/surefirebooter7078562327420959505.jar>
<https://builds.apache.org/job/HBase-0.92/ws/trunk/target/surefire/surefire7575295934063003506tmp>
<https://builds.apache.org/job/HBase-0.92/ws/trunk/target/surefire/surefire8123615836497236675tmp>
Running org.apache.hadoop.hbase.io.hfile.TestCachedBlockQueue
Tests run: 2, Failures: 0, Errors: 0, Skipped: 0, Time elapsed: 0.103 sec
Forking command line: /bin/sh -c cd <https://builds.apache.org/job/HBase-0.92/ws/trunk>
&& /home/jenkins/tools/java/jdk1.6.0_27-32/jre/bin/java -enableassertions -Xmx1400m
-jar <https://builds.apache.org/job/HBase-0.92/ws/trunk/target/surefire/surefirebooter4905774172276643189.jar>
<https://builds.apache.org/job/HBase-0.92/ws/trunk/target/surefire/surefire3232970743337656565tmp>
<https://builds.apache.org/job/HBase-0.92/ws/trunk/target/surefire/surefire3257523516256390593tmp>
Running org.apache.hadoop.hbase.io.hfile.TestHFileBlockIndex
Tests run: 10, Failures: 0, Errors: 0, Skipped: 0, Time elapsed: 10.054 sec
Forking command line: /bin/sh -c cd <https://builds.apache.org/job/HBase-0.92/ws/trunk>
&& /home/jenkins/tools/java/jdk1.6.0_27-32/jre/bin/java -enableassertions -Xmx1400m
-jar <https://builds.apache.org/job/HBase-0.92/ws/trunk/target/surefire/surefirebooter9141592029476125188.jar>
<https://builds.apache.org/job/HBase-0.92/ws/trunk/target/surefire/surefire2069333381381783035tmp>
<https://builds.apache.org/job/HBase-0.92/ws/trunk/target/surefire/surefire4395193117107261460tmp>
Running org.apache.hadoop.hbase.io.hfile.TestLruBlockCache
Tests run: 7, Failures: 0, Errors: 0, Skipped: 0, Time elapsed: 0.342 sec
Forking command line: /bin/sh -c cd <https://builds.apache.org/job/HBase-0.92/ws/trunk>
&& /home/jenkins/tools/java/jdk1.6.0_27-32/jre/bin/java -enableassertions -Xmx1400m
-jar <https://builds.apache.org/job/HBase-0.92/ws/trunk/target/surefire/surefirebooter870460541546867084.jar>
<https://builds.apache.org/job/HBase-0.92/ws/trunk/target/surefire/surefire509831021998219349tmp>
<https://builds.apache.org/job/HBase-0.92/ws/trunk/target/surefire/surefire8415327353054082609tmp>
Running org.apache.hadoop.hbase.io.hfile.TestHFilePerformance
Tests run: 1, Failures: 0, Errors: 0, Skipped: 0, Time elapsed: 6.231 sec
Forking command line: /bin/sh -c cd <https://builds.apache.org/job/HBase-0.92/ws/trunk>
&& /home/jenkins/tools/java/jdk1.6.0_27-32/jre/bin/java -enableassertions -Xmx1400m
-jar <https://builds.apache.org/job/HBase-0.92/ws/trunk/target/surefire/surefirebooter253833767157527698.jar>
<https://builds.apache.org/job/HBase-0.92/ws/trunk/target/surefire/surefire3889651102708747302tmp>
<https://builds.apache.org/job/HBase-0.92/ws/trunk/target/surefire/surefire5774183194538188287tmp>
Running org.apache.hadoop.hbase.io.hfile.TestFixedFileTrailer
Tests run: 2, Failures: 0, Errors: 0, Skipped: 0, Time elapsed: 0.58 sec
Forking command line: /bin/sh -c cd <https://builds.apache.org/job/HBase-0.92/ws/trunk>
&& /home/jenkins/tools/java/jdk1.6.0_27-32/jre/bin/java -enableassertions -Xmx1400m
-jar <https://builds.apache.org/job/HBase-0.92/ws/trunk/target/surefire/surefirebooter1328143588584499303.jar>
<https://builds.apache.org/job/HBase-0.92/ws/trunk/target/surefire/surefire7866416664317184503tmp>
<https://builds.apache.org/job/HBase-0.92/ws/trunk/target/surefire/surefire5178171825402084522tmp>
Running org.apache.hadoop.hbase.io.hfile.TestHFileWriterV2
Tests run: 1, Failures: 0, Errors: 0, Skipped: 0, Time elapsed: 0.959 sec
Forking command line: /bin/sh -c cd <https://builds.apache.org/job/HBase-0.92/ws/trunk>
&& /home/jenkins/tools/java/jdk1.6.0_27-32/jre/bin/java -enableassertions -Xmx1400m
-jar <https://builds.apache.org/job/HBase-0.92/ws/trunk/target/surefire/surefirebooter6169694520042996032.jar>
<https://builds.apache.org/job/HBase-0.92/ws/trunk/target/surefire/surefire8117164045501475845tmp>
<https://builds.apache.org/job/HBase-0.92/ws/trunk/target/surefire/surefire7534599673475847363tmp>
Running org.apache.hadoop.hbase.io.hfile.TestBlockCacheColumnFamilySummary
Tests run: 4, Failures: 0, Errors: 0, Skipped: 0, Time elapsed: 0.056 sec
Forking command line: /bin/sh -c cd <https://builds.apache.org/job/HBase-0.92/ws/trunk>
&& /home/jenkins/tools/java/jdk1.6.0_27-32/jre/bin/java -enableassertions -Xmx1400m
-jar <https://builds.apache.org/job/HBase-0.92/ws/trunk/target/surefire/surefirebooter3233448267295688240.jar>
<https://builds.apache.org/job/HBase-0.92/ws/trunk/target/surefire/surefire5977241903107649052tmp>
<https://builds.apache.org/job/HBase-0.92/ws/trunk/target/surefire/surefire8478234538569925216tmp>
Running org.apache.hadoop.hbase.io.hfile.TestHFileReaderV1
Tests run: 1, Failures: 0, Errors: 0, Skipped: 0, Time elapsed: 0.578 sec
Forking command line: /bin/sh -c cd <https://builds.apache.org/job/HBase-0.92/ws/trunk>
&& /home/jenkins/tools/java/jdk1.6.0_27-32/jre/bin/java -enableassertions -Xmx1400m
-jar <https://builds.apache.org/job/HBase-0.92/ws/trunk/target/surefire/surefirebooter7217798310824478393.jar>
<https://builds.apache.org/job/HBase-0.92/ws/trunk/target/surefire/surefire4952656085134983487tmp>
<https://builds.apache.org/job/HBase-0.92/ws/trunk/target/surefire/surefire7292123951109770036tmp>
Running org.apache.hadoop.hbase.io.hfile.TestHFile
Tests run: 6, Failures: 0, Errors: 0, Skipped: 0, Time elapsed: 0.86 sec
Forking command line: /bin/sh -c cd <https://builds.apache.org/job/HBase-0.92/ws/trunk>
&& /home/jenkins/tools/java/jdk1.6.0_27-32/jre/bin/java -enableassertions -Xmx1400m
-jar <https://builds.apache.org/job/HBase-0.92/ws/trunk/target/surefire/surefirebooter1780264179629837653.jar>
<https://builds.apache.org/job/HBase-0.92/ws/trunk/target/surefire/surefire6687914611308553724tmp>
<https://builds.apache.org/job/HBase-0.92/ws/trunk/target/surefire/surefire5206518147420996964tmp>
Running org.apache.hadoop.hbase.io.hfile.TestReseekTo
Tests run: 1, Failures: 0, Errors: 0, Skipped: 0, Time elapsed: 0.641 sec
Forking command line: /bin/sh -c cd <https://builds.apache.org/job/HBase-0.92/ws/trunk>
&& /home/jenkins/tools/java/jdk1.6.0_27-32/jre/bin/java -enableassertions -Xmx1400m
-jar <https://builds.apache.org/job/HBase-0.92/ws/trunk/target/surefire/surefirebooter9207148905703566789.jar>
<https://builds.apache.org/job/HBase-0.92/ws/trunk/target/surefire/surefire594333046441444395tmp>
<https://builds.apache.org/job/HBase-0.92/ws/trunk/target/surefire/surefire7578168051326588994tmp>
Running org.apache.hadoop.hbase.io.hfile.TestHFileBlock
Tests run: 7, Failures: 0, Errors: 0, Skipped: 0, Time elapsed: 25.41 sec
Forking command line: /bin/sh -c cd <https://builds.apache.org/job/HBase-0.92/ws/trunk>
&& /home/jenkins/tools/java/jdk1.6.0_27-32/jre/bin/java -enableassertions -Xmx1400m
-jar <https://builds.apache.org/job/HBase-0.92/ws/trunk/target/surefire/surefirebooter8500289277829746332.jar>
<https://builds.apache.org/job/HBase-0.92/ws/trunk/target/surefire/surefire1001065014468505443tmp>
<https://builds.apache.org/job/HBase-0.92/ws/trunk/target/surefire/surefire2702892796258960469tmp>
Running org.apache.hadoop.hbase.io.hfile.TestSeekTo
Tests run: 3, Failures: 0, Errors: 0, Skipped: 0, Time elapsed: 0.667 sec
Forking command line: /bin/sh -c cd <https://builds.apache.org/job/HBase-0.92/ws/trunk>
&& /home/jenkins/tools/java/jdk1.6.0_27-32/jre/bin/java -enableassertions -Xmx1400m
-jar <https://builds.apache.org/job/HBase-0.92/ws/trunk/target/surefire/surefirebooter987052658602846643.jar>
<https://builds.apache.org/job/HBase-0.92/ws/trunk/target/surefire/surefire2692488809997693096tmp>
<https://builds.apache.org/job/HBase-0.92/ws/trunk/target/surefire/surefire3127389662250946304tmp>
Running org.apache.hadoop.hbase.io.hfile.TestCacheOnWrite
Tests run: 6, Failures: 0, Errors: 0, Skipped: 0, Time elapsed: 7.488 sec
Forking command line: /bin/sh -c cd <https://builds.apache.org/job/HBase-0.92/ws/trunk>
&& /home/jenkins/tools/java/jdk1.6.0_27-32/jre/bin/java -enableassertions -Xmx1400m
-jar <https://builds.apache.org/job/HBase-0.92/ws/trunk/target/surefire/surefirebooter5014377917508615897.jar>
<https://builds.apache.org/job/HBase-0.92/ws/trunk/target/surefire/surefire8173769210709105274tmp>
<https://builds.apache.org/job/HBase-0.92/ws/trunk/target/surefire/surefire5206673510901249788tmp>
Running org.apache.hadoop.hbase.io.TestHbaseObjectWritable
Tests run: 4, Failures: 0, Errors: 0, Skipped: 0, Time elapsed: 0.472 sec
Forking command line: /bin/sh -c cd <https://builds.apache.org/job/HBase-0.92/ws/trunk>
&& /home/jenkins/tools/java/jdk1.6.0_27-32/jre/bin/java -enableassertions -Xmx1400m
-jar <https://builds.apache.org/job/HBase-0.92/ws/trunk/target/surefire/surefirebooter1294473221030482018.jar>
<https://builds.apache.org/job/HBase-0.92/ws/trunk/target/surefire/surefire1956135417224276129tmp>
<https://builds.apache.org/job/HBase-0.92/ws/trunk/target/surefire/surefire2130688183730801598tmp>
Running org.apache.hadoop.hbase.io.TestImmutableBytesWritable
Tests run: 3, Failures: 0, Errors: 0, Skipped: 0, Time elapsed: 0.11 sec
Forking command line: /bin/sh -c cd <https://builds.apache.org/job/HBase-0.92/ws/trunk>
&& /home/jenkins/tools/java/jdk1.6.0_27-32/jre/bin/java -enableassertions -Xmx1400m
-jar <https://builds.apache.org/job/HBase-0.92/ws/trunk/target/surefire/surefirebooter8840908035359025496.jar>
<https://builds.apache.org/job/HBase-0.92/ws/trunk/target/surefire/surefire5560570343101410055tmp>
<https://builds.apache.org/job/HBase-0.92/ws/trunk/target/surefire/surefire8779099701334873839tmp>
Running org.apache.hadoop.hbase.io.TestHalfStoreFileReader
Tests run: 1, Failures: 0, Errors: 0, Skipped: 0, Time elapsed: 0.693 sec
Forking command line: /bin/sh -c cd <https://builds.apache.org/job/HBase-0.92/ws/trunk>
&& /home/jenkins/tools/java/jdk1.6.0_27-32/jre/bin/java -enableassertions -Xmx1400m
-jar <https://builds.apache.org/job/HBase-0.92/ws/trunk/target/surefire/surefirebooter96964541641474628.jar>
<https://builds.apache.org/job/HBase-0.92/ws/trunk/target/surefire/surefire3315217462253630527tmp>
<https://builds.apache.org/job/HBase-0.92/ws/trunk/target/surefire/surefire2711743536103494662tmp>
Running org.apache.hadoop.hbase.migration.TestMigrationFrom090To092
Tests run: 1, Failures: 0, Errors: 0, Skipped: 0, Time elapsed: 0.274 sec
Forking command line: /bin/sh -c cd <https://builds.apache.org/job/HBase-0.92/ws/trunk>
&& /home/jenkins/tools/java/jdk1.6.0_27-32/jre/bin/java -enableassertions -Xmx1400m
-jar <https://builds.apache.org/job/HBase-0.92/ws/trunk/target/surefire/surefirebooter2220155058800760860.jar>
<https://builds.apache.org/job/HBase-0.92/ws/trunk/target/surefire/surefire8575480979569935723tmp>
<https://builds.apache.org/job/HBase-0.92/ws/trunk/target/surefire/surefire1125830882588498261tmp>
Running org.apache.hadoop.hbase.TestFSTableDescriptorForceCreation
Tests run: 3, Failures: 0, Errors: 0, Skipped: 0, Time elapsed: 0.537 sec
Forking command line: /bin/sh -c cd <https://builds.apache.org/job/HBase-0.92/ws/trunk>
&& /home/jenkins/tools/java/jdk1.6.0_27-32/jre/bin/java -enableassertions -Xmx1400m
-jar <https://builds.apache.org/job/HBase-0.92/ws/trunk/target/surefire/surefirebooter7232778936466754657.jar>
<https://builds.apache.org/job/HBase-0.92/ws/trunk/target/surefire/surefire7414378147656893927tmp>
<https://builds.apache.org/job/HBase-0.92/ws/trunk/target/surefire/surefire7691273877666727373tmp>
Running org.apache.hadoop.hbase.avro.TestAvroUtil
Tests run: 1, Failures: 0, Errors: 0, Skipped: 0, Time elapsed: 0.636 sec
Forking command line: /bin/sh -c cd <https://builds.apache.org/job/HBase-0.92/ws/trunk>
&& /home/jenkins/tools/java/jdk1.6.0_27-32/jre/bin/java -enableassertions -Xmx1400m
-jar <https://builds.apache.org/job/HBase-0.92/ws/trunk/target/surefire/surefirebooter2504275483462181585.jar>
<https://builds.apache.org/job/HBase-0.92/ws/trunk/target/surefire/surefire7361035367784359447tmp>
<https://builds.apache.org/job/HBase-0.92/ws/trunk/target/surefire/surefire8047958120671306418tmp>
Running org.apache.hadoop.hbase.avro.TestAvroServer
Tests run: 3, Failures: 0, Errors: 0, Skipped: 0, Time elapsed: 30.656 sec
Forking command line: /bin/sh -c cd <https://builds.apache.org/job/HBase-0.92/ws/trunk>
&& /home/jenkins/tools/java/jdk1.6.0_27-32/jre/bin/java -enableassertions -Xmx1400m
-jar <https://builds.apache.org/job/HBase-0.92/ws/trunk/target/surefire/surefirebooter7421148795373889445.jar>
<https://builds.apache.org/job/HBase-0.92/ws/trunk/target/surefire/surefire9205432731196827359tmp>
<https://builds.apache.org/job/HBase-0.92/ws/trunk/target/surefire/surefire8795047292805332133tmp>
Running org.apache.hadoop.hbase.TestKeyValue
Tests run: 11, Failures: 0, Errors: 0, Skipped: 0, Time elapsed: 0.13 sec
Forking command line: /bin/sh -c cd <https://builds.apache.org/job/HBase-0.92/ws/trunk>
&& /home/jenkins/tools/java/jdk1.6.0_27-32/jre/bin/java -enableassertions -Xmx1400m
-jar <https://builds.apache.org/job/HBase-0.92/ws/trunk/target/surefire/surefirebooter6877105580391377621.jar>
<https://builds.apache.org/job/HBase-0.92/ws/trunk/target/surefire/surefire2229486605829790331tmp>
<https://builds.apache.org/job/HBase-0.92/ws/trunk/target/surefire/surefire898201102404648556tmp>
Running org.apache.hadoop.hbase.replication.TestMultiSlaveReplication
Tests run: 1, Failures: 0, Errors: 0, Skipped: 0, Time elapsed: 47.266 sec
Forking command line: /bin/sh -c cd <https://builds.apache.org/job/HBase-0.92/ws/trunk>
&& /home/jenkins/tools/java/jdk1.6.0_27-32/jre/bin/java -enableassertions -Xmx1400m
-jar <https://builds.apache.org/job/HBase-0.92/ws/trunk/target/surefire/surefirebooter5540768005099158300.jar>
<https://builds.apache.org/job/HBase-0.92/ws/trunk/target/surefire/surefire2610062037634976464tmp>
<https://builds.apache.org/job/HBase-0.92/ws/trunk/target/surefire/surefire6732443211811130324tmp>
Running org.apache.hadoop.hbase.replication.regionserver.TestReplicationSourceManager
Tests run: 1, Failures: 0, Errors: 0, Skipped: 0, Time elapsed: 0.897 sec
Forking command line: /bin/sh -c cd <https://builds.apache.org/job/HBase-0.92/ws/trunk>
&& /home/jenkins/tools/java/jdk1.6.0_27-32/jre/bin/java -enableassertions -Xmx1400m
-jar <https://builds.apache.org/job/HBase-0.92/ws/trunk/target/surefire/surefirebooter4166903974641057234.jar>
<https://builds.apache.org/job/HBase-0.92/ws/trunk/target/surefire/surefire4467580495576985214tmp>
<https://builds.apache.org/job/HBase-0.92/ws/trunk/target/surefire/surefire7679422098126882358tmp>
Running org.apache.hadoop.hbase.replication.regionserver.TestReplicationSink
Tests run: 5, Failures: 0, Errors: 0, Skipped: 0, Time elapsed: 19.419 sec
Forking command line: /bin/sh -c cd <https://builds.apache.org/job/HBase-0.92/ws/trunk>
&& /home/jenkins/tools/java/jdk1.6.0_27-32/jre/bin/java -enableassertions -Xmx1400m
-jar <https://builds.apache.org/job/HBase-0.92/ws/trunk/target/surefire/surefirebooter3930659986660610745.jar>
<https://builds.apache.org/job/HBase-0.92/ws/trunk/target/surefire/surefire5045091127201139064tmp>
<https://builds.apache.org/job/HBase-0.92/ws/trunk/target/surefire/surefire5375252347334328380tmp>
Running org.apache.hadoop.hbase.replication.TestMasterReplication
Tests run: 2, Failures: 0, Errors: 0, Skipped: 0, Time elapsed: 80.049 sec
Forking command line: /bin/sh -c cd <https://builds.apache.org/job/HBase-0.92/ws/trunk>
&& /home/jenkins/tools/java/jdk1.6.0_27-32/jre/bin/java -enableassertions -Xmx1400m
-jar <https://builds.apache.org/job/HBase-0.92/ws/trunk/target/surefire/surefirebooter2599373179069638640.jar>
<https://builds.apache.org/job/HBase-0.92/ws/trunk/target/surefire/surefire4656895132989198430tmp>
<https://builds.apache.org/job/HBase-0.92/ws/trunk/target/surefire/surefire8047068495882951058tmp>
Running org.apache.hadoop.hbase.replication.TestReplicationSource
Tests run: 1, Failures: 0, Errors: 0, Skipped: 0, Time elapsed: 2.754 sec
Forking command line: /bin/sh -c cd <https://builds.apache.org/job/HBase-0.92/ws/trunk>
&& /home/jenkins/tools/java/jdk1.6.0_27-32/jre/bin/java -enableassertions -Xmx1400m
-jar <https://builds.apache.org/job/HBase-0.92/ws/trunk/target/surefire/surefirebooter4934112503035305747.jar>
<https://builds.apache.org/job/HBase-0.92/ws/trunk/target/surefire/surefire8963010499475738541tmp>
<https://builds.apache.org/job/HBase-0.92/ws/trunk/target/surefire/surefire2079335565880437637tmp>
Running org.apache.hadoop.hbase.replication.TestReplicationPeer
Tests run: 1, Failures: 0, Errors: 0, Skipped: 0, Time elapsed: 25.6 sec
Forking command line: /bin/sh -c cd <https://builds.apache.org/job/HBase-0.92/ws/trunk>
&& /home/jenkins/tools/java/jdk1.6.0_27-32/jre/bin/java -enableassertions -Xmx1400m
-jar <https://builds.apache.org/job/HBase-0.92/ws/trunk/target/surefire/surefirebooter2847854179650177980.jar>
<https://builds.apache.org/job/HBase-0.92/ws/trunk/target/surefire/surefire4800390733679889090tmp>
<https://builds.apache.org/job/HBase-0.92/ws/trunk/target/surefire/surefire3978737162303687832tmp>
Running org.apache.hadoop.hbase.replication.TestReplication
Tests run: 7, Failures: 0, Errors: 0, Skipped: 0, Time elapsed: 155.999 sec
Forking command line: /bin/sh -c cd <https://builds.apache.org/job/HBase-0.92/ws/trunk>
&& /home/jenkins/tools/java/jdk1.6.0_27-32/jre/bin/java -enableassertions -Xmx1400m
-jar <https://builds.apache.org/job/HBase-0.92/ws/trunk/target/surefire/surefirebooter1598431685443346635.jar>
<https://builds.apache.org/job/HBase-0.92/ws/trunk/target/surefire/surefire5957969406653143233tmp>
<https://builds.apache.org/job/HBase-0.92/ws/trunk/target/surefire/surefire1817554805325432967tmp>
Running org.apache.hadoop.hbase.ipc.TestDelayedRpc
Tests run: 4, Failures: 0, Errors: 0, Skipped: 0, Time elapsed: 2.525 sec
Forking command line: /bin/sh -c cd <https://builds.apache.org/job/HBase-0.92/ws/trunk>
&& /home/jenkins/tools/java/jdk1.6.0_27-32/jre/bin/java -enableassertions -Xmx1400m
-jar <https://builds.apache.org/job/HBase-0.92/ws/trunk/target/surefire/surefirebooter8158457652578454221.jar>
<https://builds.apache.org/job/HBase-0.92/ws/trunk/target/surefire/surefire253197634632198930tmp>
<https://builds.apache.org/job/HBase-0.92/ws/trunk/target/surefire/surefire4080682738293782903tmp>
Running org.apache.hadoop.hbase.TestCompare
Tests run: 1, Failures: 0, Errors: 0, Skipped: 0, Time elapsed: 0.24 sec
Forking command line: /bin/sh -c cd <https://builds.apache.org/job/HBase-0.92/ws/trunk>
&& /home/jenkins/tools/java/jdk1.6.0_27-32/jre/bin/java -enableassertions -Xmx1400m
-jar <https://builds.apache.org/job/HBase-0.92/ws/trunk/target/surefire/surefirebooter227736657217093571.jar>
<https://builds.apache.org/job/HBase-0.92/ws/trunk/target/surefire/surefire2687485727495850304tmp>
<https://builds.apache.org/job/HBase-0.92/ws/trunk/target/surefire/surefire6150690313000553425tmp>
Running org.apache.hadoop.hbase.TestZooKeeper
Tests run: 7, Failures: 0, Errors: 0, Skipped: 0, Time elapsed: 83.64 sec
Forking command line: /bin/sh -c cd <https://builds.apache.org/job/HBase-0.92/ws/trunk>
&& /home/jenkins/tools/java/jdk1.6.0_27-32/jre/bin/java -enableassertions -Xmx1400m
-jar <https://builds.apache.org/job/HBase-0.92/ws/trunk/target/surefire/surefirebooter5883746560032234643.jar>
<https://builds.apache.org/job/HBase-0.92/ws/trunk/target/surefire/surefire2012374488321753080tmp>
<https://builds.apache.org/job/HBase-0.92/ws/trunk/target/surefire/surefire9146703751604954834tmp>
Running org.apache.hadoop.hbase.TestHBaseTestingUtility
Tests run: 7, Failures: 0, Errors: 0, Skipped: 0, Time elapsed: 73.139 sec

Results :

Failed tests:   testGlobalMemStore(org.apache.hadoop.hbase.TestGlobalMemStoreSize): expected:<496>
but was:<0>

Tests run: 1040, Failures: 1, Errors: 0, Skipped: 9

[INFO] ------------------------------------------------------------------------
[INFO] BUILD FAILURE
[INFO] ------------------------------------------------------------------------
[INFO] Total time: 1:34:41.082s
[INFO] Finished at: Tue Nov 01 18:51:18 UTC 2011
[INFO] Final Memory: 42M/724M
[INFO] ------------------------------------------------------------------------
[ERROR] Failed to execute goal org.apache.maven.plugins:maven-surefire-plugin:2.9:test (default-test)
on project hbase: There are test failures.
[ERROR] 
[ERROR] Please refer to <https://builds.apache.org/job/HBase-0.92/ws/trunk/target/surefire-reports>
for the individual test results.
[ERROR] -> [Help 1]
org.apache.maven.lifecycle.LifecycleExecutionException: Failed to execute goal org.apache.maven.plugins:maven-surefire-plugin:2.9:test
(default-test) on project hbase: There are test failures.

Please refer to <https://builds.apache.org/job/HBase-0.92/ws/trunk/target/surefire-reports>
for the individual test results.
	at org.apache.maven.lifecycle.internal.MojoExecutor.execute(MojoExecutor.java:213)
	at org.apache.maven.lifecycle.internal.MojoExecutor.execute(MojoExecutor.java:153)
	at org.apache.maven.lifecycle.internal.MojoExecutor.execute(MojoExecutor.java:145)
	at org.apache.maven.lifecycle.internal.MojoExecutor.executeForkedExecutions(MojoExecutor.java:365)
	at org.apache.maven.lifecycle.internal.MojoExecutor.execute(MojoExecutor.java:199)
	at org.apache.maven.lifecycle.internal.MojoExecutor.execute(MojoExecutor.java:153)
	at org.apache.maven.lifecycle.internal.MojoExecutor.execute(MojoExecutor.java:145)
	at org.apache.maven.lifecycle.internal.LifecycleModuleBuilder.buildProject(LifecycleModuleBuilder.java:84)
	at org.apache.maven.lifecycle.internal.LifecycleModuleBuilder.buildProject(LifecycleModuleBuilder.java:59)
	at org.apache.maven.lifecycle.internal.LifecycleStarter.singleThreadedBuild(LifecycleStarter.java:183)
	at org.apache.maven.lifecycle.internal.LifecycleStarter.execute(LifecycleStarter.java:161)
	at org.apache.maven.DefaultMaven.doExecute(DefaultMaven.java:319)
	at org.apache.maven.DefaultMaven.execute(DefaultMaven.java:156)
	at org.apache.maven.cli.MavenCli.execute(MavenCli.java:537)
	at org.apache.maven.cli.MavenCli.doMain(MavenCli.java:196)
	at org.apache.maven.cli.MavenCli.main(MavenCli.java:141)
	at sun.reflect.NativeMethodAccessorImpl.invoke0(Native Method)
	at sun.reflect.NativeMethodAccessorImpl.invoke(NativeMethodAccessorImpl.java:39)
	at sun.reflect.DelegatingMethodAccessorImpl.invoke(DelegatingMethodAccessorImpl.java:25)
	at java.lang.reflect.Method.invoke(Method.java:597)
	at org.codehaus.plexus.classworlds.launcher.Launcher.launchEnhanced(Launcher.java:290)
	at org.codehaus.plexus.classworlds.launcher.Launcher.launch(Launcher.java:230)
	at org.codehaus.plexus.classworlds.launcher.Launcher.mainWithExitCode(Launcher.java:409)
	at org.codehaus.plexus.classworlds.launcher.Launcher.main(Launcher.java:352)
Caused by: org.apache.maven.plugin.MojoFailureException: There are test failures.

Please refer to <https://builds.apache.org/job/HBase-0.92/ws/trunk/target/surefire-reports>
for the individual test results.
	at org.apache.maven.plugin.surefire.SurefireHelper.reportExecution(SurefireHelper.java:87)
	at org.apache.maven.plugin.surefire.SurefirePlugin.writeSummary(SurefirePlugin.java:631)
	at org.apache.maven.plugin.surefire.SurefirePlugin.handleSummary(SurefirePlugin.java:605)
	at org.apache.maven.plugin.surefire.AbstractSurefireMojo.executeAfterPreconditionsChecked(AbstractSurefireMojo.java:136)
	at org.apache.maven.plugin.surefire.AbstractSurefireMojo.execute(AbstractSurefireMojo.java:97)
	at org.apache.maven.plugin.DefaultBuildPluginManager.executeMojo(DefaultBuildPluginManager.java:101)
	at org.apache.maven.lifecycle.internal.MojoExecutor.execute(MojoExecutor.java:209)
	... 23 more
[ERROR] 
[ERROR] 
[ERROR] For more information about the errors and possible solutions, please read the following
articles:
[ERROR] [Help 1] http://cwiki.apache.org/confluence/display/MAVEN/MojoFailureException
Build step 'Invoke top-level Maven targets' marked build as failure
[locks-and-latches] Releasing all the locks
[locks-and-latches] All the locks released
Archiving artifacts
Recording test results
Updating HBASE-4714


Mime
View raw message