hbase-dev mailing list archives

Site index · List index
Message view « Date » · « Thread »
Top « Date » · « Thread »
From Apache Jenkins Server <jenk...@builds.apache.org>
Subject Build failed in Jenkins: HBase-0.92-security #23
Date Tue, 29 Nov 2011 05:06:36 GMT
See <https://builds.apache.org/job/HBase-0.92-security/23/changes>

Changes:

[tedyu] HBASE-4883 Addendum fixes compilation error

------------------------------------------
[...truncated 6800 lines...]
Forking command line: /bin/sh -c cd <https://builds.apache.org/job/HBase-0.92-security/ws/trunk>
&& /home/jenkins/tools/java/jdk1.6.0_27-32/jre/bin/java -enableassertions -Xmx1400m
-Djava.security.egd=file:/dev/./urandom -jar <https://builds.apache.org/job/HBase-0.92-security/ws/trunk/target/surefire/surefirebooter7133638233077955383.jar>
<https://builds.apache.org/job/HBase-0.92-security/ws/trunk/target/surefire/surefire835566921051030285tmp>
<https://builds.apache.org/job/HBase-0.92-security/ws/trunk/target/surefire/surefire6865598372530565401tmp>
Running org.apache.hadoop.hbase.rest.TestMultiRowResource
Tests run: 3, Failures: 0, Errors: 0, Skipped: 0, Time elapsed: 22.311 sec
Forking command line: /bin/sh -c cd <https://builds.apache.org/job/HBase-0.92-security/ws/trunk>
&& /home/jenkins/tools/java/jdk1.6.0_27-32/jre/bin/java -enableassertions -Xmx1400m
-Djava.security.egd=file:/dev/./urandom -jar <https://builds.apache.org/job/HBase-0.92-security/ws/trunk/target/surefire/surefirebooter2509406279720787772.jar>
<https://builds.apache.org/job/HBase-0.92-security/ws/trunk/target/surefire/surefire1175276554434187992tmp>
<https://builds.apache.org/job/HBase-0.92-security/ws/trunk/target/surefire/surefire7348094402996139911tmp>
Running org.apache.hadoop.hbase.rest.TestScannersWithFilters
Tests run: 10, Failures: 0, Errors: 0, Skipped: 0, Time elapsed: 23.204 sec
Forking command line: /bin/sh -c cd <https://builds.apache.org/job/HBase-0.92-security/ws/trunk>
&& /home/jenkins/tools/java/jdk1.6.0_27-32/jre/bin/java -enableassertions -Xmx1400m
-Djava.security.egd=file:/dev/./urandom -jar <https://builds.apache.org/job/HBase-0.92-security/ws/trunk/target/surefire/surefirebooter1634632295419685141.jar>
<https://builds.apache.org/job/HBase-0.92-security/ws/trunk/target/surefire/surefire6809308590572386807tmp>
<https://builds.apache.org/job/HBase-0.92-security/ws/trunk/target/surefire/surefire8701490987551089679tmp>
Running org.apache.hadoop.hbase.rest.TestRowResource
Tests run: 11, Failures: 0, Errors: 0, Skipped: 0, Time elapsed: 22.725 sec
Forking command line: /bin/sh -c cd <https://builds.apache.org/job/HBase-0.92-security/ws/trunk>
&& /home/jenkins/tools/java/jdk1.6.0_27-32/jre/bin/java -enableassertions -Xmx1400m
-Djava.security.egd=file:/dev/./urandom -jar <https://builds.apache.org/job/HBase-0.92-security/ws/trunk/target/surefire/surefirebooter4467081467700709005.jar>
<https://builds.apache.org/job/HBase-0.92-security/ws/trunk/target/surefire/surefire5261326021725744028tmp>
<https://builds.apache.org/job/HBase-0.92-security/ws/trunk/target/surefire/surefire5810230890724012622tmp>
Running org.apache.hadoop.hbase.rest.model.TestCellModel
Tests run: 3, Failures: 0, Errors: 0, Skipped: 0, Time elapsed: 0.371 sec
Forking command line: /bin/sh -c cd <https://builds.apache.org/job/HBase-0.92-security/ws/trunk>
&& /home/jenkins/tools/java/jdk1.6.0_27-32/jre/bin/java -enableassertions -Xmx1400m
-Djava.security.egd=file:/dev/./urandom -jar <https://builds.apache.org/job/HBase-0.92-security/ws/trunk/target/surefire/surefirebooter4396359063863804828.jar>
<https://builds.apache.org/job/HBase-0.92-security/ws/trunk/target/surefire/surefire7816645221201308341tmp>
<https://builds.apache.org/job/HBase-0.92-security/ws/trunk/target/surefire/surefire1280327368802940556tmp>
Running org.apache.hadoop.hbase.rest.model.TestCellSetModel
Tests run: 3, Failures: 0, Errors: 0, Skipped: 0, Time elapsed: 0.411 sec
Forking command line: /bin/sh -c cd <https://builds.apache.org/job/HBase-0.92-security/ws/trunk>
&& /home/jenkins/tools/java/jdk1.6.0_27-32/jre/bin/java -enableassertions -Xmx1400m
-Djava.security.egd=file:/dev/./urandom -jar <https://builds.apache.org/job/HBase-0.92-security/ws/trunk/target/surefire/surefirebooter6992297733154954250.jar>
<https://builds.apache.org/job/HBase-0.92-security/ws/trunk/target/surefire/surefire1911688173254197545tmp>
<https://builds.apache.org/job/HBase-0.92-security/ws/trunk/target/surefire/surefire1842919158004308157tmp>
Running org.apache.hadoop.hbase.rest.model.TestTableListModel
Tests run: 3, Failures: 0, Errors: 0, Skipped: 0, Time elapsed: 0.385 sec
Forking command line: /bin/sh -c cd <https://builds.apache.org/job/HBase-0.92-security/ws/trunk>
&& /home/jenkins/tools/java/jdk1.6.0_27-32/jre/bin/java -enableassertions -Xmx1400m
-Djava.security.egd=file:/dev/./urandom -jar <https://builds.apache.org/job/HBase-0.92-security/ws/trunk/target/surefire/surefirebooter6573485777163659768.jar>
<https://builds.apache.org/job/HBase-0.92-security/ws/trunk/target/surefire/surefire9030785600846244183tmp>
<https://builds.apache.org/job/HBase-0.92-security/ws/trunk/target/surefire/surefire4588659067450354795tmp>
Running org.apache.hadoop.hbase.rest.model.TestVersionModel
Tests run: 3, Failures: 0, Errors: 0, Skipped: 0, Time elapsed: 0.367 sec
Forking command line: /bin/sh -c cd <https://builds.apache.org/job/HBase-0.92-security/ws/trunk>
&& /home/jenkins/tools/java/jdk1.6.0_27-32/jre/bin/java -enableassertions -Xmx1400m
-Djava.security.egd=file:/dev/./urandom -jar <https://builds.apache.org/job/HBase-0.92-security/ws/trunk/target/surefire/surefirebooter698099717810474333.jar>
<https://builds.apache.org/job/HBase-0.92-security/ws/trunk/target/surefire/surefire4317113176111379707tmp>
<https://builds.apache.org/job/HBase-0.92-security/ws/trunk/target/surefire/surefire2185197665929267443tmp>
Running org.apache.hadoop.hbase.rest.model.TestColumnSchemaModel
Tests run: 2, Failures: 0, Errors: 0, Skipped: 0, Time elapsed: 0.276 sec
Forking command line: /bin/sh -c cd <https://builds.apache.org/job/HBase-0.92-security/ws/trunk>
&& /home/jenkins/tools/java/jdk1.6.0_27-32/jre/bin/java -enableassertions -Xmx1400m
-Djava.security.egd=file:/dev/./urandom -jar <https://builds.apache.org/job/HBase-0.92-security/ws/trunk/target/surefire/surefirebooter8675798752807592500.jar>
<https://builds.apache.org/job/HBase-0.92-security/ws/trunk/target/surefire/surefire5091184996488913943tmp>
<https://builds.apache.org/job/HBase-0.92-security/ws/trunk/target/surefire/surefire1916334375334486485tmp>
Running org.apache.hadoop.hbase.rest.model.TestTableInfoModel
Tests run: 3, Failures: 0, Errors: 0, Skipped: 0, Time elapsed: 0.406 sec
Forking command line: /bin/sh -c cd <https://builds.apache.org/job/HBase-0.92-security/ws/trunk>
&& /home/jenkins/tools/java/jdk1.6.0_27-32/jre/bin/java -enableassertions -Xmx1400m
-Djava.security.egd=file:/dev/./urandom -jar <https://builds.apache.org/job/HBase-0.92-security/ws/trunk/target/surefire/surefirebooter7059412508363420778.jar>
<https://builds.apache.org/job/HBase-0.92-security/ws/trunk/target/surefire/surefire8153397859801406281tmp>
<https://builds.apache.org/job/HBase-0.92-security/ws/trunk/target/surefire/surefire6384332281798771922tmp>
Running org.apache.hadoop.hbase.rest.model.TestRowModel
Tests run: 2, Failures: 0, Errors: 0, Skipped: 0, Time elapsed: 0.37 sec
Forking command line: /bin/sh -c cd <https://builds.apache.org/job/HBase-0.92-security/ws/trunk>
&& /home/jenkins/tools/java/jdk1.6.0_27-32/jre/bin/java -enableassertions -Xmx1400m
-Djava.security.egd=file:/dev/./urandom -jar <https://builds.apache.org/job/HBase-0.92-security/ws/trunk/target/surefire/surefirebooter4706040154648831785.jar>
<https://builds.apache.org/job/HBase-0.92-security/ws/trunk/target/surefire/surefire2110383489504109691tmp>
<https://builds.apache.org/job/HBase-0.92-security/ws/trunk/target/surefire/surefire5468593570739135898tmp>
Running org.apache.hadoop.hbase.rest.model.TestTableSchemaModel
Tests run: 3, Failures: 0, Errors: 0, Skipped: 0, Time elapsed: 0.408 sec
Forking command line: /bin/sh -c cd <https://builds.apache.org/job/HBase-0.92-security/ws/trunk>
&& /home/jenkins/tools/java/jdk1.6.0_27-32/jre/bin/java -enableassertions -Xmx1400m
-Djava.security.egd=file:/dev/./urandom -jar <https://builds.apache.org/job/HBase-0.92-security/ws/trunk/target/surefire/surefirebooter2516582601776871933.jar>
<https://builds.apache.org/job/HBase-0.92-security/ws/trunk/target/surefire/surefire4913793950594719363tmp>
<https://builds.apache.org/job/HBase-0.92-security/ws/trunk/target/surefire/surefire6740878761726349561tmp>
Running org.apache.hadoop.hbase.rest.model.TestStorageClusterVersionModel
Tests run: 2, Failures: 0, Errors: 0, Skipped: 0, Time elapsed: 0.271 sec
Forking command line: /bin/sh -c cd <https://builds.apache.org/job/HBase-0.92-security/ws/trunk>
&& /home/jenkins/tools/java/jdk1.6.0_27-32/jre/bin/java -enableassertions -Xmx1400m
-Djava.security.egd=file:/dev/./urandom -jar <https://builds.apache.org/job/HBase-0.92-security/ws/trunk/target/surefire/surefirebooter7677319311858511771.jar>
<https://builds.apache.org/job/HBase-0.92-security/ws/trunk/target/surefire/surefire7908233411195895398tmp>
<https://builds.apache.org/job/HBase-0.92-security/ws/trunk/target/surefire/surefire3780274232449581481tmp>
Running org.apache.hadoop.hbase.rest.model.TestTableRegionModel
Tests run: 4, Failures: 0, Errors: 0, Skipped: 0, Time elapsed: 0.461 sec
Forking command line: /bin/sh -c cd <https://builds.apache.org/job/HBase-0.92-security/ws/trunk>
&& /home/jenkins/tools/java/jdk1.6.0_27-32/jre/bin/java -enableassertions -Xmx1400m
-Djava.security.egd=file:/dev/./urandom -jar <https://builds.apache.org/job/HBase-0.92-security/ws/trunk/target/surefire/surefirebooter5736785588243209938.jar>
<https://builds.apache.org/job/HBase-0.92-security/ws/trunk/target/surefire/surefire4522072552714463810tmp>
<https://builds.apache.org/job/HBase-0.92-security/ws/trunk/target/surefire/surefire8798749826744917898tmp>
Running org.apache.hadoop.hbase.rest.model.TestStorageClusterStatusModel
Tests run: 3, Failures: 0, Errors: 0, Skipped: 0, Time elapsed: 0.447 sec
Forking command line: /bin/sh -c cd <https://builds.apache.org/job/HBase-0.92-security/ws/trunk>
&& /home/jenkins/tools/java/jdk1.6.0_27-32/jre/bin/java -enableassertions -Xmx1400m
-Djava.security.egd=file:/dev/./urandom -jar <https://builds.apache.org/job/HBase-0.92-security/ws/trunk/target/surefire/surefirebooter5944777063147432918.jar>
<https://builds.apache.org/job/HBase-0.92-security/ws/trunk/target/surefire/surefire2454446048676425557tmp>
<https://builds.apache.org/job/HBase-0.92-security/ws/trunk/target/surefire/surefire8728353619986068255tmp>
Running org.apache.hadoop.hbase.rest.model.TestScannerModel
Tests run: 3, Failures: 0, Errors: 0, Skipped: 0, Time elapsed: 0.409 sec
Forking command line: /bin/sh -c cd <https://builds.apache.org/job/HBase-0.92-security/ws/trunk>
&& /home/jenkins/tools/java/jdk1.6.0_27-32/jre/bin/java -enableassertions -Xmx1400m
-Djava.security.egd=file:/dev/./urandom -jar <https://builds.apache.org/job/HBase-0.92-security/ws/trunk/target/surefire/surefirebooter43302217419602593.jar>
<https://builds.apache.org/job/HBase-0.92-security/ws/trunk/target/surefire/surefire5976907347770018653tmp>
<https://builds.apache.org/job/HBase-0.92-security/ws/trunk/target/surefire/surefire1395390586086660799tmp>
Running org.apache.hadoop.hbase.rest.client.TestRemoteAdmin
Tests run: 1, Failures: 0, Errors: 0, Skipped: 0, Time elapsed: 24.526 sec
Forking command line: /bin/sh -c cd <https://builds.apache.org/job/HBase-0.92-security/ws/trunk>
&& /home/jenkins/tools/java/jdk1.6.0_27-32/jre/bin/java -enableassertions -Xmx1400m
-Djava.security.egd=file:/dev/./urandom -jar <https://builds.apache.org/job/HBase-0.92-security/ws/trunk/target/surefire/surefirebooter7276398704286687215.jar>
<https://builds.apache.org/job/HBase-0.92-security/ws/trunk/target/surefire/surefire4638928862638855743tmp>
<https://builds.apache.org/job/HBase-0.92-security/ws/trunk/target/surefire/surefire1546816230028921078tmp>
Running org.apache.hadoop.hbase.rest.client.TestRemoteTable
Tests run: 3, Failures: 0, Errors: 0, Skipped: 0, Time elapsed: 23.358 sec
Forking command line: /bin/sh -c cd <https://builds.apache.org/job/HBase-0.92-security/ws/trunk>
&& /home/jenkins/tools/java/jdk1.6.0_27-32/jre/bin/java -enableassertions -Xmx1400m
-Djava.security.egd=file:/dev/./urandom -jar <https://builds.apache.org/job/HBase-0.92-security/ws/trunk/target/surefire/surefirebooter6822350160190842003.jar>
<https://builds.apache.org/job/HBase-0.92-security/ws/trunk/target/surefire/surefire8452549688459349420tmp>
<https://builds.apache.org/job/HBase-0.92-security/ws/trunk/target/surefire/surefire7226616039358562157tmp>
Running org.apache.hadoop.hbase.rest.TestVersionResource
Tests run: 7, Failures: 0, Errors: 0, Skipped: 0, Time elapsed: 19.613 sec
Forking command line: /bin/sh -c cd <https://builds.apache.org/job/HBase-0.92-security/ws/trunk>
&& /home/jenkins/tools/java/jdk1.6.0_27-32/jre/bin/java -enableassertions -Xmx1400m
-Djava.security.egd=file:/dev/./urandom -jar <https://builds.apache.org/job/HBase-0.92-security/ws/trunk/target/surefire/surefirebooter8708208803781725700.jar>
<https://builds.apache.org/job/HBase-0.92-security/ws/trunk/target/surefire/surefire8758658893749032076tmp>
<https://builds.apache.org/job/HBase-0.92-security/ws/trunk/target/surefire/surefire721654689109953472tmp>
Running org.apache.hadoop.hbase.rest.TestScannerResource
Tests run: 5, Failures: 0, Errors: 0, Skipped: 0, Time elapsed: 34.506 sec
Forking command line: /bin/sh -c cd <https://builds.apache.org/job/HBase-0.92-security/ws/trunk>
&& /home/jenkins/tools/java/jdk1.6.0_27-32/jre/bin/java -enableassertions -Xmx1400m
-Djava.security.egd=file:/dev/./urandom -jar <https://builds.apache.org/job/HBase-0.92-security/ws/trunk/target/surefire/surefirebooter2493250445818014379.jar>
<https://builds.apache.org/job/HBase-0.92-security/ws/trunk/target/surefire/surefire7158124834192638377tmp>
<https://builds.apache.org/job/HBase-0.92-security/ws/trunk/target/surefire/surefire453288027831850155tmp>
Running org.apache.hadoop.hbase.rest.TestTransform
Tests run: 1, Failures: 0, Errors: 0, Skipped: 0, Time elapsed: 21.108 sec
Forking command line: /bin/sh -c cd <https://builds.apache.org/job/HBase-0.92-security/ws/trunk>
&& /home/jenkins/tools/java/jdk1.6.0_27-32/jre/bin/java -enableassertions -Xmx1400m
-Djava.security.egd=file:/dev/./urandom -jar <https://builds.apache.org/job/HBase-0.92-security/ws/trunk/target/surefire/surefirebooter6774344880833134547.jar>
<https://builds.apache.org/job/HBase-0.92-security/ws/trunk/target/surefire/surefire1833647841338264091tmp>
<https://builds.apache.org/job/HBase-0.92-security/ws/trunk/target/surefire/surefire4976817650937926821tmp>
Running org.apache.hadoop.hbase.rest.TestTableResource
Tests run: 8, Failures: 0, Errors: 0, Skipped: 0, Time elapsed: 30.155 sec
Forking command line: /bin/sh -c cd <https://builds.apache.org/job/HBase-0.92-security/ws/trunk>
&& /home/jenkins/tools/java/jdk1.6.0_27-32/jre/bin/java -enableassertions -Xmx1400m
-Djava.security.egd=file:/dev/./urandom -jar <https://builds.apache.org/job/HBase-0.92-security/ws/trunk/target/surefire/surefirebooter2181957885180506854.jar>
<https://builds.apache.org/job/HBase-0.92-security/ws/trunk/target/surefire/surefire2411585256392940886tmp>
<https://builds.apache.org/job/HBase-0.92-security/ws/trunk/target/surefire/surefire1610718870026172576tmp>
Running org.apache.hadoop.hbase.rest.TestStatusResource
Tests run: 2, Failures: 0, Errors: 0, Skipped: 0, Time elapsed: 20.027 sec
Forking command line: /bin/sh -c cd <https://builds.apache.org/job/HBase-0.92-security/ws/trunk>
&& /home/jenkins/tools/java/jdk1.6.0_27-32/jre/bin/java -enableassertions -Xmx1400m
-Djava.security.egd=file:/dev/./urandom -jar <https://builds.apache.org/job/HBase-0.92-security/ws/trunk/target/surefire/surefirebooter8373538586619324842.jar>
<https://builds.apache.org/job/HBase-0.92-security/ws/trunk/target/surefire/surefire4454233512607862770tmp>
<https://builds.apache.org/job/HBase-0.92-security/ws/trunk/target/surefire/surefire2950362627376046392tmp>
Running org.apache.hadoop.hbase.rest.TestSchemaResource
Tests run: 2, Failures: 0, Errors: 0, Skipped: 0, Time elapsed: 27.05 sec
Forking command line: /bin/sh -c cd <https://builds.apache.org/job/HBase-0.92-security/ws/trunk>
&& /home/jenkins/tools/java/jdk1.6.0_27-32/jre/bin/java -enableassertions -Xmx1400m
-Djava.security.egd=file:/dev/./urandom -jar <https://builds.apache.org/job/HBase-0.92-security/ws/trunk/target/surefire/surefirebooter4731390235377773631.jar>
<https://builds.apache.org/job/HBase-0.92-security/ws/trunk/target/surefire/surefire4423975482831908950tmp>
<https://builds.apache.org/job/HBase-0.92-security/ws/trunk/target/surefire/surefire5062251795864834990tmp>
Running org.apache.hadoop.hbase.thrift.TestThriftServer
Tests run: 1, Failures: 0, Errors: 0, Skipped: 0, Time elapsed: 26.916 sec
Forking command line: /bin/sh -c cd <https://builds.apache.org/job/HBase-0.92-security/ws/trunk>
&& /home/jenkins/tools/java/jdk1.6.0_27-32/jre/bin/java -enableassertions -Xmx1400m
-Djava.security.egd=file:/dev/./urandom -jar <https://builds.apache.org/job/HBase-0.92-security/ws/trunk/target/surefire/surefirebooter6176986170429344616.jar>
<https://builds.apache.org/job/HBase-0.92-security/ws/trunk/target/surefire/surefire3591692337167616162tmp>
<https://builds.apache.org/job/HBase-0.92-security/ws/trunk/target/surefire/surefire283398003768553348tmp>
Running org.apache.hadoop.hbase.io.TestHeapSize
Tests run: 2, Failures: 0, Errors: 0, Skipped: 0, Time elapsed: 0.156 sec
Forking command line: /bin/sh -c cd <https://builds.apache.org/job/HBase-0.92-security/ws/trunk>
&& /home/jenkins/tools/java/jdk1.6.0_27-32/jre/bin/java -enableassertions -Xmx1400m
-Djava.security.egd=file:/dev/./urandom -jar <https://builds.apache.org/job/HBase-0.92-security/ws/trunk/target/surefire/surefirebooter676433822145722574.jar>
<https://builds.apache.org/job/HBase-0.92-security/ws/trunk/target/surefire/surefire4181377428582764656tmp>
<https://builds.apache.org/job/HBase-0.92-security/ws/trunk/target/surefire/surefire4497488703353954791tmp>
Running org.apache.hadoop.hbase.io.hfile.TestHFileSeek
Tests run: 1, Failures: 0, Errors: 0, Skipped: 0, Time elapsed: 5.612 sec
Forking command line: /bin/sh -c cd <https://builds.apache.org/job/HBase-0.92-security/ws/trunk>
&& /home/jenkins/tools/java/jdk1.6.0_27-32/jre/bin/java -enableassertions -Xmx1400m
-Djava.security.egd=file:/dev/./urandom -jar <https://builds.apache.org/job/HBase-0.92-security/ws/trunk/target/surefire/surefirebooter3015763287490978656.jar>
<https://builds.apache.org/job/HBase-0.92-security/ws/trunk/target/surefire/surefire5549205813597798820tmp>
<https://builds.apache.org/job/HBase-0.92-security/ws/trunk/target/surefire/surefire5361434268244467100tmp>
Running org.apache.hadoop.hbase.io.hfile.slab.TestSlab
Tests run: 1, Failures: 0, Errors: 0, Skipped: 0, Time elapsed: 0.145 sec
Forking command line: /bin/sh -c cd <https://builds.apache.org/job/HBase-0.92-security/ws/trunk>
&& /home/jenkins/tools/java/jdk1.6.0_27-32/jre/bin/java -enableassertions -Xmx1400m
-Djava.security.egd=file:/dev/./urandom -jar <https://builds.apache.org/job/HBase-0.92-security/ws/trunk/target/surefire/surefirebooter4693476652675285817.jar>
<https://builds.apache.org/job/HBase-0.92-security/ws/trunk/target/surefire/surefire4490357885958603629tmp>
<https://builds.apache.org/job/HBase-0.92-security/ws/trunk/target/surefire/surefire7903381663479507934tmp>
Running org.apache.hadoop.hbase.io.hfile.slab.TestSlabCache
Tests run: 7, Failures: 0, Errors: 0, Skipped: 0, Time elapsed: 19.272 sec
Forking command line: /bin/sh -c cd <https://builds.apache.org/job/HBase-0.92-security/ws/trunk>
&& /home/jenkins/tools/java/jdk1.6.0_27-32/jre/bin/java -enableassertions -Xmx1400m
-Djava.security.egd=file:/dev/./urandom -jar <https://builds.apache.org/job/HBase-0.92-security/ws/trunk/target/surefire/surefirebooter5383420266261168287.jar>
<https://builds.apache.org/job/HBase-0.92-security/ws/trunk/target/surefire/surefire2276717299325535761tmp>
<https://builds.apache.org/job/HBase-0.92-security/ws/trunk/target/surefire/surefire567089842125029220tmp>
Running org.apache.hadoop.hbase.io.hfile.slab.TestSingleSizeCache
Tests run: 5, Failures: 0, Errors: 0, Skipped: 0, Time elapsed: 24.284 sec
Forking command line: /bin/sh -c cd <https://builds.apache.org/job/HBase-0.92-security/ws/trunk>
&& /home/jenkins/tools/java/jdk1.6.0_27-32/jre/bin/java -enableassertions -Xmx1400m
-Djava.security.egd=file:/dev/./urandom -jar <https://builds.apache.org/job/HBase-0.92-security/ws/trunk/target/surefire/surefirebooter4742416448609636827.jar>
<https://builds.apache.org/job/HBase-0.92-security/ws/trunk/target/surefire/surefire5921308197106922931tmp>
<https://builds.apache.org/job/HBase-0.92-security/ws/trunk/target/surefire/surefire8738312316785650869tmp>
Running org.apache.hadoop.hbase.io.hfile.TestCachedBlockQueue
Tests run: 2, Failures: 0, Errors: 0, Skipped: 0, Time elapsed: 0.104 sec
Forking command line: /bin/sh -c cd <https://builds.apache.org/job/HBase-0.92-security/ws/trunk>
&& /home/jenkins/tools/java/jdk1.6.0_27-32/jre/bin/java -enableassertions -Xmx1400m
-Djava.security.egd=file:/dev/./urandom -jar <https://builds.apache.org/job/HBase-0.92-security/ws/trunk/target/surefire/surefirebooter5954868842136608091.jar>
<https://builds.apache.org/job/HBase-0.92-security/ws/trunk/target/surefire/surefire3832558975488240586tmp>
<https://builds.apache.org/job/HBase-0.92-security/ws/trunk/target/surefire/surefire2499904395935097414tmp>
Running org.apache.hadoop.hbase.io.hfile.TestHFileBlockIndex
Tests run: 10, Failures: 0, Errors: 0, Skipped: 0, Time elapsed: 10.034 sec
Forking command line: /bin/sh -c cd <https://builds.apache.org/job/HBase-0.92-security/ws/trunk>
&& /home/jenkins/tools/java/jdk1.6.0_27-32/jre/bin/java -enableassertions -Xmx1400m
-Djava.security.egd=file:/dev/./urandom -jar <https://builds.apache.org/job/HBase-0.92-security/ws/trunk/target/surefire/surefirebooter1698988450042588058.jar>
<https://builds.apache.org/job/HBase-0.92-security/ws/trunk/target/surefire/surefire5246328924015072785tmp>
<https://builds.apache.org/job/HBase-0.92-security/ws/trunk/target/surefire/surefire5417114805507501202tmp>
Running org.apache.hadoop.hbase.io.hfile.TestLruBlockCache
Tests run: 7, Failures: 0, Errors: 0, Skipped: 0, Time elapsed: 0.343 sec
Forking command line: /bin/sh -c cd <https://builds.apache.org/job/HBase-0.92-security/ws/trunk>
&& /home/jenkins/tools/java/jdk1.6.0_27-32/jre/bin/java -enableassertions -Xmx1400m
-Djava.security.egd=file:/dev/./urandom -jar <https://builds.apache.org/job/HBase-0.92-security/ws/trunk/target/surefire/surefirebooter1210247185283477707.jar>
<https://builds.apache.org/job/HBase-0.92-security/ws/trunk/target/surefire/surefire3911040748681099607tmp>
<https://builds.apache.org/job/HBase-0.92-security/ws/trunk/target/surefire/surefire6847118267221700850tmp>
Running org.apache.hadoop.hbase.io.hfile.TestHFilePerformance
Tests run: 1, Failures: 0, Errors: 0, Skipped: 0, Time elapsed: 5.941 sec
Forking command line: /bin/sh -c cd <https://builds.apache.org/job/HBase-0.92-security/ws/trunk>
&& /home/jenkins/tools/java/jdk1.6.0_27-32/jre/bin/java -enableassertions -Xmx1400m
-Djava.security.egd=file:/dev/./urandom -jar <https://builds.apache.org/job/HBase-0.92-security/ws/trunk/target/surefire/surefirebooter5290123043168758718.jar>
<https://builds.apache.org/job/HBase-0.92-security/ws/trunk/target/surefire/surefire7758842167632068885tmp>
<https://builds.apache.org/job/HBase-0.92-security/ws/trunk/target/surefire/surefire8558297952828407683tmp>
Running org.apache.hadoop.hbase.io.hfile.TestFixedFileTrailer
Tests run: 2, Failures: 0, Errors: 0, Skipped: 0, Time elapsed: 0.681 sec
Forking command line: /bin/sh -c cd <https://builds.apache.org/job/HBase-0.92-security/ws/trunk>
&& /home/jenkins/tools/java/jdk1.6.0_27-32/jre/bin/java -enableassertions -Xmx1400m
-Djava.security.egd=file:/dev/./urandom -jar <https://builds.apache.org/job/HBase-0.92-security/ws/trunk/target/surefire/surefirebooter222269929546059998.jar>
<https://builds.apache.org/job/HBase-0.92-security/ws/trunk/target/surefire/surefire627790935773424347tmp>
<https://builds.apache.org/job/HBase-0.92-security/ws/trunk/target/surefire/surefire638828939120327733tmp>
Running org.apache.hadoop.hbase.io.hfile.TestHFileWriterV2
Tests run: 1, Failures: 0, Errors: 0, Skipped: 0, Time elapsed: 1.123 sec
Forking command line: /bin/sh -c cd <https://builds.apache.org/job/HBase-0.92-security/ws/trunk>
&& /home/jenkins/tools/java/jdk1.6.0_27-32/jre/bin/java -enableassertions -Xmx1400m
-Djava.security.egd=file:/dev/./urandom -jar <https://builds.apache.org/job/HBase-0.92-security/ws/trunk/target/surefire/surefirebooter454397570413894836.jar>
<https://builds.apache.org/job/HBase-0.92-security/ws/trunk/target/surefire/surefire20263262971806943tmp>
<https://builds.apache.org/job/HBase-0.92-security/ws/trunk/target/surefire/surefire6288678493798146338tmp>
Running org.apache.hadoop.hbase.io.hfile.TestBlockCacheColumnFamilySummary
Tests run: 4, Failures: 0, Errors: 0, Skipped: 0, Time elapsed: 0.057 sec
Forking command line: /bin/sh -c cd <https://builds.apache.org/job/HBase-0.92-security/ws/trunk>
&& /home/jenkins/tools/java/jdk1.6.0_27-32/jre/bin/java -enableassertions -Xmx1400m
-Djava.security.egd=file:/dev/./urandom -jar <https://builds.apache.org/job/HBase-0.92-security/ws/trunk/target/surefire/surefirebooter2491246910885680225.jar>
<https://builds.apache.org/job/HBase-0.92-security/ws/trunk/target/surefire/surefire8704587975527950054tmp>
<https://builds.apache.org/job/HBase-0.92-security/ws/trunk/target/surefire/surefire2015874053749239558tmp>
Running org.apache.hadoop.hbase.io.hfile.TestHFileReaderV1
Tests run: 1, Failures: 0, Errors: 0, Skipped: 0, Time elapsed: 0.573 sec
Forking command line: /bin/sh -c cd <https://builds.apache.org/job/HBase-0.92-security/ws/trunk>
&& /home/jenkins/tools/java/jdk1.6.0_27-32/jre/bin/java -enableassertions -Xmx1400m
-Djava.security.egd=file:/dev/./urandom -jar <https://builds.apache.org/job/HBase-0.92-security/ws/trunk/target/surefire/surefirebooter2905107174811321115.jar>
<https://builds.apache.org/job/HBase-0.92-security/ws/trunk/target/surefire/surefire7523203670637706825tmp>
<https://builds.apache.org/job/HBase-0.92-security/ws/trunk/target/surefire/surefire2301210127232315131tmp>
Running org.apache.hadoop.hbase.io.hfile.TestHFile
Tests run: 6, Failures: 0, Errors: 0, Skipped: 0, Time elapsed: 0.847 sec
Forking command line: /bin/sh -c cd <https://builds.apache.org/job/HBase-0.92-security/ws/trunk>
&& /home/jenkins/tools/java/jdk1.6.0_27-32/jre/bin/java -enableassertions -Xmx1400m
-Djava.security.egd=file:/dev/./urandom -jar <https://builds.apache.org/job/HBase-0.92-security/ws/trunk/target/surefire/surefirebooter6727300486143724881.jar>
<https://builds.apache.org/job/HBase-0.92-security/ws/trunk/target/surefire/surefire6012472920059616147tmp>
<https://builds.apache.org/job/HBase-0.92-security/ws/trunk/target/surefire/surefire247756555296966733tmp>
Running org.apache.hadoop.hbase.io.hfile.TestReseekTo
Tests run: 1, Failures: 0, Errors: 0, Skipped: 0, Time elapsed: 0.769 sec
Forking command line: /bin/sh -c cd <https://builds.apache.org/job/HBase-0.92-security/ws/trunk>
&& /home/jenkins/tools/java/jdk1.6.0_27-32/jre/bin/java -enableassertions -Xmx1400m
-Djava.security.egd=file:/dev/./urandom -jar <https://builds.apache.org/job/HBase-0.92-security/ws/trunk/target/surefire/surefirebooter5737458152639778379.jar>
<https://builds.apache.org/job/HBase-0.92-security/ws/trunk/target/surefire/surefire3928332895438973539tmp>
<https://builds.apache.org/job/HBase-0.92-security/ws/trunk/target/surefire/surefire7024087298043499903tmp>
Running org.apache.hadoop.hbase.io.hfile.TestHFileBlock
Tests run: 7, Failures: 0, Errors: 0, Skipped: 0, Time elapsed: 25.358 sec
Forking command line: /bin/sh -c cd <https://builds.apache.org/job/HBase-0.92-security/ws/trunk>
&& /home/jenkins/tools/java/jdk1.6.0_27-32/jre/bin/java -enableassertions -Xmx1400m
-Djava.security.egd=file:/dev/./urandom -jar <https://builds.apache.org/job/HBase-0.92-security/ws/trunk/target/surefire/surefirebooter8412204832428127623.jar>
<https://builds.apache.org/job/HBase-0.92-security/ws/trunk/target/surefire/surefire2669915518051978431tmp>
<https://builds.apache.org/job/HBase-0.92-security/ws/trunk/target/surefire/surefire401828245539484332tmp>
Running org.apache.hadoop.hbase.io.hfile.TestSeekTo
Tests run: 3, Failures: 0, Errors: 0, Skipped: 0, Time elapsed: 0.653 sec
Forking command line: /bin/sh -c cd <https://builds.apache.org/job/HBase-0.92-security/ws/trunk>
&& /home/jenkins/tools/java/jdk1.6.0_27-32/jre/bin/java -enableassertions -Xmx1400m
-Djava.security.egd=file:/dev/./urandom -jar <https://builds.apache.org/job/HBase-0.92-security/ws/trunk/target/surefire/surefirebooter5236490684010203607.jar>
<https://builds.apache.org/job/HBase-0.92-security/ws/trunk/target/surefire/surefire5656302001567672325tmp>
<https://builds.apache.org/job/HBase-0.92-security/ws/trunk/target/surefire/surefire721754313091833947tmp>
Running org.apache.hadoop.hbase.io.hfile.TestCacheOnWrite
Tests run: 6, Failures: 0, Errors: 0, Skipped: 0, Time elapsed: 7.485 sec
Forking command line: /bin/sh -c cd <https://builds.apache.org/job/HBase-0.92-security/ws/trunk>
&& /home/jenkins/tools/java/jdk1.6.0_27-32/jre/bin/java -enableassertions -Xmx1400m
-Djava.security.egd=file:/dev/./urandom -jar <https://builds.apache.org/job/HBase-0.92-security/ws/trunk/target/surefire/surefirebooter3172789677012378570.jar>
<https://builds.apache.org/job/HBase-0.92-security/ws/trunk/target/surefire/surefire4286347182005600271tmp>
<https://builds.apache.org/job/HBase-0.92-security/ws/trunk/target/surefire/surefire8938854861421017372tmp>
Running org.apache.hadoop.hbase.io.TestHbaseObjectWritable
Tests run: 4, Failures: 0, Errors: 0, Skipped: 0, Time elapsed: 0.461 sec
Forking command line: /bin/sh -c cd <https://builds.apache.org/job/HBase-0.92-security/ws/trunk>
&& /home/jenkins/tools/java/jdk1.6.0_27-32/jre/bin/java -enableassertions -Xmx1400m
-Djava.security.egd=file:/dev/./urandom -jar <https://builds.apache.org/job/HBase-0.92-security/ws/trunk/target/surefire/surefirebooter2771387668654459184.jar>
<https://builds.apache.org/job/HBase-0.92-security/ws/trunk/target/surefire/surefire2000546455414727338tmp>
<https://builds.apache.org/job/HBase-0.92-security/ws/trunk/target/surefire/surefire9073466553778585406tmp>
Running org.apache.hadoop.hbase.io.TestImmutableBytesWritable
Tests run: 3, Failures: 0, Errors: 0, Skipped: 0, Time elapsed: 0.11 sec
Forking command line: /bin/sh -c cd <https://builds.apache.org/job/HBase-0.92-security/ws/trunk>
&& /home/jenkins/tools/java/jdk1.6.0_27-32/jre/bin/java -enableassertions -Xmx1400m
-Djava.security.egd=file:/dev/./urandom -jar <https://builds.apache.org/job/HBase-0.92-security/ws/trunk/target/surefire/surefirebooter6110629238686982465.jar>
<https://builds.apache.org/job/HBase-0.92-security/ws/trunk/target/surefire/surefire8062292166471607961tmp>
<https://builds.apache.org/job/HBase-0.92-security/ws/trunk/target/surefire/surefire7719193134860913983tmp>
Running org.apache.hadoop.hbase.io.TestHalfStoreFileReader
Tests run: 1, Failures: 0, Errors: 0, Skipped: 0, Time elapsed: 0.801 sec
Forking command line: /bin/sh -c cd <https://builds.apache.org/job/HBase-0.92-security/ws/trunk>
&& /home/jenkins/tools/java/jdk1.6.0_27-32/jre/bin/java -enableassertions -Xmx1400m
-Djava.security.egd=file:/dev/./urandom -jar <https://builds.apache.org/job/HBase-0.92-security/ws/trunk/target/surefire/surefirebooter2742094057666740617.jar>
<https://builds.apache.org/job/HBase-0.92-security/ws/trunk/target/surefire/surefire6145401988656729518tmp>
<https://builds.apache.org/job/HBase-0.92-security/ws/trunk/target/surefire/surefire2604673001765626852tmp>
Running org.apache.hadoop.hbase.migration.TestMigrationFrom090To092
Tests run: 1, Failures: 0, Errors: 0, Skipped: 0, Time elapsed: 0.27 sec
Forking command line: /bin/sh -c cd <https://builds.apache.org/job/HBase-0.92-security/ws/trunk>
&& /home/jenkins/tools/java/jdk1.6.0_27-32/jre/bin/java -enableassertions -Xmx1400m
-Djava.security.egd=file:/dev/./urandom -jar <https://builds.apache.org/job/HBase-0.92-security/ws/trunk/target/surefire/surefirebooter1455031135596239022.jar>
<https://builds.apache.org/job/HBase-0.92-security/ws/trunk/target/surefire/surefire2524619320395709536tmp>
<https://builds.apache.org/job/HBase-0.92-security/ws/trunk/target/surefire/surefire7225631850774327080tmp>
Running org.apache.hadoop.hbase.TestFSTableDescriptorForceCreation
Tests run: 3, Failures: 0, Errors: 0, Skipped: 0, Time elapsed: 0.649 sec
Forking command line: /bin/sh -c cd <https://builds.apache.org/job/HBase-0.92-security/ws/trunk>
&& /home/jenkins/tools/java/jdk1.6.0_27-32/jre/bin/java -enableassertions -Xmx1400m
-Djava.security.egd=file:/dev/./urandom -jar <https://builds.apache.org/job/HBase-0.92-security/ws/trunk/target/surefire/surefirebooter450112925718187970.jar>
<https://builds.apache.org/job/HBase-0.92-security/ws/trunk/target/surefire/surefire868660309074231298tmp>
<https://builds.apache.org/job/HBase-0.92-security/ws/trunk/target/surefire/surefire1585949276166540906tmp>
Running org.apache.hadoop.hbase.avro.TestAvroUtil
Tests run: 1, Failures: 0, Errors: 0, Skipped: 0, Time elapsed: 0.63 sec
Forking command line: /bin/sh -c cd <https://builds.apache.org/job/HBase-0.92-security/ws/trunk>
&& /home/jenkins/tools/java/jdk1.6.0_27-32/jre/bin/java -enableassertions -Xmx1400m
-Djava.security.egd=file:/dev/./urandom -jar <https://builds.apache.org/job/HBase-0.92-security/ws/trunk/target/surefire/surefirebooter2683755059760744932.jar>
<https://builds.apache.org/job/HBase-0.92-security/ws/trunk/target/surefire/surefire5608903545580060929tmp>
<https://builds.apache.org/job/HBase-0.92-security/ws/trunk/target/surefire/surefire4464900204188915473tmp>
Running org.apache.hadoop.hbase.avro.TestAvroServer
Tests run: 3, Failures: 0, Errors: 0, Skipped: 0, Time elapsed: 35.071 sec
Forking command line: /bin/sh -c cd <https://builds.apache.org/job/HBase-0.92-security/ws/trunk>
&& /home/jenkins/tools/java/jdk1.6.0_27-32/jre/bin/java -enableassertions -Xmx1400m
-Djava.security.egd=file:/dev/./urandom -jar <https://builds.apache.org/job/HBase-0.92-security/ws/trunk/target/surefire/surefirebooter2004908718903335062.jar>
<https://builds.apache.org/job/HBase-0.92-security/ws/trunk/target/surefire/surefire2033968589688813305tmp>
<https://builds.apache.org/job/HBase-0.92-security/ws/trunk/target/surefire/surefire7898607074769275944tmp>
Running org.apache.hadoop.hbase.TestKeyValue
Tests run: 11, Failures: 0, Errors: 0, Skipped: 0, Time elapsed: 0.129 sec
Forking command line: /bin/sh -c cd <https://builds.apache.org/job/HBase-0.92-security/ws/trunk>
&& /home/jenkins/tools/java/jdk1.6.0_27-32/jre/bin/java -enableassertions -Xmx1400m
-Djava.security.egd=file:/dev/./urandom -jar <https://builds.apache.org/job/HBase-0.92-security/ws/trunk/target/surefire/surefirebooter7589085900474422827.jar>
<https://builds.apache.org/job/HBase-0.92-security/ws/trunk/target/surefire/surefire6929880508426114329tmp>
<https://builds.apache.org/job/HBase-0.92-security/ws/trunk/target/surefire/surefire3085605106302704213tmp>
Running org.apache.hadoop.hbase.replication.TestMultiSlaveReplication
Tests run: 1, Failures: 0, Errors: 0, Skipped: 0, Time elapsed: 65.043 sec
Forking command line: /bin/sh -c cd <https://builds.apache.org/job/HBase-0.92-security/ws/trunk>
&& /home/jenkins/tools/java/jdk1.6.0_27-32/jre/bin/java -enableassertions -Xmx1400m
-Djava.security.egd=file:/dev/./urandom -jar <https://builds.apache.org/job/HBase-0.92-security/ws/trunk/target/surefire/surefirebooter6634880134010784595.jar>
<https://builds.apache.org/job/HBase-0.92-security/ws/trunk/target/surefire/surefire7146088745685823483tmp>
<https://builds.apache.org/job/HBase-0.92-security/ws/trunk/target/surefire/surefire1831738643443194534tmp>
Running org.apache.hadoop.hbase.replication.regionserver.TestReplicationSourceManager
Tests run: 1, Failures: 0, Errors: 0, Skipped: 0, Time elapsed: 1.031 sec
Forking command line: /bin/sh -c cd <https://builds.apache.org/job/HBase-0.92-security/ws/trunk>
&& /home/jenkins/tools/java/jdk1.6.0_27-32/jre/bin/java -enableassertions -Xmx1400m
-Djava.security.egd=file:/dev/./urandom -jar <https://builds.apache.org/job/HBase-0.92-security/ws/trunk/target/surefire/surefirebooter48884308523255072.jar>
<https://builds.apache.org/job/HBase-0.92-security/ws/trunk/target/surefire/surefire8008212890973858322tmp>
<https://builds.apache.org/job/HBase-0.92-security/ws/trunk/target/surefire/surefire1465439288781852055tmp>
Running org.apache.hadoop.hbase.replication.regionserver.TestReplicationSink
Tests run: 5, Failures: 0, Errors: 0, Skipped: 0, Time elapsed: 22.408 sec
Forking command line: /bin/sh -c cd <https://builds.apache.org/job/HBase-0.92-security/ws/trunk>
&& /home/jenkins/tools/java/jdk1.6.0_27-32/jre/bin/java -enableassertions -Xmx1400m
-Djava.security.egd=file:/dev/./urandom -jar <https://builds.apache.org/job/HBase-0.92-security/ws/trunk/target/surefire/surefirebooter4941749883046438476.jar>
<https://builds.apache.org/job/HBase-0.92-security/ws/trunk/target/surefire/surefire450954302090174715tmp>
<https://builds.apache.org/job/HBase-0.92-security/ws/trunk/target/surefire/surefire8733730100707667201tmp>
Running org.apache.hadoop.hbase.replication.TestMasterReplication
Tests run: 2, Failures: 0, Errors: 0, Skipped: 0, Time elapsed: 101.263 sec
Forking command line: /bin/sh -c cd <https://builds.apache.org/job/HBase-0.92-security/ws/trunk>
&& /home/jenkins/tools/java/jdk1.6.0_27-32/jre/bin/java -enableassertions -Xmx1400m
-Djava.security.egd=file:/dev/./urandom -jar <https://builds.apache.org/job/HBase-0.92-security/ws/trunk/target/surefire/surefirebooter7249546284904994761.jar>
<https://builds.apache.org/job/HBase-0.92-security/ws/trunk/target/surefire/surefire1483805625660363304tmp>
<https://builds.apache.org/job/HBase-0.92-security/ws/trunk/target/surefire/surefire1912646263283646614tmp>
Running org.apache.hadoop.hbase.replication.TestReplicationSource
Tests run: 1, Failures: 0, Errors: 0, Skipped: 0, Time elapsed: 2.774 sec
Forking command line: /bin/sh -c cd <https://builds.apache.org/job/HBase-0.92-security/ws/trunk>
&& /home/jenkins/tools/java/jdk1.6.0_27-32/jre/bin/java -enableassertions -Xmx1400m
-Djava.security.egd=file:/dev/./urandom -jar <https://builds.apache.org/job/HBase-0.92-security/ws/trunk/target/surefire/surefirebooter3618894174325042499.jar>
<https://builds.apache.org/job/HBase-0.92-security/ws/trunk/target/surefire/surefire56484827215224840tmp>
<https://builds.apache.org/job/HBase-0.92-security/ws/trunk/target/surefire/surefire6479207865049943798tmp>
Running org.apache.hadoop.hbase.replication.TestReplicationPeer
Tests run: 1, Failures: 0, Errors: 0, Skipped: 0, Time elapsed: 25.659 sec
Forking command line: /bin/sh -c cd <https://builds.apache.org/job/HBase-0.92-security/ws/trunk>
&& /home/jenkins/tools/java/jdk1.6.0_27-32/jre/bin/java -enableassertions -Xmx1400m
-Djava.security.egd=file:/dev/./urandom -jar <https://builds.apache.org/job/HBase-0.92-security/ws/trunk/target/surefire/surefirebooter1269248177875925631.jar>
<https://builds.apache.org/job/HBase-0.92-security/ws/trunk/target/surefire/surefire4510641600799720044tmp>
<https://builds.apache.org/job/HBase-0.92-security/ws/trunk/target/surefire/surefire9000905632000467970tmp>
Running org.apache.hadoop.hbase.replication.TestReplication
Tests run: 7, Failures: 0, Errors: 0, Skipped: 0, Time elapsed: 132.511 sec
Forking command line: /bin/sh -c cd <https://builds.apache.org/job/HBase-0.92-security/ws/trunk>
&& /home/jenkins/tools/java/jdk1.6.0_27-32/jre/bin/java -enableassertions -Xmx1400m
-Djava.security.egd=file:/dev/./urandom -jar <https://builds.apache.org/job/HBase-0.92-security/ws/trunk/target/surefire/surefirebooter7557331840474832965.jar>
<https://builds.apache.org/job/HBase-0.92-security/ws/trunk/target/surefire/surefire1574267831274501276tmp>
<https://builds.apache.org/job/HBase-0.92-security/ws/trunk/target/surefire/surefire7883247512654816252tmp>
Running org.apache.hadoop.hbase.ipc.TestDelayedRpc
Tests run: 4, Failures: 0, Errors: 0, Skipped: 0, Time elapsed: 2.297 sec
Forking command line: /bin/sh -c cd <https://builds.apache.org/job/HBase-0.92-security/ws/trunk>
&& /home/jenkins/tools/java/jdk1.6.0_27-32/jre/bin/java -enableassertions -Xmx1400m
-Djava.security.egd=file:/dev/./urandom -jar <https://builds.apache.org/job/HBase-0.92-security/ws/trunk/target/surefire/surefirebooter4939381739324523745.jar>
<https://builds.apache.org/job/HBase-0.92-security/ws/trunk/target/surefire/surefire2276028240054804462tmp>
<https://builds.apache.org/job/HBase-0.92-security/ws/trunk/target/surefire/surefire5354158756275169034tmp>
Running org.apache.hadoop.hbase.TestCompare
Tests run: 1, Failures: 0, Errors: 0, Skipped: 0, Time elapsed: 0.233 sec
Forking command line: /bin/sh -c cd <https://builds.apache.org/job/HBase-0.92-security/ws/trunk>
&& /home/jenkins/tools/java/jdk1.6.0_27-32/jre/bin/java -enableassertions -Xmx1400m
-Djava.security.egd=file:/dev/./urandom -jar <https://builds.apache.org/job/HBase-0.92-security/ws/trunk/target/surefire/surefirebooter5129594693215635938.jar>
<https://builds.apache.org/job/HBase-0.92-security/ws/trunk/target/surefire/surefire306613194563055202tmp>
<https://builds.apache.org/job/HBase-0.92-security/ws/trunk/target/surefire/surefire2877205052335399668tmp>
Running org.apache.hadoop.hbase.TestZooKeeper
Tests run: 7, Failures: 0, Errors: 0, Skipped: 0, Time elapsed: 87.341 sec
Forking command line: /bin/sh -c cd <https://builds.apache.org/job/HBase-0.92-security/ws/trunk>
&& /home/jenkins/tools/java/jdk1.6.0_27-32/jre/bin/java -enableassertions -Xmx1400m
-Djava.security.egd=file:/dev/./urandom -jar <https://builds.apache.org/job/HBase-0.92-security/ws/trunk/target/surefire/surefirebooter7671933331011818423.jar>
<https://builds.apache.org/job/HBase-0.92-security/ws/trunk/target/surefire/surefire2368124659131308788tmp>
<https://builds.apache.org/job/HBase-0.92-security/ws/trunk/target/surefire/surefire2528746621457708712tmp>
Running org.apache.hadoop.hbase.TestHBaseTestingUtility
Tests run: 7, Failures: 0, Errors: 0, Skipped: 0, Time elapsed: 106.852 sec

Results :

Failed tests:   testWorkerAbort(org.apache.hadoop.hbase.master.TestDistributedLogSplitting):
expected:<1> but was:<0>

Tests run: 1097, Failures: 1, Errors: 0, Skipped: 8

[INFO] ------------------------------------------------------------------------
[INFO] BUILD FAILURE
[INFO] ------------------------------------------------------------------------
[INFO] Total time: 1:56:34.407s
[INFO] Finished at: Tue Nov 29 05:05:59 UTC 2011
[INFO] Final Memory: 42M/553M
[INFO] ------------------------------------------------------------------------
[ERROR] Failed to execute goal org.apache.maven.plugins:maven-surefire-plugin:2.10:test (default-test)
on project hbase: There are test failures.
[ERROR] 
[ERROR] Please refer to <https://builds.apache.org/job/HBase-0.92-security/ws/trunk/target/surefire-reports>
for the individual test results.
[ERROR] -> [Help 1]
org.apache.maven.lifecycle.LifecycleExecutionException: Failed to execute goal org.apache.maven.plugins:maven-surefire-plugin:2.10:test
(default-test) on project hbase: There are test failures.

Please refer to <https://builds.apache.org/job/HBase-0.92-security/ws/trunk/target/surefire-reports>
for the individual test results.
	at org.apache.maven.lifecycle.internal.MojoExecutor.execute(MojoExecutor.java:213)
	at org.apache.maven.lifecycle.internal.MojoExecutor.execute(MojoExecutor.java:153)
	at org.apache.maven.lifecycle.internal.MojoExecutor.execute(MojoExecutor.java:145)
	at org.apache.maven.lifecycle.internal.MojoExecutor.executeForkedExecutions(MojoExecutor.java:365)
	at org.apache.maven.lifecycle.internal.MojoExecutor.execute(MojoExecutor.java:199)
	at org.apache.maven.lifecycle.internal.MojoExecutor.execute(MojoExecutor.java:153)
	at org.apache.maven.lifecycle.internal.MojoExecutor.execute(MojoExecutor.java:145)
	at org.apache.maven.lifecycle.internal.LifecycleModuleBuilder.buildProject(LifecycleModuleBuilder.java:84)
	at org.apache.maven.lifecycle.internal.LifecycleModuleBuilder.buildProject(LifecycleModuleBuilder.java:59)
	at org.apache.maven.lifecycle.internal.LifecycleStarter.singleThreadedBuild(LifecycleStarter.java:183)
	at org.apache.maven.lifecycle.internal.LifecycleStarter.execute(LifecycleStarter.java:161)
	at org.apache.maven.DefaultMaven.doExecute(DefaultMaven.java:319)
	at org.apache.maven.DefaultMaven.execute(DefaultMaven.java:156)
	at org.apache.maven.cli.MavenCli.execute(MavenCli.java:537)
	at org.apache.maven.cli.MavenCli.doMain(MavenCli.java:196)
	at org.apache.maven.cli.MavenCli.main(MavenCli.java:141)
	at sun.reflect.NativeMethodAccessorImpl.invoke0(Native Method)
	at sun.reflect.NativeMethodAccessorImpl.invoke(NativeMethodAccessorImpl.java:39)
	at sun.reflect.DelegatingMethodAccessorImpl.invoke(DelegatingMethodAccessorImpl.java:25)
	at java.lang.reflect.Method.invoke(Method.java:597)
	at org.codehaus.plexus.classworlds.launcher.Launcher.launchEnhanced(Launcher.java:290)
	at org.codehaus.plexus.classworlds.launcher.Launcher.launch(Launcher.java:230)
	at org.codehaus.plexus.classworlds.launcher.Launcher.mainWithExitCode(Launcher.java:409)
	at org.codehaus.plexus.classworlds.launcher.Launcher.main(Launcher.java:352)
Caused by: org.apache.maven.plugin.MojoFailureException: There are test failures.

Please refer to <https://builds.apache.org/job/HBase-0.92-security/ws/trunk/target/surefire-reports>
for the individual test results.
	at org.apache.maven.plugin.surefire.SurefireHelper.reportExecution(SurefireHelper.java:87)
	at org.apache.maven.plugin.surefire.SurefirePlugin.writeSummary(SurefirePlugin.java:641)
	at org.apache.maven.plugin.surefire.SurefirePlugin.handleSummary(SurefirePlugin.java:615)
	at org.apache.maven.plugin.surefire.AbstractSurefireMojo.executeAfterPreconditionsChecked(AbstractSurefireMojo.java:137)
	at org.apache.maven.plugin.surefire.AbstractSurefireMojo.execute(AbstractSurefireMojo.java:98)
	at org.apache.maven.plugin.DefaultBuildPluginManager.executeMojo(DefaultBuildPluginManager.java:101)
	at org.apache.maven.lifecycle.internal.MojoExecutor.execute(MojoExecutor.java:209)
	... 23 more
[ERROR] 
[ERROR] 
[ERROR] For more information about the errors and possible solutions, please read the following
articles:
[ERROR] [Help 1] http://cwiki.apache.org/confluence/display/MAVEN/MojoFailureException
Build step 'Invoke top-level Maven targets' marked build as failure
[locks-and-latches] Releasing all the locks
[locks-and-latches] All the locks released
Archiving artifacts
Recording test results
Updating HBASE-4883


Mime
View raw message