hbase-dev mailing list archives

Site index · List index
Message view « Date » · « Thread »
Top « Date » · « Thread »
From Apache Jenkins Server <jenk...@builds.apache.org>
Subject Build failed in Jenkins: HBase-0.92 #146
Date Sat, 19 Nov 2011 08:00:15 GMT
See <https://builds.apache.org/job/HBase-0.92/146/changes>

Changes:

[stack] HBASE-4436 Remove @deprecated Scan methods in 0.90 from TRUNK and 0.92

------------------------------------------
[...truncated 6560 lines...]
Running org.apache.hadoop.hbase.metrics.TestMetricsMBeanBase
Tests run: 2, Failures: 0, Errors: 0, Skipped: 0, Time elapsed: 1.16 sec
Forking command line: /bin/sh -c cd /x1/jenkins/jenkins-slave/workspace/HBase-0.92/trunk &&
/x1/jenkins/tools/java/jdk1.6.0_27-32/jre/bin/java -enableassertions -Xmx1400m -jar /x1/jenkins/jenkins-slave/workspace/HBase-0.92/trunk/target/surefire/surefirebooter8136490053284274676.jar
/x1/jenkins/jenkins-slave/workspace/HBase-0.92/trunk/target/surefire/surefire5196877436381705931tmp
/x1/jenkins/jenkins-slave/workspace/HBase-0.92/trunk/target/surefire/surefire3901289450061168941tmp
Running org.apache.hadoop.hbase.io.hfile.TestHFileWriterV2
Tests run: 1, Failures: 0, Errors: 0, Skipped: 0, Time elapsed: 0.733 sec
Forking command line: /bin/sh -c cd /x1/jenkins/jenkins-slave/workspace/HBase-0.92/trunk &&
/x1/jenkins/tools/java/jdk1.6.0_27-32/jre/bin/java -enableassertions -Xmx1400m -jar /x1/jenkins/jenkins-slave/workspace/HBase-0.92/trunk/target/surefire/surefirebooter1213156937266236997.jar
/x1/jenkins/jenkins-slave/workspace/HBase-0.92/trunk/target/surefire/surefire1553014391741917017tmp
/x1/jenkins/jenkins-slave/workspace/HBase-0.92/trunk/target/surefire/surefire3526669991600412692tmp
Running org.apache.hadoop.hbase.io.hfile.TestHFile
Tests run: 6, Failures: 0, Errors: 0, Skipped: 0, Time elapsed: 0.868 sec
Forking command line: /bin/sh -c cd /x1/jenkins/jenkins-slave/workspace/HBase-0.92/trunk &&
/x1/jenkins/tools/java/jdk1.6.0_27-32/jre/bin/java -enableassertions -Xmx1400m -jar /x1/jenkins/jenkins-slave/workspace/HBase-0.92/trunk/target/surefire/surefirebooter6725394103732056901.jar
/x1/jenkins/jenkins-slave/workspace/HBase-0.92/trunk/target/surefire/surefire7236765273776353759tmp
/x1/jenkins/jenkins-slave/workspace/HBase-0.92/trunk/target/surefire/surefire8110364611652468523tmp
Running org.apache.hadoop.hbase.io.hfile.TestHFileBlockIndex
Tests run: 10, Failures: 0, Errors: 0, Skipped: 0, Time elapsed: 6.925 sec
Forking command line: /bin/sh -c cd /x1/jenkins/jenkins-slave/workspace/HBase-0.92/trunk &&
/x1/jenkins/tools/java/jdk1.6.0_27-32/jre/bin/java -enableassertions -Xmx1400m -jar /x1/jenkins/jenkins-slave/workspace/HBase-0.92/trunk/target/surefire/surefirebooter3949279485981612068.jar
/x1/jenkins/jenkins-slave/workspace/HBase-0.92/trunk/target/surefire/surefire2440092479717843900tmp
/x1/jenkins/jenkins-slave/workspace/HBase-0.92/trunk/target/surefire/surefire8059343424589818302tmp
Running org.apache.hadoop.hbase.io.hfile.TestHFileSeek
Tests run: 1, Failures: 0, Errors: 0, Skipped: 0, Time elapsed: 4.434 sec
Forking command line: /bin/sh -c cd /x1/jenkins/jenkins-slave/workspace/HBase-0.92/trunk &&
/x1/jenkins/tools/java/jdk1.6.0_27-32/jre/bin/java -enableassertions -Xmx1400m -jar /x1/jenkins/jenkins-slave/workspace/HBase-0.92/trunk/target/surefire/surefirebooter4305298038112036863.jar
/x1/jenkins/jenkins-slave/workspace/HBase-0.92/trunk/target/surefire/surefire8029652044957530981tmp
/x1/jenkins/jenkins-slave/workspace/HBase-0.92/trunk/target/surefire/surefire425428582013929964tmp
Running org.apache.hadoop.hbase.io.hfile.TestLruBlockCache
Tests run: 7, Failures: 0, Errors: 0, Skipped: 0, Time elapsed: 0.366 sec
Forking command line: /bin/sh -c cd /x1/jenkins/jenkins-slave/workspace/HBase-0.92/trunk &&
/x1/jenkins/tools/java/jdk1.6.0_27-32/jre/bin/java -enableassertions -Xmx1400m -jar /x1/jenkins/jenkins-slave/workspace/HBase-0.92/trunk/target/surefire/surefirebooter512551779904591556.jar
/x1/jenkins/jenkins-slave/workspace/HBase-0.92/trunk/target/surefire/surefire7171290274686388708tmp
/x1/jenkins/jenkins-slave/workspace/HBase-0.92/trunk/target/surefire/surefire1871512696841593609tmp
Running org.apache.hadoop.hbase.io.hfile.TestFixedFileTrailer
Tests run: 2, Failures: 0, Errors: 0, Skipped: 0, Time elapsed: 0.478 sec
Forking command line: /bin/sh -c cd /x1/jenkins/jenkins-slave/workspace/HBase-0.92/trunk &&
/x1/jenkins/tools/java/jdk1.6.0_27-32/jre/bin/java -enableassertions -Xmx1400m -jar /x1/jenkins/jenkins-slave/workspace/HBase-0.92/trunk/target/surefire/surefirebooter5435496243522752310.jar
/x1/jenkins/jenkins-slave/workspace/HBase-0.92/trunk/target/surefire/surefire2852688568471096086tmp
/x1/jenkins/jenkins-slave/workspace/HBase-0.92/trunk/target/surefire/surefire8289902567028502327tmp
Running org.apache.hadoop.hbase.io.hfile.TestCachedBlockQueue
Tests run: 2, Failures: 0, Errors: 0, Skipped: 0, Time elapsed: 0.131 sec
Forking command line: /bin/sh -c cd /x1/jenkins/jenkins-slave/workspace/HBase-0.92/trunk &&
/x1/jenkins/tools/java/jdk1.6.0_27-32/jre/bin/java -enableassertions -Xmx1400m -jar /x1/jenkins/jenkins-slave/workspace/HBase-0.92/trunk/target/surefire/surefirebooter2442382986665144193.jar
/x1/jenkins/jenkins-slave/workspace/HBase-0.92/trunk/target/surefire/surefire2426607980657207782tmp
/x1/jenkins/jenkins-slave/workspace/HBase-0.92/trunk/target/surefire/surefire7631389747793379322tmp
Running org.apache.hadoop.hbase.io.hfile.TestHFilePerformance
Tests run: 1, Failures: 0, Errors: 0, Skipped: 0, Time elapsed: 4.055 sec
Forking command line: /bin/sh -c cd /x1/jenkins/jenkins-slave/workspace/HBase-0.92/trunk &&
/x1/jenkins/tools/java/jdk1.6.0_27-32/jre/bin/java -enableassertions -Xmx1400m -jar /x1/jenkins/jenkins-slave/workspace/HBase-0.92/trunk/target/surefire/surefirebooter7554686812795843425.jar
/x1/jenkins/jenkins-slave/workspace/HBase-0.92/trunk/target/surefire/surefire7523549819203883666tmp
/x1/jenkins/jenkins-slave/workspace/HBase-0.92/trunk/target/surefire/surefire3724395331683452822tmp
Running org.apache.hadoop.hbase.io.hfile.TestCacheOnWrite
Tests run: 6, Failures: 0, Errors: 0, Skipped: 0, Time elapsed: 5.363 sec
Forking command line: /bin/sh -c cd /x1/jenkins/jenkins-slave/workspace/HBase-0.92/trunk &&
/x1/jenkins/tools/java/jdk1.6.0_27-32/jre/bin/java -enableassertions -Xmx1400m -jar /x1/jenkins/jenkins-slave/workspace/HBase-0.92/trunk/target/surefire/surefirebooter7167517461697001294.jar
/x1/jenkins/jenkins-slave/workspace/HBase-0.92/trunk/target/surefire/surefire5330545152482150597tmp
/x1/jenkins/jenkins-slave/workspace/HBase-0.92/trunk/target/surefire/surefire6699695584178945953tmp
Running org.apache.hadoop.hbase.io.hfile.TestReseekTo
Tests run: 1, Failures: 0, Errors: 0, Skipped: 0, Time elapsed: 0.664 sec
Forking command line: /bin/sh -c cd /x1/jenkins/jenkins-slave/workspace/HBase-0.92/trunk &&
/x1/jenkins/tools/java/jdk1.6.0_27-32/jre/bin/java -enableassertions -Xmx1400m -jar /x1/jenkins/jenkins-slave/workspace/HBase-0.92/trunk/target/surefire/surefirebooter349126692896529641.jar
/x1/jenkins/jenkins-slave/workspace/HBase-0.92/trunk/target/surefire/surefire4801766582838160772tmp
/x1/jenkins/jenkins-slave/workspace/HBase-0.92/trunk/target/surefire/surefire4196529880848309584tmp
Running org.apache.hadoop.hbase.io.hfile.TestSeekTo
Tests run: 3, Failures: 0, Errors: 0, Skipped: 0, Time elapsed: 0.612 sec
Forking command line: /bin/sh -c cd /x1/jenkins/jenkins-slave/workspace/HBase-0.92/trunk &&
/x1/jenkins/tools/java/jdk1.6.0_27-32/jre/bin/java -enableassertions -Xmx1400m -jar /x1/jenkins/jenkins-slave/workspace/HBase-0.92/trunk/target/surefire/surefirebooter3812282656109640663.jar
/x1/jenkins/jenkins-slave/workspace/HBase-0.92/trunk/target/surefire/surefire1266270719637239238tmp
/x1/jenkins/jenkins-slave/workspace/HBase-0.92/trunk/target/surefire/surefire409518132518728214tmp
Running org.apache.hadoop.hbase.io.hfile.TestBlockCacheColumnFamilySummary
Tests run: 4, Failures: 0, Errors: 0, Skipped: 0, Time elapsed: 0.086 sec
Forking command line: /bin/sh -c cd /x1/jenkins/jenkins-slave/workspace/HBase-0.92/trunk &&
/x1/jenkins/tools/java/jdk1.6.0_27-32/jre/bin/java -enableassertions -Xmx1400m -jar /x1/jenkins/jenkins-slave/workspace/HBase-0.92/trunk/target/surefire/surefirebooter4646452654198283983.jar
/x1/jenkins/jenkins-slave/workspace/HBase-0.92/trunk/target/surefire/surefire1222111223828334355tmp
/x1/jenkins/jenkins-slave/workspace/HBase-0.92/trunk/target/surefire/surefire7055892498740757103tmp
Running org.apache.hadoop.hbase.io.hfile.TestHFileBlock
Tests run: 7, Failures: 0, Errors: 0, Skipped: 0, Time elapsed: 23.991 sec
Forking command line: /bin/sh -c cd /x1/jenkins/jenkins-slave/workspace/HBase-0.92/trunk &&
/x1/jenkins/tools/java/jdk1.6.0_27-32/jre/bin/java -enableassertions -Xmx1400m -jar /x1/jenkins/jenkins-slave/workspace/HBase-0.92/trunk/target/surefire/surefirebooter4649033882426001877.jar
/x1/jenkins/jenkins-slave/workspace/HBase-0.92/trunk/target/surefire/surefire3369006292314219292tmp
/x1/jenkins/jenkins-slave/workspace/HBase-0.92/trunk/target/surefire/surefire6690519103269501844tmp
Running org.apache.hadoop.hbase.io.hfile.slab.TestSlabCache
Tests run: 7, Failures: 0, Errors: 0, Skipped: 0, Time elapsed: 15.4 sec
Forking command line: /bin/sh -c cd /x1/jenkins/jenkins-slave/workspace/HBase-0.92/trunk &&
/x1/jenkins/tools/java/jdk1.6.0_27-32/jre/bin/java -enableassertions -Xmx1400m -jar /x1/jenkins/jenkins-slave/workspace/HBase-0.92/trunk/target/surefire/surefirebooter1168505477373407859.jar
/x1/jenkins/jenkins-slave/workspace/HBase-0.92/trunk/target/surefire/surefire3366453937512331029tmp
/x1/jenkins/jenkins-slave/workspace/HBase-0.92/trunk/target/surefire/surefire7111068027008190984tmp
Running org.apache.hadoop.hbase.io.hfile.slab.TestSingleSizeCache
Tests run: 5, Failures: 0, Errors: 0, Skipped: 0, Time elapsed: 19.628 sec
Forking command line: /bin/sh -c cd /x1/jenkins/jenkins-slave/workspace/HBase-0.92/trunk &&
/x1/jenkins/tools/java/jdk1.6.0_27-32/jre/bin/java -enableassertions -Xmx1400m -jar /x1/jenkins/jenkins-slave/workspace/HBase-0.92/trunk/target/surefire/surefirebooter8950585625965295301.jar
/x1/jenkins/jenkins-slave/workspace/HBase-0.92/trunk/target/surefire/surefire3916279310537000400tmp
/x1/jenkins/jenkins-slave/workspace/HBase-0.92/trunk/target/surefire/surefire3347245656149991465tmp
Running org.apache.hadoop.hbase.io.hfile.slab.TestSlab
Tests run: 1, Failures: 0, Errors: 0, Skipped: 0, Time elapsed: 0.166 sec
Forking command line: /bin/sh -c cd /x1/jenkins/jenkins-slave/workspace/HBase-0.92/trunk &&
/x1/jenkins/tools/java/jdk1.6.0_27-32/jre/bin/java -enableassertions -Xmx1400m -jar /x1/jenkins/jenkins-slave/workspace/HBase-0.92/trunk/target/surefire/surefirebooter6558029275760393232.jar
/x1/jenkins/jenkins-slave/workspace/HBase-0.92/trunk/target/surefire/surefire3816392857316885488tmp
/x1/jenkins/jenkins-slave/workspace/HBase-0.92/trunk/target/surefire/surefire8297385355977016434tmp
Running org.apache.hadoop.hbase.io.hfile.TestHFileReaderV1
Tests run: 1, Failures: 0, Errors: 0, Skipped: 0, Time elapsed: 0.493 sec
Forking command line: /bin/sh -c cd /x1/jenkins/jenkins-slave/workspace/HBase-0.92/trunk &&
/x1/jenkins/tools/java/jdk1.6.0_27-32/jre/bin/java -enableassertions -Xmx1400m -jar /x1/jenkins/jenkins-slave/workspace/HBase-0.92/trunk/target/surefire/surefirebooter6406771501841283644.jar
/x1/jenkins/jenkins-slave/workspace/HBase-0.92/trunk/target/surefire/surefire1951989611636914506tmp
/x1/jenkins/jenkins-slave/workspace/HBase-0.92/trunk/target/surefire/surefire3412492382811479333tmp
Running org.apache.hadoop.hbase.io.TestHalfStoreFileReader
Tests run: 1, Failures: 0, Errors: 0, Skipped: 0, Time elapsed: 0.558 sec
Forking command line: /bin/sh -c cd /x1/jenkins/jenkins-slave/workspace/HBase-0.92/trunk &&
/x1/jenkins/tools/java/jdk1.6.0_27-32/jre/bin/java -enableassertions -Xmx1400m -jar /x1/jenkins/jenkins-slave/workspace/HBase-0.92/trunk/target/surefire/surefirebooter8853264369773160962.jar
/x1/jenkins/jenkins-slave/workspace/HBase-0.92/trunk/target/surefire/surefire7178295232024739294tmp
/x1/jenkins/jenkins-slave/workspace/HBase-0.92/trunk/target/surefire/surefire59325434250627869tmp
Running org.apache.hadoop.hbase.io.TestHbaseObjectWritable
Tests run: 4, Failures: 0, Errors: 0, Skipped: 0, Time elapsed: 0.422 sec
Forking command line: /bin/sh -c cd /x1/jenkins/jenkins-slave/workspace/HBase-0.92/trunk &&
/x1/jenkins/tools/java/jdk1.6.0_27-32/jre/bin/java -enableassertions -Xmx1400m -jar /x1/jenkins/jenkins-slave/workspace/HBase-0.92/trunk/target/surefire/surefirebooter194151484121956074.jar
/x1/jenkins/jenkins-slave/workspace/HBase-0.92/trunk/target/surefire/surefire6349436434860503608tmp
/x1/jenkins/jenkins-slave/workspace/HBase-0.92/trunk/target/surefire/surefire521654491933580962tmp
Running org.apache.hadoop.hbase.io.TestImmutableBytesWritable
Tests run: 3, Failures: 0, Errors: 0, Skipped: 0, Time elapsed: 0.162 sec
Forking command line: /bin/sh -c cd /x1/jenkins/jenkins-slave/workspace/HBase-0.92/trunk &&
/x1/jenkins/tools/java/jdk1.6.0_27-32/jre/bin/java -enableassertions -Xmx1400m -jar /x1/jenkins/jenkins-slave/workspace/HBase-0.92/trunk/target/surefire/surefirebooter5888201145423315081.jar
/x1/jenkins/jenkins-slave/workspace/HBase-0.92/trunk/target/surefire/surefire3352269710067800371tmp
/x1/jenkins/jenkins-slave/workspace/HBase-0.92/trunk/target/surefire/surefire4636364566509684926tmp
Running org.apache.hadoop.hbase.io.TestHeapSize
Tests run: 2, Failures: 0, Errors: 0, Skipped: 0, Time elapsed: 0.201 sec
Forking command line: /bin/sh -c cd /x1/jenkins/jenkins-slave/workspace/HBase-0.92/trunk &&
/x1/jenkins/tools/java/jdk1.6.0_27-32/jre/bin/java -enableassertions -Xmx1400m -jar /x1/jenkins/jenkins-slave/workspace/HBase-0.92/trunk/target/surefire/surefirebooter4205159024266748916.jar
/x1/jenkins/jenkins-slave/workspace/HBase-0.92/trunk/target/surefire/surefire1500056728102638857tmp
/x1/jenkins/jenkins-slave/workspace/HBase-0.92/trunk/target/surefire/surefire8404653053639919875tmp
Running org.apache.hadoop.hbase.TestRegionRebalancing
Tests run: 1, Failures: 0, Errors: 0, Skipped: 0, Time elapsed: 44.386 sec
Forking command line: /bin/sh -c cd /x1/jenkins/jenkins-slave/workspace/HBase-0.92/trunk &&
/x1/jenkins/tools/java/jdk1.6.0_27-32/jre/bin/java -enableassertions -Xmx1400m -jar /x1/jenkins/jenkins-slave/workspace/HBase-0.92/trunk/target/surefire/surefirebooter7886108871041976200.jar
/x1/jenkins/jenkins-slave/workspace/HBase-0.92/trunk/target/surefire/surefire3404112659460353562tmp
/x1/jenkins/jenkins-slave/workspace/HBase-0.92/trunk/target/surefire/surefire6154648403973570634tmp
Running org.apache.hadoop.hbase.mapred.TestTableInputFormat
Tests run: 6, Failures: 0, Errors: 0, Skipped: 0, Time elapsed: 39.767 sec
Forking command line: /bin/sh -c cd /x1/jenkins/jenkins-slave/workspace/HBase-0.92/trunk &&
/x1/jenkins/tools/java/jdk1.6.0_27-32/jre/bin/java -enableassertions -Xmx1400m -jar /x1/jenkins/jenkins-slave/workspace/HBase-0.92/trunk/target/surefire/surefirebooter4392626151288439411.jar
/x1/jenkins/jenkins-slave/workspace/HBase-0.92/trunk/target/surefire/surefire6905764932742089816tmp
/x1/jenkins/jenkins-slave/workspace/HBase-0.92/trunk/target/surefire/surefire7005443013472159559tmp
Running org.apache.hadoop.hbase.mapred.TestTableMapReduce
Tests run: 1, Failures: 0, Errors: 0, Skipped: 0, Time elapsed: 59.832 sec
Forking command line: /bin/sh -c cd /x1/jenkins/jenkins-slave/workspace/HBase-0.92/trunk &&
/x1/jenkins/tools/java/jdk1.6.0_27-32/jre/bin/java -enableassertions -Xmx1400m -jar /x1/jenkins/jenkins-slave/workspace/HBase-0.92/trunk/target/surefire/surefirebooter4843789855791987820.jar
/x1/jenkins/jenkins-slave/workspace/HBase-0.92/trunk/target/surefire/surefire5620948947378092705tmp
/x1/jenkins/jenkins-slave/workspace/HBase-0.92/trunk/target/surefire/surefire4769568830674546102tmp
Running org.apache.hadoop.hbase.replication.regionserver.TestReplicationSink
Tests run: 5, Failures: 0, Errors: 0, Skipped: 0, Time elapsed: 17.758 sec
Forking command line: /bin/sh -c cd /x1/jenkins/jenkins-slave/workspace/HBase-0.92/trunk &&
/x1/jenkins/tools/java/jdk1.6.0_27-32/jre/bin/java -enableassertions -Xmx1400m -jar /x1/jenkins/jenkins-slave/workspace/HBase-0.92/trunk/target/surefire/surefirebooter4255068795380163613.jar
/x1/jenkins/jenkins-slave/workspace/HBase-0.92/trunk/target/surefire/surefire8541968576075773163tmp
/x1/jenkins/jenkins-slave/workspace/HBase-0.92/trunk/target/surefire/surefire6310173973379989473tmp
Running org.apache.hadoop.hbase.replication.regionserver.TestReplicationSourceManager
Tests run: 1, Failures: 0, Errors: 0, Skipped: 0, Time elapsed: 0.763 sec
Forking command line: /bin/sh -c cd /x1/jenkins/jenkins-slave/workspace/HBase-0.92/trunk &&
/x1/jenkins/tools/java/jdk1.6.0_27-32/jre/bin/java -enableassertions -Xmx1400m -jar /x1/jenkins/jenkins-slave/workspace/HBase-0.92/trunk/target/surefire/surefirebooter1041544486548922244.jar
/x1/jenkins/jenkins-slave/workspace/HBase-0.92/trunk/target/surefire/surefire4683224061758545701tmp
/x1/jenkins/jenkins-slave/workspace/HBase-0.92/trunk/target/surefire/surefire6760638287325034457tmp
Running org.apache.hadoop.hbase.replication.TestReplicationSource
Tests run: 1, Failures: 0, Errors: 0, Skipped: 0, Time elapsed: 2.677 sec
Forking command line: /bin/sh -c cd /x1/jenkins/jenkins-slave/workspace/HBase-0.92/trunk &&
/x1/jenkins/tools/java/jdk1.6.0_27-32/jre/bin/java -enableassertions -Xmx1400m -jar /x1/jenkins/jenkins-slave/workspace/HBase-0.92/trunk/target/surefire/surefirebooter7692203552639059601.jar
/x1/jenkins/jenkins-slave/workspace/HBase-0.92/trunk/target/surefire/surefire5903426810046795278tmp
/x1/jenkins/jenkins-slave/workspace/HBase-0.92/trunk/target/surefire/surefire8758825264089575866tmp
Running org.apache.hadoop.hbase.replication.TestReplication
Tests run: 7, Failures: 1, Errors: 0, Skipped: 0, Time elapsed: 186.559 sec <<< FAILURE!
Forking command line: /bin/sh -c cd /x1/jenkins/jenkins-slave/workspace/HBase-0.92/trunk &&
/x1/jenkins/tools/java/jdk1.6.0_27-32/jre/bin/java -enableassertions -Xmx1400m -jar /x1/jenkins/jenkins-slave/workspace/HBase-0.92/trunk/target/surefire/surefirebooter105592073718233834.jar
/x1/jenkins/jenkins-slave/workspace/HBase-0.92/trunk/target/surefire/surefire4063252981040039248tmp
/x1/jenkins/jenkins-slave/workspace/HBase-0.92/trunk/target/surefire/surefire4583504753065722336tmp
Running org.apache.hadoop.hbase.replication.TestReplicationPeer
Tests run: 1, Failures: 0, Errors: 0, Skipped: 0, Time elapsed: 25.435 sec
Forking command line: /bin/sh -c cd /x1/jenkins/jenkins-slave/workspace/HBase-0.92/trunk &&
/x1/jenkins/tools/java/jdk1.6.0_27-32/jre/bin/java -enableassertions -Xmx1400m -jar /x1/jenkins/jenkins-slave/workspace/HBase-0.92/trunk/target/surefire/surefirebooter6297798378283740905.jar
/x1/jenkins/jenkins-slave/workspace/HBase-0.92/trunk/target/surefire/surefire536686617208267459tmp
/x1/jenkins/jenkins-slave/workspace/HBase-0.92/trunk/target/surefire/surefire8763412210266095267tmp
Running org.apache.hadoop.hbase.replication.TestMultiSlaveReplication
Tests run: 1, Failures: 0, Errors: 0, Skipped: 0, Time elapsed: 48.262 sec
Forking command line: /bin/sh -c cd /x1/jenkins/jenkins-slave/workspace/HBase-0.92/trunk &&
/x1/jenkins/tools/java/jdk1.6.0_27-32/jre/bin/java -enableassertions -Xmx1400m -jar /x1/jenkins/jenkins-slave/workspace/HBase-0.92/trunk/target/surefire/surefirebooter9017616634005687386.jar
/x1/jenkins/jenkins-slave/workspace/HBase-0.92/trunk/target/surefire/surefire7693035569145247452tmp
/x1/jenkins/jenkins-slave/workspace/HBase-0.92/trunk/target/surefire/surefire1365698351287430607tmp
Running org.apache.hadoop.hbase.replication.TestMasterReplication
Tests run: 2, Failures: 0, Errors: 0, Skipped: 0, Time elapsed: 75.556 sec
Forking command line: /bin/sh -c cd /x1/jenkins/jenkins-slave/workspace/HBase-0.92/trunk &&
/x1/jenkins/tools/java/jdk1.6.0_27-32/jre/bin/java -enableassertions -Xmx1400m -jar /x1/jenkins/jenkins-slave/workspace/HBase-0.92/trunk/target/surefire/surefirebooter3001123176427443021.jar
/x1/jenkins/jenkins-slave/workspace/HBase-0.92/trunk/target/surefire/surefire2965857959332202925tmp
/x1/jenkins/jenkins-slave/workspace/HBase-0.92/trunk/target/surefire/surefire6849497182559449954tmp
Running org.apache.hadoop.hbase.util.TestHBaseFsckComparator
Tests run: 7, Failures: 0, Errors: 0, Skipped: 0, Time elapsed: 0.246 sec
Forking command line: /bin/sh -c cd /x1/jenkins/jenkins-slave/workspace/HBase-0.92/trunk &&
/x1/jenkins/tools/java/jdk1.6.0_27-32/jre/bin/java -enableassertions -Xmx1400m -jar /x1/jenkins/jenkins-slave/workspace/HBase-0.92/trunk/target/surefire/surefirebooter8570463408167837684.jar
/x1/jenkins/jenkins-slave/workspace/HBase-0.92/trunk/target/surefire/surefire1434388818221345097tmp
/x1/jenkins/jenkins-slave/workspace/HBase-0.92/trunk/target/surefire/surefire1364110604357004758tmp
Running org.apache.hadoop.hbase.util.TestMergeTool
Tests run: 1, Failures: 0, Errors: 0, Skipped: 0, Time elapsed: 249.832 sec
Forking command line: /bin/sh -c cd /x1/jenkins/jenkins-slave/workspace/HBase-0.92/trunk &&
/x1/jenkins/tools/java/jdk1.6.0_27-32/jre/bin/java -enableassertions -Xmx1400m -jar /x1/jenkins/jenkins-slave/workspace/HBase-0.92/trunk/target/surefire/surefirebooter5118358107626523382.jar
/x1/jenkins/jenkins-slave/workspace/HBase-0.92/trunk/target/surefire/surefire3810727419320212331tmp
/x1/jenkins/jenkins-slave/workspace/HBase-0.92/trunk/target/surefire/surefire445862624599749001tmp
Running org.apache.hadoop.hbase.util.TestFSTableDescriptors
Tests run: 10, Failures: 0, Errors: 0, Skipped: 0, Time elapsed: 0.761 sec
Forking command line: /bin/sh -c cd /x1/jenkins/jenkins-slave/workspace/HBase-0.92/trunk &&
/x1/jenkins/tools/java/jdk1.6.0_27-32/jre/bin/java -enableassertions -Xmx1400m -jar /x1/jenkins/jenkins-slave/workspace/HBase-0.92/trunk/target/surefire/surefirebooter4418860438128032245.jar
/x1/jenkins/jenkins-slave/workspace/HBase-0.92/trunk/target/surefire/surefire7266666387455983518tmp
/x1/jenkins/jenkins-slave/workspace/HBase-0.92/trunk/target/surefire/surefire7371696233974932147tmp
Running org.apache.hadoop.hbase.util.TestIdLock
Tests run: 1, Failures: 0, Errors: 0, Skipped: 0, Time elapsed: 15.254 sec
Forking command line: /bin/sh -c cd /x1/jenkins/jenkins-slave/workspace/HBase-0.92/trunk &&
/x1/jenkins/tools/java/jdk1.6.0_27-32/jre/bin/java -enableassertions -Xmx1400m -jar /x1/jenkins/jenkins-slave/workspace/HBase-0.92/trunk/target/surefire/surefirebooter8419244247402667497.jar
/x1/jenkins/jenkins-slave/workspace/HBase-0.92/trunk/target/surefire/surefire7495133419253668212tmp
/x1/jenkins/jenkins-slave/workspace/HBase-0.92/trunk/target/surefire/surefire1782563080631190533tmp
Running org.apache.hadoop.hbase.util.TestCompressionTest
Tests run: 1, Failures: 0, Errors: 0, Skipped: 0, Time elapsed: 0.328 sec
Forking command line: /bin/sh -c cd /x1/jenkins/jenkins-slave/workspace/HBase-0.92/trunk &&
/x1/jenkins/tools/java/jdk1.6.0_27-32/jre/bin/java -enableassertions -Xmx1400m -jar /x1/jenkins/jenkins-slave/workspace/HBase-0.92/trunk/target/surefire/surefirebooter8847892932769150632.jar
/x1/jenkins/jenkins-slave/workspace/HBase-0.92/trunk/target/surefire/surefire3757231850026990910tmp
/x1/jenkins/jenkins-slave/workspace/HBase-0.92/trunk/target/surefire/surefire8866225397049353153tmp
Running org.apache.hadoop.hbase.util.TestBytes
Tests run: 13, Failures: 0, Errors: 0, Skipped: 0, Time elapsed: 0.15 sec
Forking command line: /bin/sh -c cd /x1/jenkins/jenkins-slave/workspace/HBase-0.92/trunk &&
/x1/jenkins/tools/java/jdk1.6.0_27-32/jre/bin/java -enableassertions -Xmx1400m -jar /x1/jenkins/jenkins-slave/workspace/HBase-0.92/trunk/target/surefire/surefirebooter9009160335241214796.jar
/x1/jenkins/jenkins-slave/workspace/HBase-0.92/trunk/target/surefire/surefire2304499643063431939tmp
/x1/jenkins/jenkins-slave/workspace/HBase-0.92/trunk/target/surefire/surefire2679635395168664981tmp
Running org.apache.hadoop.hbase.util.TestSortedCopyOnWriteSet
Tests run: 2, Failures: 0, Errors: 0, Skipped: 0, Time elapsed: 0.098 sec
Forking command line: /bin/sh -c cd /x1/jenkins/jenkins-slave/workspace/HBase-0.92/trunk &&
/x1/jenkins/tools/java/jdk1.6.0_27-32/jre/bin/java -enableassertions -Xmx1400m -jar /x1/jenkins/jenkins-slave/workspace/HBase-0.92/trunk/target/surefire/surefirebooter7929490687492287657.jar
/x1/jenkins/jenkins-slave/workspace/HBase-0.92/trunk/target/surefire/surefire8483589515857738570tmp
/x1/jenkins/jenkins-slave/workspace/HBase-0.92/trunk/target/surefire/surefire3748493643688190528tmp
Running org.apache.hadoop.hbase.util.TestEnvironmentEdgeManager
Tests run: 2, Failures: 0, Errors: 0, Skipped: 0, Time elapsed: 0.231 sec
Forking command line: /bin/sh -c cd /x1/jenkins/jenkins-slave/workspace/HBase-0.92/trunk &&
/x1/jenkins/tools/java/jdk1.6.0_27-32/jre/bin/java -enableassertions -Xmx1400m -jar /x1/jenkins/jenkins-slave/workspace/HBase-0.92/trunk/target/surefire/surefirebooter8372259481787227884.jar
/x1/jenkins/jenkins-slave/workspace/HBase-0.92/trunk/target/surefire/surefire4825798248350077268tmp
/x1/jenkins/jenkins-slave/workspace/HBase-0.92/trunk/target/surefire/surefire4823812769408244140tmp
Running org.apache.hadoop.hbase.util.TestKeying
Tests run: 1, Failures: 0, Errors: 0, Skipped: 0, Time elapsed: 0.035 sec
Forking command line: /bin/sh -c cd /x1/jenkins/jenkins-slave/workspace/HBase-0.92/trunk &&
/x1/jenkins/tools/java/jdk1.6.0_27-32/jre/bin/java -enableassertions -Xmx1400m -jar /x1/jenkins/jenkins-slave/workspace/HBase-0.92/trunk/target/surefire/surefirebooter6548844261305703391.jar
/x1/jenkins/jenkins-slave/workspace/HBase-0.92/trunk/target/surefire/surefire7820480130596193746tmp
/x1/jenkins/jenkins-slave/workspace/HBase-0.92/trunk/target/surefire/surefire3423668283134385776tmp
Running org.apache.hadoop.hbase.util.TestByteBloomFilter
Tests run: 5, Failures: 0, Errors: 0, Skipped: 0, Time elapsed: 0.922 sec
Forking command line: /bin/sh -c cd /x1/jenkins/jenkins-slave/workspace/HBase-0.92/trunk &&
/x1/jenkins/tools/java/jdk1.6.0_27-32/jre/bin/java -enableassertions -Xmx1400m -jar /x1/jenkins/jenkins-slave/workspace/HBase-0.92/trunk/target/surefire/surefirebooter1450026602282528777.jar
/x1/jenkins/jenkins-slave/workspace/HBase-0.92/trunk/target/surefire/surefire1439438803400995966tmp
/x1/jenkins/jenkins-slave/workspace/HBase-0.92/trunk/target/surefire/surefire8732645943174504015tmp
Running org.apache.hadoop.hbase.util.TestRootPath
Tests run: 1, Failures: 0, Errors: 0, Skipped: 0, Time elapsed: 0.126 sec
Forking command line: /bin/sh -c cd /x1/jenkins/jenkins-slave/workspace/HBase-0.92/trunk &&
/x1/jenkins/tools/java/jdk1.6.0_27-32/jre/bin/java -enableassertions -Xmx1400m -jar /x1/jenkins/jenkins-slave/workspace/HBase-0.92/trunk/target/surefire/surefirebooter6728109788454420080.jar
/x1/jenkins/jenkins-slave/workspace/HBase-0.92/trunk/target/surefire/surefire4963756052539995553tmp
/x1/jenkins/jenkins-slave/workspace/HBase-0.92/trunk/target/surefire/surefire7623321758239058256tmp
Running org.apache.hadoop.hbase.util.TestMergeTable
Tests run: 1, Failures: 0, Errors: 0, Skipped: 0, Time elapsed: 43.238 sec
Forking command line: /bin/sh -c cd /x1/jenkins/jenkins-slave/workspace/HBase-0.92/trunk &&
/x1/jenkins/tools/java/jdk1.6.0_27-32/jre/bin/java -enableassertions -Xmx1400m -jar /x1/jenkins/jenkins-slave/workspace/HBase-0.92/trunk/target/surefire/surefirebooter1244695120173745486.jar
/x1/jenkins/jenkins-slave/workspace/HBase-0.92/trunk/target/surefire/surefire374227044270139211tmp
/x1/jenkins/jenkins-slave/workspace/HBase-0.92/trunk/target/surefire/surefire1873516720325231276tmp
Running org.apache.hadoop.hbase.util.TestHBaseFsck
Tests run: 6, Failures: 0, Errors: 0, Skipped: 0, Time elapsed: 39.658 sec
Forking command line: /bin/sh -c cd /x1/jenkins/jenkins-slave/workspace/HBase-0.92/trunk &&
/x1/jenkins/tools/java/jdk1.6.0_27-32/jre/bin/java -enableassertions -Xmx1400m -jar /x1/jenkins/jenkins-slave/workspace/HBase-0.92/trunk/target/surefire/surefirebooter8702116394467731288.jar
/x1/jenkins/jenkins-slave/workspace/HBase-0.92/trunk/target/surefire/surefire1160403077553176496tmp
/x1/jenkins/jenkins-slave/workspace/HBase-0.92/trunk/target/surefire/surefire1157326905808286043tmp
Running org.apache.hadoop.hbase.util.TestFSUtils
Tests run: 2, Failures: 0, Errors: 0, Skipped: 0, Time elapsed: 19.224 sec
Forking command line: /bin/sh -c cd /x1/jenkins/jenkins-slave/workspace/HBase-0.92/trunk &&
/x1/jenkins/tools/java/jdk1.6.0_27-32/jre/bin/java -enableassertions -Xmx1400m -jar /x1/jenkins/jenkins-slave/workspace/HBase-0.92/trunk/target/surefire/surefirebooter531038201690602545.jar
/x1/jenkins/jenkins-slave/workspace/HBase-0.92/trunk/target/surefire/surefire1868321536923953062tmp
/x1/jenkins/jenkins-slave/workspace/HBase-0.92/trunk/target/surefire/surefire7505281772039931261tmp
Running org.apache.hadoop.hbase.util.TestPoolMap
Tests run: 9, Failures: 0, Errors: 0, Skipped: 0, Time elapsed: 0.091 sec
Forking command line: /bin/sh -c cd /x1/jenkins/jenkins-slave/workspace/HBase-0.92/trunk &&
/x1/jenkins/tools/java/jdk1.6.0_27-32/jre/bin/java -enableassertions -Xmx1400m -jar /x1/jenkins/jenkins-slave/workspace/HBase-0.92/trunk/target/surefire/surefirebooter5906793212873064048.jar
/x1/jenkins/jenkins-slave/workspace/HBase-0.92/trunk/target/surefire/surefire5893791411165509471tmp
/x1/jenkins/jenkins-slave/workspace/HBase-0.92/trunk/target/surefire/surefire8476659126478634697tmp
Running org.apache.hadoop.hbase.util.TestBase64
Tests run: 1, Failures: 0, Errors: 0, Skipped: 0, Time elapsed: 0.128 sec
Forking command line: /bin/sh -c cd /x1/jenkins/jenkins-slave/workspace/HBase-0.92/trunk &&
/x1/jenkins/tools/java/jdk1.6.0_27-32/jre/bin/java -enableassertions -Xmx1400m -jar /x1/jenkins/jenkins-slave/workspace/HBase-0.92/trunk/target/surefire/surefirebooter8419247356113642721.jar
/x1/jenkins/jenkins-slave/workspace/HBase-0.92/trunk/target/surefire/surefire7659215011886489940tmp
/x1/jenkins/jenkins-slave/workspace/HBase-0.92/trunk/target/surefire/surefire8824003388195562263tmp
Running org.apache.hadoop.hbase.util.hbck.TestOfflineMetaRebuildBase
Tests run: 1, Failures: 0, Errors: 0, Skipped: 0, Time elapsed: 23.579 sec
Forking command line: /bin/sh -c cd /x1/jenkins/jenkins-slave/workspace/HBase-0.92/trunk &&
/x1/jenkins/tools/java/jdk1.6.0_27-32/jre/bin/java -enableassertions -Xmx1400m -jar /x1/jenkins/jenkins-slave/workspace/HBase-0.92/trunk/target/surefire/surefirebooter45538447811288775.jar
/x1/jenkins/jenkins-slave/workspace/HBase-0.92/trunk/target/surefire/surefire7605101787678464898tmp
/x1/jenkins/jenkins-slave/workspace/HBase-0.92/trunk/target/surefire/surefire6199526848163355697tmp
Running org.apache.hadoop.hbase.util.hbck.TestOfflineMetaRebuildOverlap
Tests run: 1, Failures: 0, Errors: 0, Skipped: 0, Time elapsed: 22.999 sec
Forking command line: /bin/sh -c cd /x1/jenkins/jenkins-slave/workspace/HBase-0.92/trunk &&
/x1/jenkins/tools/java/jdk1.6.0_27-32/jre/bin/java -enableassertions -Xmx1400m -jar /x1/jenkins/jenkins-slave/workspace/HBase-0.92/trunk/target/surefire/surefirebooter4136563076744770629.jar
/x1/jenkins/jenkins-slave/workspace/HBase-0.92/trunk/target/surefire/surefire5822842937527202806tmp
/x1/jenkins/jenkins-slave/workspace/HBase-0.92/trunk/target/surefire/surefire1712352427444643273tmp
Running org.apache.hadoop.hbase.util.hbck.TestOfflineMetaRebuildHole
Tests run: 1, Failures: 0, Errors: 0, Skipped: 0, Time elapsed: 39.362 sec
Forking command line: /bin/sh -c cd /x1/jenkins/jenkins-slave/workspace/HBase-0.92/trunk &&
/x1/jenkins/tools/java/jdk1.6.0_27-32/jre/bin/java -enableassertions -Xmx1400m -jar /x1/jenkins/jenkins-slave/workspace/HBase-0.92/trunk/target/surefire/surefirebooter4138255623794129971.jar
/x1/jenkins/jenkins-slave/workspace/HBase-0.92/trunk/target/surefire/surefire4673625573689226352tmp
/x1/jenkins/jenkins-slave/workspace/HBase-0.92/trunk/target/surefire/surefire3738256067063772728tmp
Running org.apache.hadoop.hbase.util.TestDefaultEnvironmentEdge
Tests run: 1, Failures: 0, Errors: 0, Skipped: 0, Time elapsed: 0.084 sec
Forking command line: /bin/sh -c cd /x1/jenkins/jenkins-slave/workspace/HBase-0.92/trunk &&
/x1/jenkins/tools/java/jdk1.6.0_27-32/jre/bin/java -enableassertions -Xmx1400m -jar /x1/jenkins/jenkins-slave/workspace/HBase-0.92/trunk/target/surefire/surefirebooter22146741095777099.jar
/x1/jenkins/jenkins-slave/workspace/HBase-0.92/trunk/target/surefire/surefire5102560223825055498tmp
/x1/jenkins/jenkins-slave/workspace/HBase-0.92/trunk/target/surefire/surefire2517027103516567614tmp
Running org.apache.hadoop.hbase.util.TestIncrementingEnvironmentEdge
Tests run: 1, Failures: 0, Errors: 0, Skipped: 0, Time elapsed: 0.074 sec
Forking command line: /bin/sh -c cd /x1/jenkins/jenkins-slave/workspace/HBase-0.92/trunk &&
/x1/jenkins/tools/java/jdk1.6.0_27-32/jre/bin/java -enableassertions -Xmx1400m -jar /x1/jenkins/jenkins-slave/workspace/HBase-0.92/trunk/target/surefire/surefirebooter2747343397920061371.jar
/x1/jenkins/jenkins-slave/workspace/HBase-0.92/trunk/target/surefire/surefire6661639699863309823tmp
/x1/jenkins/jenkins-slave/workspace/HBase-0.92/trunk/target/surefire/surefire422065122210786310tmp
Running org.apache.hadoop.hbase.util.TestRegionSplitCalculator
Tests run: 14, Failures: 0, Errors: 0, Skipped: 0, Time elapsed: 0.201 sec
Forking command line: /bin/sh -c cd /x1/jenkins/jenkins-slave/workspace/HBase-0.92/trunk &&
/x1/jenkins/tools/java/jdk1.6.0_27-32/jre/bin/java -enableassertions -Xmx1400m -jar /x1/jenkins/jenkins-slave/workspace/HBase-0.92/trunk/target/surefire/surefirebooter5151834186495991937.jar
/x1/jenkins/jenkins-slave/workspace/HBase-0.92/trunk/target/surefire/surefire2988259944430475221tmp
/x1/jenkins/jenkins-slave/workspace/HBase-0.92/trunk/target/surefire/surefire6924112119763390862tmp
Running org.apache.hadoop.hbase.TestHRegionLocation
Tests run: 3, Failures: 0, Errors: 0, Skipped: 0, Time elapsed: 0.144 sec
Forking command line: /bin/sh -c cd /x1/jenkins/jenkins-slave/workspace/HBase-0.92/trunk &&
/x1/jenkins/tools/java/jdk1.6.0_27-32/jre/bin/java -enableassertions -Xmx1400m -jar /x1/jenkins/jenkins-slave/workspace/HBase-0.92/trunk/target/surefire/surefirebooter1202003352543295926.jar
/x1/jenkins/jenkins-slave/workspace/HBase-0.92/trunk/target/surefire/surefire2636140190641049242tmp
/x1/jenkins/jenkins-slave/workspace/HBase-0.92/trunk/target/surefire/surefire1146981344379092229tmp
Running org.apache.hadoop.hbase.migration.TestMigrationFrom090To092
Tests run: 1, Failures: 0, Errors: 0, Skipped: 0, Time elapsed: 0.242 sec
Forking command line: /bin/sh -c cd /x1/jenkins/jenkins-slave/workspace/HBase-0.92/trunk &&
/x1/jenkins/tools/java/jdk1.6.0_27-32/jre/bin/java -enableassertions -Xmx1400m -jar /x1/jenkins/jenkins-slave/workspace/HBase-0.92/trunk/target/surefire/surefirebooter280495843051567906.jar
/x1/jenkins/jenkins-slave/workspace/HBase-0.92/trunk/target/surefire/surefire2055431458270501642tmp
/x1/jenkins/jenkins-slave/workspace/HBase-0.92/trunk/target/surefire/surefire4185399058725393518tmp
Running org.apache.hadoop.hbase.TestCompare
Tests run: 1, Failures: 0, Errors: 0, Skipped: 0, Time elapsed: 0.219 sec
Forking command line: /bin/sh -c cd /x1/jenkins/jenkins-slave/workspace/HBase-0.92/trunk &&
/x1/jenkins/tools/java/jdk1.6.0_27-32/jre/bin/java -enableassertions -Xmx1400m -jar /x1/jenkins/jenkins-slave/workspace/HBase-0.92/trunk/target/surefire/surefirebooter7249996451779176544.jar
/x1/jenkins/jenkins-slave/workspace/HBase-0.92/trunk/target/surefire/surefire7275238485773599991tmp
/x1/jenkins/jenkins-slave/workspace/HBase-0.92/trunk/target/surefire/surefire3010434605738518016tmp
Running org.apache.hadoop.hbase.TestInfoServers
Tests run: 2, Failures: 0, Errors: 0, Skipped: 0, Time elapsed: 12.73 sec
Forking command line: /bin/sh -c cd /x1/jenkins/jenkins-slave/workspace/HBase-0.92/trunk &&
/x1/jenkins/tools/java/jdk1.6.0_27-32/jre/bin/java -enableassertions -Xmx1400m -jar /x1/jenkins/jenkins-slave/workspace/HBase-0.92/trunk/target/surefire/surefirebooter2638802484028929067.jar
/x1/jenkins/jenkins-slave/workspace/HBase-0.92/trunk/target/surefire/surefire2008077162846076450tmp
/x1/jenkins/jenkins-slave/workspace/HBase-0.92/trunk/target/surefire/surefire8169434197599080034tmp
Running org.apache.hadoop.hbase.TestHServerAddress
Tests run: 6, Failures: 0, Errors: 0, Skipped: 0, Time elapsed: 0.101 sec
Forking command line: /bin/sh -c cd /x1/jenkins/jenkins-slave/workspace/HBase-0.92/trunk &&
/x1/jenkins/tools/java/jdk1.6.0_27-32/jre/bin/java -enableassertions -Xmx1400m -jar /x1/jenkins/jenkins-slave/workspace/HBase-0.92/trunk/target/surefire/surefirebooter7398350041159324985.jar
/x1/jenkins/jenkins-slave/workspace/HBase-0.92/trunk/target/surefire/surefire7176819706310879535tmp
/x1/jenkins/jenkins-slave/workspace/HBase-0.92/trunk/target/surefire/surefire8674112469169622161tmp
Running org.apache.hadoop.hbase.TestServerName
Tests run: 4, Failures: 0, Errors: 0, Skipped: 0, Time elapsed: 0.188 sec

Results :

Failed tests:   testDeleteEditUnknownColumnFamilyAndOrTable(org.apache.hadoop.hbase.client.TestAdmin)
  queueFailover(org.apache.hadoop.hbase.replication.TestReplication): Waited too much time
for queueFailover replication

Tests in error: 
  testRunShellTests(org.apache.hadoop.hbase.client.TestShell): (RuntimeError) Shell unit tests
failed. Check output file for details.

Tests run: 1060, Failures: 2, Errors: 1, Skipped: 10

[INFO] ------------------------------------------------------------------------
[INFO] BUILD FAILURE
[INFO] ------------------------------------------------------------------------
[INFO] Total time: 1:41:18.165s
[INFO] Finished at: Sat Nov 19 08:00:02 UTC 2011
[INFO] Final Memory: 41M/785M
[INFO] ------------------------------------------------------------------------
[ERROR] Failed to execute goal org.apache.maven.plugins:maven-surefire-plugin:2.10:test (default-test)
on project hbase: There are test failures.
[ERROR] 
[ERROR] Please refer to /x1/jenkins/jenkins-slave/workspace/HBase-0.92/trunk/target/surefire-reports
for the individual test results.
[ERROR] -> [Help 1]
org.apache.maven.lifecycle.LifecycleExecutionException: Failed to execute goal org.apache.maven.plugins:maven-surefire-plugin:2.10:test
(default-test) on project hbase: There are test failures.

Please refer to /x1/jenkins/jenkins-slave/workspace/HBase-0.92/trunk/target/surefire-reports
for the individual test results.
	at org.apache.maven.lifecycle.internal.MojoExecutor.execute(MojoExecutor.java:213)
	at org.apache.maven.lifecycle.internal.MojoExecutor.execute(MojoExecutor.java:153)
	at org.apache.maven.lifecycle.internal.MojoExecutor.execute(MojoExecutor.java:145)
	at org.apache.maven.lifecycle.internal.MojoExecutor.executeForkedExecutions(MojoExecutor.java:365)
	at org.apache.maven.lifecycle.internal.MojoExecutor.execute(MojoExecutor.java:199)
	at org.apache.maven.lifecycle.internal.MojoExecutor.execute(MojoExecutor.java:153)
	at org.apache.maven.lifecycle.internal.MojoExecutor.execute(MojoExecutor.java:145)
	at org.apache.maven.lifecycle.internal.LifecycleModuleBuilder.buildProject(LifecycleModuleBuilder.java:84)
	at org.apache.maven.lifecycle.internal.LifecycleModuleBuilder.buildProject(LifecycleModuleBuilder.java:59)
	at org.apache.maven.lifecycle.internal.LifecycleStarter.singleThreadedBuild(LifecycleStarter.java:183)
	at org.apache.maven.lifecycle.internal.LifecycleStarter.execute(LifecycleStarter.java:161)
	at org.apache.maven.DefaultMaven.doExecute(DefaultMaven.java:319)
	at org.apache.maven.DefaultMaven.execute(DefaultMaven.java:156)
	at org.apache.maven.cli.MavenCli.execute(MavenCli.java:537)
	at org.apache.maven.cli.MavenCli.doMain(MavenCli.java:196)
	at org.apache.maven.cli.MavenCli.main(MavenCli.java:141)
	at sun.reflect.NativeMethodAccessorImpl.invoke0(Native Method)
	at sun.reflect.NativeMethodAccessorImpl.invoke(NativeMethodAccessorImpl.java:39)
	at sun.reflect.DelegatingMethodAccessorImpl.invoke(DelegatingMethodAccessorImpl.java:25)
	at java.lang.reflect.Method.invoke(Method.java:597)
	at org.codehaus.plexus.classworlds.launcher.Launcher.launchEnhanced(Launcher.java:290)
	at org.codehaus.plexus.classworlds.launcher.Launcher.launch(Launcher.java:230)
	at org.codehaus.plexus.classworlds.launcher.Launcher.mainWithExitCode(Launcher.java:409)
	at org.codehaus.plexus.classworlds.launcher.Launcher.main(Launcher.java:352)
Caused by: org.apache.maven.plugin.MojoFailureException: There are test failures.

Please refer to /x1/jenkins/jenkins-slave/workspace/HBase-0.92/trunk/target/surefire-reports
for the individual test results.
	at org.apache.maven.plugin.surefire.SurefireHelper.reportExecution(SurefireHelper.java:87)
	at org.apache.maven.plugin.surefire.SurefirePlugin.writeSummary(SurefirePlugin.java:641)
	at org.apache.maven.plugin.surefire.SurefirePlugin.handleSummary(SurefirePlugin.java:615)
	at org.apache.maven.plugin.surefire.AbstractSurefireMojo.executeAfterPreconditionsChecked(AbstractSurefireMojo.java:137)
	at org.apache.maven.plugin.surefire.AbstractSurefireMojo.execute(AbstractSurefireMojo.java:98)
	at org.apache.maven.plugin.DefaultBuildPluginManager.executeMojo(DefaultBuildPluginManager.java:101)
	at org.apache.maven.lifecycle.internal.MojoExecutor.execute(MojoExecutor.java:209)
	... 23 more
[ERROR] 
[ERROR] 
[ERROR] For more information about the errors and possible solutions, please read the following
articles:
[ERROR] [Help 1] http://cwiki.apache.org/confluence/display/MAVEN/MojoFailureException
Build step 'Invoke top-level Maven targets' marked build as failure
[locks-and-latches] Releasing all the locks
[locks-and-latches] All the locks released
Archiving artifacts
Recording test results
Updating HBASE-4436


Mime
View raw message