hbase-dev mailing list archives

Site index · List index
Message view « Date » · « Thread »
Top « Date » · « Thread »
From Apache Jenkins Server <jenk...@builds.apache.org>
Subject Build failed in Jenkins: HBase-0.92 #108
Date Fri, 04 Nov 2011 14:38:09 GMT
See <https://builds.apache.org/job/HBase-0.92/108/>

------------------------------------------
[...truncated 6417 lines...]
Tests run: 21, Failures: 0, Errors: 0, Skipped: 0, Time elapsed: 27.424 sec
Forking command line: /bin/sh -c cd <https://builds.apache.org/job/HBase-0.92/ws/trunk>
&& /home/jenkins/tools/java/jdk1.6.0_27-32/jre/bin/java -enableassertions -Xmx1400m
-jar <https://builds.apache.org/job/HBase-0.92/ws/trunk/target/surefire/surefirebooter4586993770866435049.jar>
<https://builds.apache.org/job/HBase-0.92/ws/trunk/target/surefire/surefire1909272840399816537tmp>
<https://builds.apache.org/job/HBase-0.92/ws/trunk/target/surefire/surefire1828407550806325293tmp>
Running org.apache.hadoop.hbase.regionserver.TestHRegion
Tests run: 57, Failures: 0, Errors: 0, Skipped: 0, Time elapsed: 29.286 sec
Forking command line: /bin/sh -c cd <https://builds.apache.org/job/HBase-0.92/ws/trunk>
&& /home/jenkins/tools/java/jdk1.6.0_27-32/jre/bin/java -enableassertions -Xmx1400m
-jar <https://builds.apache.org/job/HBase-0.92/ws/trunk/target/surefire/surefirebooter1931075417024027421.jar>
<https://builds.apache.org/job/HBase-0.92/ws/trunk/target/surefire/surefire3483170790087289779tmp>
<https://builds.apache.org/job/HBase-0.92/ws/trunk/target/surefire/surefire4246454904273116642tmp>
Running org.apache.hadoop.hbase.regionserver.TestMasterAddressManager
Tests run: 1, Failures: 0, Errors: 0, Skipped: 0, Time elapsed: 0.542 sec
Forking command line: /bin/sh -c cd <https://builds.apache.org/job/HBase-0.92/ws/trunk>
&& /home/jenkins/tools/java/jdk1.6.0_27-32/jre/bin/java -enableassertions -Xmx1400m
-jar <https://builds.apache.org/job/HBase-0.92/ws/trunk/target/surefire/surefirebooter825824236649273102.jar>
<https://builds.apache.org/job/HBase-0.92/ws/trunk/target/surefire/surefire7532014506285118649tmp>
<https://builds.apache.org/job/HBase-0.92/ws/trunk/target/surefire/surefire102428861635904527tmp>
Running org.apache.hadoop.hbase.regionserver.TestCompoundBloomFilter
Tests run: 3, Failures: 0, Errors: 0, Skipped: 0, Time elapsed: 21.953 sec
Forking command line: /bin/sh -c cd <https://builds.apache.org/job/HBase-0.92/ws/trunk>
&& /home/jenkins/tools/java/jdk1.6.0_27-32/jre/bin/java -enableassertions -Xmx1400m
-jar <https://builds.apache.org/job/HBase-0.92/ws/trunk/target/surefire/surefirebooter1565996559878154305.jar>
<https://builds.apache.org/job/HBase-0.92/ws/trunk/target/surefire/surefire3000261864516312974tmp>
<https://builds.apache.org/job/HBase-0.92/ws/trunk/target/surefire/surefire5706520773014091266tmp>
Running org.apache.hadoop.hbase.regionserver.TestSplitLogWorker
Tests run: 5, Failures: 0, Errors: 0, Skipped: 0, Time elapsed: 2.066 sec
Forking command line: /bin/sh -c cd <https://builds.apache.org/job/HBase-0.92/ws/trunk>
&& /home/jenkins/tools/java/jdk1.6.0_27-32/jre/bin/java -enableassertions -Xmx1400m
-jar <https://builds.apache.org/job/HBase-0.92/ws/trunk/target/surefire/surefirebooter5276954500517094831.jar>
<https://builds.apache.org/job/HBase-0.92/ws/trunk/target/surefire/surefire1292142691326183913tmp>
<https://builds.apache.org/job/HBase-0.92/ws/trunk/target/surefire/surefire4746468071529183007tmp>
Running org.apache.hadoop.hbase.regionserver.TestServerCustomProtocol
Tests run: 6, Failures: 0, Errors: 0, Skipped: 0, Time elapsed: 18.959 sec
Forking command line: /bin/sh -c cd <https://builds.apache.org/job/HBase-0.92/ws/trunk>
&& /home/jenkins/tools/java/jdk1.6.0_27-32/jre/bin/java -enableassertions -Xmx1400m
-jar <https://builds.apache.org/job/HBase-0.92/ws/trunk/target/surefire/surefirebooter6251014938912608202.jar>
<https://builds.apache.org/job/HBase-0.92/ws/trunk/target/surefire/surefire113966298090122894tmp>
<https://builds.apache.org/job/HBase-0.92/ws/trunk/target/surefire/surefire7287496227184535410tmp>
Running org.apache.hadoop.hbase.regionserver.TestScanWithBloomError
Tests run: 3, Failures: 0, Errors: 0, Skipped: 0, Time elapsed: 1.025 sec
Forking command line: /bin/sh -c cd <https://builds.apache.org/job/HBase-0.92/ws/trunk>
&& /home/jenkins/tools/java/jdk1.6.0_27-32/jre/bin/java -enableassertions -Xmx1400m
-jar <https://builds.apache.org/job/HBase-0.92/ws/trunk/target/surefire/surefirebooter1509783739339218544.jar>
<https://builds.apache.org/job/HBase-0.92/ws/trunk/target/surefire/surefire694746381518954024tmp>
<https://builds.apache.org/job/HBase-0.92/ws/trunk/target/surefire/surefire4225528464968423269tmp>
Running org.apache.hadoop.hbase.regionserver.TestStoreFileBlockCacheSummary
Tests run: 1, Failures: 0, Errors: 0, Skipped: 0, Time elapsed: 17.016 sec
Forking command line: /bin/sh -c cd <https://builds.apache.org/job/HBase-0.92/ws/trunk>
&& /home/jenkins/tools/java/jdk1.6.0_27-32/jre/bin/java -enableassertions -Xmx1400m
-jar <https://builds.apache.org/job/HBase-0.92/ws/trunk/target/surefire/surefirebooter571576872214954214.jar>
<https://builds.apache.org/job/HBase-0.92/ws/trunk/target/surefire/surefire6424426762371370748tmp>
<https://builds.apache.org/job/HBase-0.92/ws/trunk/target/surefire/surefire5239447251979196908tmp>
Running org.apache.hadoop.hbase.regionserver.TestStore
Tests run: 11, Failures: 0, Errors: 0, Skipped: 0, Time elapsed: 1.793 sec
Forking command line: /bin/sh -c cd <https://builds.apache.org/job/HBase-0.92/ws/trunk>
&& /home/jenkins/tools/java/jdk1.6.0_27-32/jre/bin/java -enableassertions -Xmx1400m
-jar <https://builds.apache.org/job/HBase-0.92/ws/trunk/target/surefire/surefirebooter8914968619841391257.jar>
<https://builds.apache.org/job/HBase-0.92/ws/trunk/target/surefire/surefire2335403041871437317tmp>
<https://builds.apache.org/job/HBase-0.92/ws/trunk/target/surefire/surefire6590372699271712055tmp>
Running org.apache.hadoop.hbase.regionserver.TestBlocksRead
Tests run: 3, Failures: 0, Errors: 0, Skipped: 0, Time elapsed: 0.982 sec
Forking command line: /bin/sh -c cd <https://builds.apache.org/job/HBase-0.92/ws/trunk>
&& /home/jenkins/tools/java/jdk1.6.0_27-32/jre/bin/java -enableassertions -Xmx1400m
-jar <https://builds.apache.org/job/HBase-0.92/ws/trunk/target/surefire/surefirebooter3404689771327652498.jar>
<https://builds.apache.org/job/HBase-0.92/ws/trunk/target/surefire/surefire1708366377614223529tmp>
<https://builds.apache.org/job/HBase-0.92/ws/trunk/target/surefire/surefire1677714558886343280tmp>
Running org.apache.hadoop.hbase.regionserver.TestFSErrorsExposed
Tests run: 3, Failures: 0, Errors: 0, Skipped: 0, Time elapsed: 33.106 sec
Forking command line: /bin/sh -c cd <https://builds.apache.org/job/HBase-0.92/ws/trunk>
&& /home/jenkins/tools/java/jdk1.6.0_27-32/jre/bin/java -enableassertions -Xmx1400m
-jar <https://builds.apache.org/job/HBase-0.92/ws/trunk/target/surefire/surefirebooter1421976858088489105.jar>
<https://builds.apache.org/job/HBase-0.92/ws/trunk/target/surefire/surefire1917615012307071608tmp>
<https://builds.apache.org/job/HBase-0.92/ws/trunk/target/surefire/surefire8650383656740285775tmp>
Running org.apache.hadoop.hbase.regionserver.handler.TestCloseRegionHandler
Tests run: 1, Failures: 0, Errors: 0, Skipped: 0, Time elapsed: 0.817 sec
Forking command line: /bin/sh -c cd <https://builds.apache.org/job/HBase-0.92/ws/trunk>
&& /home/jenkins/tools/java/jdk1.6.0_27-32/jre/bin/java -enableassertions -Xmx1400m
-jar <https://builds.apache.org/job/HBase-0.92/ws/trunk/target/surefire/surefirebooter7456729070807407326.jar>
<https://builds.apache.org/job/HBase-0.92/ws/trunk/target/surefire/surefire1747622688280708200tmp>
<https://builds.apache.org/job/HBase-0.92/ws/trunk/target/surefire/surefire6591841836346192260tmp>
Running org.apache.hadoop.hbase.regionserver.handler.TestOpenRegionHandler
Tests run: 3, Failures: 0, Errors: 0, Skipped: 0, Time elapsed: 0.932 sec
Forking command line: /bin/sh -c cd <https://builds.apache.org/job/HBase-0.92/ws/trunk>
&& /home/jenkins/tools/java/jdk1.6.0_27-32/jre/bin/java -enableassertions -Xmx1400m
-jar <https://builds.apache.org/job/HBase-0.92/ws/trunk/target/surefire/surefirebooter1079686926948682300.jar>
<https://builds.apache.org/job/HBase-0.92/ws/trunk/target/surefire/surefire3258964974452214721tmp>
<https://builds.apache.org/job/HBase-0.92/ws/trunk/target/surefire/surefire5018965716288671003tmp>
Running org.apache.hadoop.hbase.regionserver.TestScanDeleteTracker
Tests run: 6, Failures: 0, Errors: 0, Skipped: 0, Time elapsed: 0.598 sec
Forking command line: /bin/sh -c cd <https://builds.apache.org/job/HBase-0.92/ws/trunk>
&& /home/jenkins/tools/java/jdk1.6.0_27-32/jre/bin/java -enableassertions -Xmx1400m
-jar <https://builds.apache.org/job/HBase-0.92/ws/trunk/target/surefire/surefirebooter8581446648904789748.jar>
<https://builds.apache.org/job/HBase-0.92/ws/trunk/target/surefire/surefire9019181616878545890tmp>
<https://builds.apache.org/job/HBase-0.92/ws/trunk/target/surefire/surefire3228322108790400127tmp>
Running org.apache.hadoop.hbase.regionserver.TestSplitTransactionOnCluster
Tests run: 4, Failures: 0, Errors: 0, Skipped: 0, Time elapsed: 46.12 sec
Forking command line: /bin/sh -c cd <https://builds.apache.org/job/HBase-0.92/ws/trunk>
&& /home/jenkins/tools/java/jdk1.6.0_27-32/jre/bin/java -enableassertions -Xmx1400m
-jar <https://builds.apache.org/job/HBase-0.92/ws/trunk/target/surefire/surefirebooter172457402395535388.jar>
<https://builds.apache.org/job/HBase-0.92/ws/trunk/target/surefire/surefire7926504618490648208tmp>
<https://builds.apache.org/job/HBase-0.92/ws/trunk/target/surefire/surefire8943294006746562316tmp>
Running org.apache.hadoop.hbase.regionserver.TestHRegionServerBulkLoad
Tests run: 1, Failures: 0, Errors: 0, Skipped: 0, Time elapsed: 48.602 sec
Forking command line: /bin/sh -c cd <https://builds.apache.org/job/HBase-0.92/ws/trunk>
&& /home/jenkins/tools/java/jdk1.6.0_27-32/jre/bin/java -enableassertions -Xmx1400m
-jar <https://builds.apache.org/job/HBase-0.92/ws/trunk/target/surefire/surefirebooter6308137315412315440.jar>
<https://builds.apache.org/job/HBase-0.92/ws/trunk/target/surefire/surefire2278093102678812875tmp>
<https://builds.apache.org/job/HBase-0.92/ws/trunk/target/surefire/surefire766936436410056219tmp>
Running org.apache.hadoop.hbase.regionserver.TestSplitTransaction
Tests run: 6, Failures: 0, Errors: 0, Skipped: 0, Time elapsed: 3.678 sec
Forking command line: /bin/sh -c cd <https://builds.apache.org/job/HBase-0.92/ws/trunk>
&& /home/jenkins/tools/java/jdk1.6.0_27-32/jre/bin/java -enableassertions -Xmx1400m
-jar <https://builds.apache.org/job/HBase-0.92/ws/trunk/target/surefire/surefirebooter451041702512695976.jar>
<https://builds.apache.org/job/HBase-0.92/ws/trunk/target/surefire/surefire1268042201459894181tmp>
<https://builds.apache.org/job/HBase-0.92/ws/trunk/target/surefire/surefire1070495537767625109tmp>
Running org.apache.hadoop.hbase.regionserver.TestReadWriteConsistencyControl
Tests run: 1, Failures: 0, Errors: 0, Skipped: 0, Time elapsed: 10.127 sec
Forking command line: /bin/sh -c cd <https://builds.apache.org/job/HBase-0.92/ws/trunk>
&& /home/jenkins/tools/java/jdk1.6.0_27-32/jre/bin/java -enableassertions -Xmx1400m
-jar <https://builds.apache.org/job/HBase-0.92/ws/trunk/target/surefire/surefirebooter5611539797386645098.jar>
<https://builds.apache.org/job/HBase-0.92/ws/trunk/target/surefire/surefire7408720614507217009tmp>
<https://builds.apache.org/job/HBase-0.92/ws/trunk/target/surefire/surefire3043699518621249529tmp>
Running org.apache.hadoop.hbase.regionserver.TestKeyValueHeap
Tests run: 3, Failures: 0, Errors: 0, Skipped: 0, Time elapsed: 0.504 sec
Forking command line: /bin/sh -c cd <https://builds.apache.org/job/HBase-0.92/ws/trunk>
&& /home/jenkins/tools/java/jdk1.6.0_27-32/jre/bin/java -enableassertions -Xmx1400m
-jar <https://builds.apache.org/job/HBase-0.92/ws/trunk/target/surefire/surefirebooter6990929412250591272.jar>
<https://builds.apache.org/job/HBase-0.92/ws/trunk/target/surefire/surefire2660309734574001126tmp>
<https://builds.apache.org/job/HBase-0.92/ws/trunk/target/surefire/surefire5370007576462941886tmp>
Running org.apache.hadoop.hbase.regionserver.TestCompactSelection
Tests run: 1, Failures: 0, Errors: 0, Skipped: 0, Time elapsed: 0.642 sec
Forking command line: /bin/sh -c cd <https://builds.apache.org/job/HBase-0.92/ws/trunk>
&& /home/jenkins/tools/java/jdk1.6.0_27-32/jre/bin/java -enableassertions -Xmx1400m
-jar <https://builds.apache.org/job/HBase-0.92/ws/trunk/target/surefire/surefirebooter4762319932882866214.jar>
<https://builds.apache.org/job/HBase-0.92/ws/trunk/target/surefire/surefire30910599780187485tmp>
<https://builds.apache.org/job/HBase-0.92/ws/trunk/target/surefire/surefire7569443982653038656tmp>
Running org.apache.hadoop.hbase.regionserver.TestMinVersions
Tests run: 6, Failures: 0, Errors: 0, Skipped: 0, Time elapsed: 1.209 sec
Forking command line: /bin/sh -c cd <https://builds.apache.org/job/HBase-0.92/ws/trunk>
&& /home/jenkins/tools/java/jdk1.6.0_27-32/jre/bin/java -enableassertions -Xmx1400m
-jar <https://builds.apache.org/job/HBase-0.92/ws/trunk/target/surefire/surefirebooter7601571909322863056.jar>
<https://builds.apache.org/job/HBase-0.92/ws/trunk/target/surefire/surefire9145156630852797073tmp>
<https://builds.apache.org/job/HBase-0.92/ws/trunk/target/surefire/surefire4839622672973088793tmp>
Running org.apache.hadoop.hbase.regionserver.TestWideScanner
Tests run: 1, Failures: 0, Errors: 0, Skipped: 0, Time elapsed: 1.869 sec
Forking command line: /bin/sh -c cd <https://builds.apache.org/job/HBase-0.92/ws/trunk>
&& /home/jenkins/tools/java/jdk1.6.0_27-32/jre/bin/java -enableassertions -Xmx1400m
-jar <https://builds.apache.org/job/HBase-0.92/ws/trunk/target/surefire/surefirebooter6849224926629318899.jar>
<https://builds.apache.org/job/HBase-0.92/ws/trunk/target/surefire/surefire1595392462650579690tmp>
<https://builds.apache.org/job/HBase-0.92/ws/trunk/target/surefire/surefire1138935277800068109tmp>
Running org.apache.hadoop.hbase.regionserver.TestColumnSeeking
Tests run: 2, Failures: 0, Errors: 0, Skipped: 0, Time elapsed: 4.662 sec
Forking command line: /bin/sh -c cd <https://builds.apache.org/job/HBase-0.92/ws/trunk>
&& /home/jenkins/tools/java/jdk1.6.0_27-32/jre/bin/java -enableassertions -Xmx1400m
-jar <https://builds.apache.org/job/HBase-0.92/ws/trunk/target/surefire/surefirebooter3061310110438551055.jar>
<https://builds.apache.org/job/HBase-0.92/ws/trunk/target/surefire/surefire5149636512212167073tmp>
<https://builds.apache.org/job/HBase-0.92/ws/trunk/target/surefire/surefire4711828427937234526tmp>
Running org.apache.hadoop.hbase.regionserver.TestGetClosestAtOrBefore
Tests run: 3, Failures: 0, Errors: 0, Skipped: 0, Time elapsed: 1.155 sec
Forking command line: /bin/sh -c cd <https://builds.apache.org/job/HBase-0.92/ws/trunk>
&& /home/jenkins/tools/java/jdk1.6.0_27-32/jre/bin/java -enableassertions -Xmx1400m
-jar <https://builds.apache.org/job/HBase-0.92/ws/trunk/target/surefire/surefirebooter2850808125269995046.jar>
<https://builds.apache.org/job/HBase-0.92/ws/trunk/target/surefire/surefire4957221845002514956tmp>
<https://builds.apache.org/job/HBase-0.92/ws/trunk/target/surefire/surefire1267415781691246488tmp>
Running org.apache.hadoop.hbase.regionserver.TestExplicitColumnTracker
Tests run: 4, Failures: 0, Errors: 0, Skipped: 0, Time elapsed: 0.897 sec
Forking command line: /bin/sh -c cd <https://builds.apache.org/job/HBase-0.92/ws/trunk>
&& /home/jenkins/tools/java/jdk1.6.0_27-32/jre/bin/java -enableassertions -Xmx1400m
-jar <https://builds.apache.org/job/HBase-0.92/ws/trunk/target/surefire/surefirebooter3361142673687675959.jar>
<https://builds.apache.org/job/HBase-0.92/ws/trunk/target/surefire/surefire8649046459333804732tmp>
<https://builds.apache.org/job/HBase-0.92/ws/trunk/target/surefire/surefire3863656519615048790tmp>
Running org.apache.hadoop.hbase.regionserver.TestMemStoreLAB
Tests run: 3, Failures: 0, Errors: 0, Skipped: 0, Time elapsed: 1.355 sec
Forking command line: /bin/sh -c cd <https://builds.apache.org/job/HBase-0.92/ws/trunk>
&& /home/jenkins/tools/java/jdk1.6.0_27-32/jre/bin/java -enableassertions -Xmx1400m
-jar <https://builds.apache.org/job/HBase-0.92/ws/trunk/target/surefire/surefirebooter1395591215355788619.jar>
<https://builds.apache.org/job/HBase-0.92/ws/trunk/target/surefire/surefire75914315660124453tmp>
<https://builds.apache.org/job/HBase-0.92/ws/trunk/target/surefire/surefire7393168701017930206tmp>
Running org.apache.hadoop.hbase.regionserver.TestKeyValueScanFixture
Tests run: 1, Failures: 0, Errors: 0, Skipped: 0, Time elapsed: 0.114 sec
Forking command line: /bin/sh -c cd <https://builds.apache.org/job/HBase-0.92/ws/trunk>
&& /home/jenkins/tools/java/jdk1.6.0_27-32/jre/bin/java -enableassertions -Xmx1400m
-jar <https://builds.apache.org/job/HBase-0.92/ws/trunk/target/surefire/surefirebooter5864494751980785959.jar>
<https://builds.apache.org/job/HBase-0.92/ws/trunk/target/surefire/surefire5850942853087717049tmp>
<https://builds.apache.org/job/HBase-0.92/ws/trunk/target/surefire/surefire2727865613902249105tmp>
Running org.apache.hadoop.hbase.regionserver.wal.TestLogRollAbort
Tests run: 1, Failures: 0, Errors: 0, Skipped: 0, Time elapsed: 156.09 sec
Forking command line: /bin/sh -c cd <https://builds.apache.org/job/HBase-0.92/ws/trunk>
&& /home/jenkins/tools/java/jdk1.6.0_27-32/jre/bin/java -enableassertions -Xmx1400m
-jar <https://builds.apache.org/job/HBase-0.92/ws/trunk/target/surefire/surefirebooter7553224568474534418.jar>
<https://builds.apache.org/job/HBase-0.92/ws/trunk/target/surefire/surefire8358684634021410389tmp>
<https://builds.apache.org/job/HBase-0.92/ws/trunk/target/surefire/surefire4055047239835430162tmp>
Running org.apache.hadoop.hbase.regionserver.wal.TestWALActionsListener
Tests run: 1, Failures: 0, Errors: 0, Skipped: 0, Time elapsed: 0.626 sec
Forking command line: /bin/sh -c cd <https://builds.apache.org/job/HBase-0.92/ws/trunk>
&& /home/jenkins/tools/java/jdk1.6.0_27-32/jre/bin/java -enableassertions -Xmx1400m
-jar <https://builds.apache.org/job/HBase-0.92/ws/trunk/target/surefire/surefirebooter6504755094921730079.jar>
<https://builds.apache.org/job/HBase-0.92/ws/trunk/target/surefire/surefire4054056768293829013tmp>
<https://builds.apache.org/job/HBase-0.92/ws/trunk/target/surefire/surefire374156691391166565tmp>
Running org.apache.hadoop.hbase.regionserver.wal.TestLogRolling
Tests run: 3, Failures: 0, Errors: 0, Skipped: 0, Time elapsed: 326.587 sec
Forking command line: /bin/sh -c cd <https://builds.apache.org/job/HBase-0.92/ws/trunk>
&& /home/jenkins/tools/java/jdk1.6.0_27-32/jre/bin/java -enableassertions -Xmx1400m
-jar <https://builds.apache.org/job/HBase-0.92/ws/trunk/target/surefire/surefirebooter4590645211823621846.jar>
<https://builds.apache.org/job/HBase-0.92/ws/trunk/target/surefire/surefire3623246253115182721tmp>
<https://builds.apache.org/job/HBase-0.92/ws/trunk/target/surefire/surefire7303189201628948935tmp>
Running org.apache.hadoop.hbase.regionserver.wal.TestHLog
Tests run: 9, Failures: 0, Errors: 0, Skipped: 0, Time elapsed: 59.639 sec
Forking command line: /bin/sh -c cd <https://builds.apache.org/job/HBase-0.92/ws/trunk>
&& /home/jenkins/tools/java/jdk1.6.0_27-32/jre/bin/java -enableassertions -Xmx1400m
-jar <https://builds.apache.org/job/HBase-0.92/ws/trunk/target/surefire/surefirebooter3605628105603408047.jar>
<https://builds.apache.org/job/HBase-0.92/ws/trunk/target/surefire/surefire6428772641653121641tmp>
<https://builds.apache.org/job/HBase-0.92/ws/trunk/target/surefire/surefire2715288051943365570tmp>
Running org.apache.hadoop.hbase.regionserver.wal.TestHLogSplit
Tests run: 29, Failures: 0, Errors: 0, Skipped: 1, Time elapsed: 236.181 sec
Forking command line: /bin/sh -c cd <https://builds.apache.org/job/HBase-0.92/ws/trunk>
&& /home/jenkins/tools/java/jdk1.6.0_27-32/jre/bin/java -enableassertions -Xmx1400m
-jar <https://builds.apache.org/job/HBase-0.92/ws/trunk/target/surefire/surefirebooter8823566116225811030.jar>
<https://builds.apache.org/job/HBase-0.92/ws/trunk/target/surefire/surefire660933708920122775tmp>
<https://builds.apache.org/job/HBase-0.92/ws/trunk/target/surefire/surefire4424923278338185833tmp>
Running org.apache.hadoop.hbase.regionserver.wal.TestWALReplay
Tests run: 5, Failures: 0, Errors: 0, Skipped: 0, Time elapsed: 29.136 sec
Forking command line: /bin/sh -c cd <https://builds.apache.org/job/HBase-0.92/ws/trunk>
&& /home/jenkins/tools/java/jdk1.6.0_27-32/jre/bin/java -enableassertions -Xmx1400m
-jar <https://builds.apache.org/job/HBase-0.92/ws/trunk/target/surefire/surefirebooter1409604228359368253.jar>
<https://builds.apache.org/job/HBase-0.92/ws/trunk/target/surefire/surefire1100776092048496196tmp>
<https://builds.apache.org/job/HBase-0.92/ws/trunk/target/surefire/surefire635872346879322811tmp>
Running org.apache.hadoop.hbase.regionserver.wal.TestHLogMethods
Tests run: 3, Failures: 0, Errors: 0, Skipped: 0, Time elapsed: 0.825 sec
Forking command line: /bin/sh -c cd <https://builds.apache.org/job/HBase-0.92/ws/trunk>
&& /home/jenkins/tools/java/jdk1.6.0_27-32/jre/bin/java -enableassertions -Xmx1400m
-jar <https://builds.apache.org/job/HBase-0.92/ws/trunk/target/surefire/surefirebooter3050063778404842923.jar>
<https://builds.apache.org/job/HBase-0.92/ws/trunk/target/surefire/surefire6165308352224038018tmp>
<https://builds.apache.org/job/HBase-0.92/ws/trunk/target/surefire/surefire7049952900952368486tmp>
Running org.apache.hadoop.hbase.regionserver.TestRSStatusServlet
Tests run: 2, Failures: 0, Errors: 0, Skipped: 0, Time elapsed: 0.671 sec
Forking command line: /bin/sh -c cd <https://builds.apache.org/job/HBase-0.92/ws/trunk>
&& /home/jenkins/tools/java/jdk1.6.0_27-32/jre/bin/java -enableassertions -Xmx1400m
-jar <https://builds.apache.org/job/HBase-0.92/ws/trunk/target/surefire/surefirebooter5613069146130236015.jar>
<https://builds.apache.org/job/HBase-0.92/ws/trunk/target/surefire/surefire3871150477679594725tmp>
<https://builds.apache.org/job/HBase-0.92/ws/trunk/target/surefire/surefire6595052151478913422tmp>
Running org.apache.hadoop.hbase.regionserver.TestStoreScanner
Tests run: 14, Failures: 0, Errors: 0, Skipped: 0, Time elapsed: 0.142 sec
Forking command line: /bin/sh -c cd <https://builds.apache.org/job/HBase-0.92/ws/trunk>
&& /home/jenkins/tools/java/jdk1.6.0_27-32/jre/bin/java -enableassertions -Xmx1400m
-jar <https://builds.apache.org/job/HBase-0.92/ws/trunk/target/surefire/surefirebooter2325255084897495483.jar>
<https://builds.apache.org/job/HBase-0.92/ws/trunk/target/surefire/surefire1600529613090040009tmp>
<https://builds.apache.org/job/HBase-0.92/ws/trunk/target/surefire/surefire3521995303791874566tmp>
Running org.apache.hadoop.hbase.regionserver.TestResettingCounters
Tests run: 1, Failures: 0, Errors: 0, Skipped: 0, Time elapsed: 0.715 sec
Forking command line: /bin/sh -c cd <https://builds.apache.org/job/HBase-0.92/ws/trunk>
&& /home/jenkins/tools/java/jdk1.6.0_27-32/jre/bin/java -enableassertions -Xmx1400m
-jar <https://builds.apache.org/job/HBase-0.92/ws/trunk/target/surefire/surefirebooter7872420379489785047.jar>
<https://builds.apache.org/job/HBase-0.92/ws/trunk/target/surefire/surefire3062397541524457752tmp>
<https://builds.apache.org/job/HBase-0.92/ws/trunk/target/surefire/surefire1006405480321537481tmp>
Running org.apache.hadoop.hbase.regionserver.TestStoreFile
Tests run: 8, Failures: 0, Errors: 0, Skipped: 0, Time elapsed: 1.675 sec
Forking command line: /bin/sh -c cd <https://builds.apache.org/job/HBase-0.92/ws/trunk>
&& /home/jenkins/tools/java/jdk1.6.0_27-32/jre/bin/java -enableassertions -Xmx1400m
-jar <https://builds.apache.org/job/HBase-0.92/ws/trunk/target/surefire/surefirebooter5904386728041872679.jar>
<https://builds.apache.org/job/HBase-0.92/ws/trunk/target/surefire/surefire3220338836166266074tmp>
<https://builds.apache.org/job/HBase-0.92/ws/trunk/target/surefire/surefire6867990223928123812tmp>
Running org.apache.hadoop.hbase.regionserver.TestEndToEndSplitTransaction
Tests run: 1, Failures: 0, Errors: 0, Skipped: 0, Time elapsed: 42.869 sec
Forking command line: /bin/sh -c cd <https://builds.apache.org/job/HBase-0.92/ws/trunk>
&& /home/jenkins/tools/java/jdk1.6.0_27-32/jre/bin/java -enableassertions -Xmx1400m
-jar <https://builds.apache.org/job/HBase-0.92/ws/trunk/target/surefire/surefirebooter1163260515919808295.jar>
<https://builds.apache.org/job/HBase-0.92/ws/trunk/target/surefire/surefire6922040903209508561tmp>
<https://builds.apache.org/job/HBase-0.92/ws/trunk/target/surefire/surefire4291336248993512592tmp>
Running org.apache.hadoop.hbase.regionserver.TestScanWildcardColumnTracker
Tests run: 2, Failures: 0, Errors: 0, Skipped: 0, Time elapsed: 0.459 sec
Forking command line: /bin/sh -c cd <https://builds.apache.org/job/HBase-0.92/ws/trunk>
&& /home/jenkins/tools/java/jdk1.6.0_27-32/jre/bin/java -enableassertions -Xmx1400m
-jar <https://builds.apache.org/job/HBase-0.92/ws/trunk/target/surefire/surefirebooter3144502902037874930.jar>
<https://builds.apache.org/job/HBase-0.92/ws/trunk/target/surefire/surefire3628087066007704557tmp>
<https://builds.apache.org/job/HBase-0.92/ws/trunk/target/surefire/surefire6989160395621440983tmp>
Running org.apache.hadoop.hbase.regionserver.TestCompaction
Tests run: 10, Failures: 0, Errors: 0, Skipped: 0, Time elapsed: 12.064 sec
Forking command line: /bin/sh -c cd <https://builds.apache.org/job/HBase-0.92/ws/trunk>
&& /home/jenkins/tools/java/jdk1.6.0_27-32/jre/bin/java -enableassertions -Xmx1400m
-jar <https://builds.apache.org/job/HBase-0.92/ws/trunk/target/surefire/surefirebooter2076037115034734401.jar>
<https://builds.apache.org/job/HBase-0.92/ws/trunk/target/surefire/surefire8328395142608797843tmp>
<https://builds.apache.org/job/HBase-0.92/ws/trunk/target/surefire/surefire8896475478018102405tmp>
Running org.apache.hadoop.hbase.regionserver.TestQueryMatcher
Tests run: 4, Failures: 0, Errors: 0, Skipped: 0, Time elapsed: 0.544 sec
Forking command line: /bin/sh -c cd <https://builds.apache.org/job/HBase-0.92/ws/trunk>
&& /home/jenkins/tools/java/jdk1.6.0_27-32/jre/bin/java -enableassertions -Xmx1400m
-jar <https://builds.apache.org/job/HBase-0.92/ws/trunk/target/surefire/surefirebooter2326220616266924625.jar>
<https://builds.apache.org/job/HBase-0.92/ws/trunk/target/surefire/surefire759986307624467343tmp>
<https://builds.apache.org/job/HBase-0.92/ws/trunk/target/surefire/surefire8754736823231451910tmp>
Running org.apache.hadoop.hbase.regionserver.TestRpcMetrics
Tests run: 1, Failures: 0, Errors: 0, Skipped: 0, Time elapsed: 2.027 sec
Forking command line: /bin/sh -c cd <https://builds.apache.org/job/HBase-0.92/ws/trunk>
&& /home/jenkins/tools/java/jdk1.6.0_27-32/jre/bin/java -enableassertions -Xmx1400m
-jar <https://builds.apache.org/job/HBase-0.92/ws/trunk/target/surefire/surefirebooter2530620888295134019.jar>
<https://builds.apache.org/job/HBase-0.92/ws/trunk/target/surefire/surefire4423717627539354334tmp>
<https://builds.apache.org/job/HBase-0.92/ws/trunk/target/surefire/surefire5028138545802339842tmp>
Running org.apache.hadoop.hbase.regionserver.TestScanner
Tests run: 6, Failures: 0, Errors: 0, Skipped: 0, Time elapsed: 4.641 sec
Forking command line: /bin/sh -c cd <https://builds.apache.org/job/HBase-0.92/ws/trunk>
&& /home/jenkins/tools/java/jdk1.6.0_27-32/jre/bin/java -enableassertions -Xmx1400m
-jar <https://builds.apache.org/job/HBase-0.92/ws/trunk/target/surefire/surefirebooter4067910741267197565.jar>
<https://builds.apache.org/job/HBase-0.92/ws/trunk/target/surefire/surefire3490773297604519868tmp>
<https://builds.apache.org/job/HBase-0.92/ws/trunk/target/surefire/surefire3242715483085395933tmp>
Running org.apache.hadoop.hbase.regionserver.TestMultiColumnScanner
Tests run: 6, Failures: 0, Errors: 0, Skipped: 0, Time elapsed: 18.361 sec
Forking command line: /bin/sh -c cd <https://builds.apache.org/job/HBase-0.92/ws/trunk>
&& /home/jenkins/tools/java/jdk1.6.0_27-32/jre/bin/java -enableassertions -Xmx1400m
-jar <https://builds.apache.org/job/HBase-0.92/ws/trunk/target/surefire/surefirebooter2034038028091378844.jar>
<https://builds.apache.org/job/HBase-0.92/ws/trunk/target/surefire/surefire388383263544790878tmp>
<https://builds.apache.org/job/HBase-0.92/ws/trunk/target/surefire/surefire6685353498106347278tmp>
Running org.apache.hadoop.hbase.regionserver.TestRegionSplitPolicy
Tests run: 3, Failures: 0, Errors: 0, Skipped: 0, Time elapsed: 0.697 sec
Forking command line: /bin/sh -c cd <https://builds.apache.org/job/HBase-0.92/ws/trunk>
&& /home/jenkins/tools/java/jdk1.6.0_27-32/jre/bin/java -enableassertions -Xmx1400m
-jar <https://builds.apache.org/job/HBase-0.92/ws/trunk/target/surefire/surefirebooter1912952086448891778.jar>
<https://builds.apache.org/job/HBase-0.92/ws/trunk/target/surefire/surefire4337087903225207395tmp>
<https://builds.apache.org/job/HBase-0.92/ws/trunk/target/surefire/surefire1634610956767546057tmp>
Running org.apache.hadoop.hbase.regionserver.TestKeyValueSkipListSet
Tests run: 4, Failures: 0, Errors: 0, Skipped: 0, Time elapsed: 0.121 sec
Forking command line: /bin/sh -c cd <https://builds.apache.org/job/HBase-0.92/ws/trunk>
&& /home/jenkins/tools/java/jdk1.6.0_27-32/jre/bin/java -enableassertions -Xmx1400m
-jar <https://builds.apache.org/job/HBase-0.92/ws/trunk/target/surefire/surefirebooter5275692371967282837.jar>
<https://builds.apache.org/job/HBase-0.92/ws/trunk/target/surefire/surefire4003871083738707423tmp>
<https://builds.apache.org/job/HBase-0.92/ws/trunk/target/surefire/surefire2377286824782243563tmp>
Running org.apache.hadoop.hbase.mapred.TestTableMapReduce
Tests run: 1, Failures: 0, Errors: 0, Skipped: 0, Time elapsed: 64.13 sec
Forking command line: /bin/sh -c cd <https://builds.apache.org/job/HBase-0.92/ws/trunk>
&& /home/jenkins/tools/java/jdk1.6.0_27-32/jre/bin/java -enableassertions -Xmx1400m
-jar <https://builds.apache.org/job/HBase-0.92/ws/trunk/target/surefire/surefirebooter7303451761716435416.jar>
<https://builds.apache.org/job/HBase-0.92/ws/trunk/target/surefire/surefire7766911506049776899tmp>
<https://builds.apache.org/job/HBase-0.92/ws/trunk/target/surefire/surefire5611009258766419550tmp>
Running org.apache.hadoop.hbase.mapred.TestTableInputFormat
Tests run: 6, Failures: 0, Errors: 0, Skipped: 0, Time elapsed: 28.623 sec
Forking command line: /bin/sh -c cd <https://builds.apache.org/job/HBase-0.92/ws/trunk>
&& /home/jenkins/tools/java/jdk1.6.0_27-32/jre/bin/java -enableassertions -Xmx1400m
-jar <https://builds.apache.org/job/HBase-0.92/ws/trunk/target/surefire/surefirebooter5266822410660926762.jar>
<https://builds.apache.org/job/HBase-0.92/ws/trunk/target/surefire/surefire3645917364472534146tmp>
<https://builds.apache.org/job/HBase-0.92/ws/trunk/target/surefire/surefire606271000926366677tmp>
Running org.apache.hadoop.hbase.TestDrainingServer
Tests run: 2, Failures: 0, Errors: 0, Skipped: 0, Time elapsed: 20.225 sec
Forking command line: /bin/sh -c cd <https://builds.apache.org/job/HBase-0.92/ws/trunk>
&& /home/jenkins/tools/java/jdk1.6.0_27-32/jre/bin/java -enableassertions -Xmx1400m
-jar <https://builds.apache.org/job/HBase-0.92/ws/trunk/target/surefire/surefirebooter3335830441433737564.jar>
<https://builds.apache.org/job/HBase-0.92/ws/trunk/target/surefire/surefire8508314293623776477tmp>
<https://builds.apache.org/job/HBase-0.92/ws/trunk/target/surefire/surefire842855422181129424tmp>
Running org.apache.hadoop.hbase.TestFSTableDescriptorForceCreation
Tests run: 3, Failures: 0, Errors: 0, Skipped: 0, Time elapsed: 0.522 sec
Forking command line: /bin/sh -c cd <https://builds.apache.org/job/HBase-0.92/ws/trunk>
&& /home/jenkins/tools/java/jdk1.6.0_27-32/jre/bin/java -enableassertions -Xmx1400m
-jar <https://builds.apache.org/job/HBase-0.92/ws/trunk/target/surefire/surefirebooter8314529199326224515.jar>
<https://builds.apache.org/job/HBase-0.92/ws/trunk/target/surefire/surefire5567273262868496167tmp>
<https://builds.apache.org/job/HBase-0.92/ws/trunk/target/surefire/surefire7393071275322569029tmp>
Running org.apache.hadoop.hbase.executor.TestExecutorService
Tests run: 1, Failures: 0, Errors: 0, Skipped: 0, Time elapsed: 2.439 sec
Forking command line: /bin/sh -c cd <https://builds.apache.org/job/HBase-0.92/ws/trunk>
&& /home/jenkins/tools/java/jdk1.6.0_27-32/jre/bin/java -enableassertions -Xmx1400m
-jar <https://builds.apache.org/job/HBase-0.92/ws/trunk/target/surefire/surefirebooter5974890960826079603.jar>
<https://builds.apache.org/job/HBase-0.92/ws/trunk/target/surefire/surefire4885874719186400922tmp>
<https://builds.apache.org/job/HBase-0.92/ws/trunk/target/surefire/surefire2957845800317937009tmp>
Running org.apache.hadoop.hbase.mapreduce.TestTimeRangeMapRed
Tests run: 1, Failures: 0, Errors: 0, Skipped: 0, Time elapsed: 38.662 sec
Forking command line: /bin/sh -c cd <https://builds.apache.org/job/HBase-0.92/ws/trunk>
&& /home/jenkins/tools/java/jdk1.6.0_27-32/jre/bin/java -enableassertions -Xmx1400m
-jar <https://builds.apache.org/job/HBase-0.92/ws/trunk/target/surefire/surefirebooter4237738915250656277.jar>
<https://builds.apache.org/job/HBase-0.92/ws/trunk/target/surefire/surefire6227757215795708004tmp>
<https://builds.apache.org/job/HBase-0.92/ws/trunk/target/surefire/surefire40641699886640194tmp>
Running org.apache.hadoop.hbase.mapreduce.TestHFileOutputFormat
Tests run: 8, Failures: 0, Errors: 0, Skipped: 0, Time elapsed: 148.38 sec
Forking command line: /bin/sh -c cd <https://builds.apache.org/job/HBase-0.92/ws/trunk>
&& /home/jenkins/tools/java/jdk1.6.0_27-32/jre/bin/java -enableassertions -Xmx1400m
-jar <https://builds.apache.org/job/HBase-0.92/ws/trunk/target/surefire/surefirebooter3515559676348069449.jar>
<https://builds.apache.org/job/HBase-0.92/ws/trunk/target/surefire/surefire3425115966402875983tmp>
<https://builds.apache.org/job/HBase-0.92/ws/trunk/target/surefire/surefire8740198850765416561tmp>
Running org.apache.hadoop.hbase.mapreduce.TestImportTsv
Tests run: 8, Failures: 0, Errors: 0, Skipped: 0, Time elapsed: 38.546 sec
Forking command line: /bin/sh -c cd <https://builds.apache.org/job/HBase-0.92/ws/trunk>
&& /home/jenkins/tools/java/jdk1.6.0_27-32/jre/bin/java -enableassertions -Xmx1400m
-jar <https://builds.apache.org/job/HBase-0.92/ws/trunk/target/surefire/surefirebooter3046027946072456167.jar>
<https://builds.apache.org/job/HBase-0.92/ws/trunk/target/surefire/surefire671509640939383755tmp>
<https://builds.apache.org/job/HBase-0.92/ws/trunk/target/surefire/surefire4862183310870306875tmp>
Running org.apache.hadoop.hbase.mapreduce.TestTableInputFormatScan
Tests run: 11, Failures: 0, Errors: 0, Skipped: 0, Time elapsed: 452.848 sec
Forking command line: /bin/sh -c cd <https://builds.apache.org/job/HBase-0.92/ws/trunk>
&& /home/jenkins/tools/java/jdk1.6.0_27-32/jre/bin/java -enableassertions -Xmx1400m
-jar <https://builds.apache.org/job/HBase-0.92/ws/trunk/target/surefire/surefirebooter5904317416689378311.jar>
<https://builds.apache.org/job/HBase-0.92/ws/trunk/target/surefire/surefire8705755192774736624tmp>
<https://builds.apache.org/job/HBase-0.92/ws/trunk/target/surefire/surefire2017440770033548099tmp>
Running org.apache.hadoop.hbase.mapreduce.TestLoadIncrementalHFilesSplitRecovery
Tests run: 3, Failures: 0, Errors: 0, Skipped: 0, Time elapsed: 76.875 sec
Forking command line: /bin/sh -c cd <https://builds.apache.org/job/HBase-0.92/ws/trunk>
&& /home/jenkins/tools/java/jdk1.6.0_27-32/jre/bin/java -enableassertions -Xmx1400m
-jar <https://builds.apache.org/job/HBase-0.92/ws/trunk/target/surefire/surefirebooter991926484848958282.jar>
<https://builds.apache.org/job/HBase-0.92/ws/trunk/target/surefire/surefire4184010615635608802tmp>
<https://builds.apache.org/job/HBase-0.92/ws/trunk/target/surefire/surefire5256650500723156243tmp>
Running org.apache.hadoop.hbase.mapreduce.TestTableSplit
Tests run: 1, Failures: 0, Errors: 0, Skipped: 0, Time elapsed: 0.133 sec
Forking command line: /bin/sh -c cd <https://builds.apache.org/job/HBase-0.92/ws/trunk>
&& /home/jenkins/tools/java/jdk1.6.0_27-32/jre/bin/java -enableassertions -Xmx1400m
-jar <https://builds.apache.org/job/HBase-0.92/ws/trunk/target/surefire/surefirebooter1475356721273054816.jar>
<https://builds.apache.org/job/HBase-0.92/ws/trunk/target/surefire/surefire8067102743866159069tmp>
<https://builds.apache.org/job/HBase-0.92/ws/trunk/target/surefire/surefire7450623492719828370tmp>
Running org.apache.hadoop.hbase.mapreduce.TestSimpleTotalOrderPartitioner
Tests run: 1, Failures: 0, Errors: 0, Skipped: 0, Time elapsed: 0.422 sec
Forking command line: /bin/sh -c cd <https://builds.apache.org/job/HBase-0.92/ws/trunk>
&& /home/jenkins/tools/java/jdk1.6.0_27-32/jre/bin/java -enableassertions -Xmx1400m
-jar <https://builds.apache.org/job/HBase-0.92/ws/trunk/target/surefire/surefirebooter8613004465806665923.jar>
<https://builds.apache.org/job/HBase-0.92/ws/trunk/target/surefire/surefire5657988413050088302tmp>
<https://builds.apache.org/job/HBase-0.92/ws/trunk/target/surefire/surefire3920745102741021275tmp>
Running org.apache.hadoop.hbase.mapreduce.TestTableMapReduce
Tests run: 1, Failures: 0, Errors: 0, Skipped: 0, Time elapsed: 94.538 sec
Forking command line: /bin/sh -c cd <https://builds.apache.org/job/HBase-0.92/ws/trunk>
&& /home/jenkins/tools/java/jdk1.6.0_27-32/jre/bin/java -enableassertions -Xmx1400m
-jar <https://builds.apache.org/job/HBase-0.92/ws/trunk/target/surefire/surefirebooter2970726167562834320.jar>
<https://builds.apache.org/job/HBase-0.92/ws/trunk/target/surefire/surefire6490603500852611405tmp>
<https://builds.apache.org/job/HBase-0.92/ws/trunk/target/surefire/surefire8934534645396920992tmp>
Running org.apache.hadoop.hbase.mapreduce.TestLoadIncrementalHFiles
Tests run: 6, Failures: 0, Errors: 0, Skipped: 0, Time elapsed: 32.518 sec
Forking command line: /bin/sh -c cd <https://builds.apache.org/job/HBase-0.92/ws/trunk>
&& /home/jenkins/tools/java/jdk1.6.0_27-32/jre/bin/java -enableassertions -Xmx1400m
-jar <https://builds.apache.org/job/HBase-0.92/ws/trunk/target/surefire/surefirebooter4552240733124034328.jar>
<https://builds.apache.org/job/HBase-0.92/ws/trunk/target/surefire/surefire6401603440177735779tmp>
<https://builds.apache.org/job/HBase-0.92/ws/trunk/target/surefire/surefire8757963812722299148tmp>
Running org.apache.hadoop.hbase.TestHRegionLocation
Tests run: 3, Failures: 0, Errors: 0, Skipped: 0, Time elapsed: 0.14 sec

Results :

Failed tests:   testMasterFailoverWithMockedRITOnDeadRS(org.apache.hadoop.hbase.master.TestMasterFailover):
region=enabledTable,bbb,1320413618216.84f786e8ebc7ca70afbe3b948c87f36c.

Tests run: 1046, Failures: 1, Errors: 0, Skipped: 10

[INFO] ------------------------------------------------------------------------
[INFO] BUILD FAILURE
[INFO] ------------------------------------------------------------------------
[INFO] Total time: 1:38:10.131s
[INFO] Finished at: Fri Nov 04 14:37:16 UTC 2011
[INFO] Final Memory: 36M/610M
[INFO] ------------------------------------------------------------------------
[ERROR] Failed to execute goal org.apache.maven.plugins:maven-surefire-plugin:2.9:test (default-test)
on project hbase: There are test failures.
[ERROR] 
[ERROR] Please refer to <https://builds.apache.org/job/HBase-0.92/ws/trunk/target/surefire-reports>
for the individual test results.
[ERROR] -> [Help 1]
org.apache.maven.lifecycle.LifecycleExecutionException: Failed to execute goal org.apache.maven.plugins:maven-surefire-plugin:2.9:test
(default-test) on project hbase: There are test failures.

Please refer to <https://builds.apache.org/job/HBase-0.92/ws/trunk/target/surefire-reports>
for the individual test results.
	at org.apache.maven.lifecycle.internal.MojoExecutor.execute(MojoExecutor.java:213)
	at org.apache.maven.lifecycle.internal.MojoExecutor.execute(MojoExecutor.java:153)
	at org.apache.maven.lifecycle.internal.MojoExecutor.execute(MojoExecutor.java:145)
	at org.apache.maven.lifecycle.internal.MojoExecutor.executeForkedExecutions(MojoExecutor.java:365)
	at org.apache.maven.lifecycle.internal.MojoExecutor.execute(MojoExecutor.java:199)
	at org.apache.maven.lifecycle.internal.MojoExecutor.execute(MojoExecutor.java:153)
	at org.apache.maven.lifecycle.internal.MojoExecutor.execute(MojoExecutor.java:145)
	at org.apache.maven.lifecycle.internal.LifecycleModuleBuilder.buildProject(LifecycleModuleBuilder.java:84)
	at org.apache.maven.lifecycle.internal.LifecycleModuleBuilder.buildProject(LifecycleModuleBuilder.java:59)
	at org.apache.maven.lifecycle.internal.LifecycleStarter.singleThreadedBuild(LifecycleStarter.java:183)
	at org.apache.maven.lifecycle.internal.LifecycleStarter.execute(LifecycleStarter.java:161)
	at org.apache.maven.DefaultMaven.doExecute(DefaultMaven.java:319)
	at org.apache.maven.DefaultMaven.execute(DefaultMaven.java:156)
	at org.apache.maven.cli.MavenCli.execute(MavenCli.java:537)
	at org.apache.maven.cli.MavenCli.doMain(MavenCli.java:196)
	at org.apache.maven.cli.MavenCli.main(MavenCli.java:141)
	at sun.reflect.NativeMethodAccessorImpl.invoke0(Native Method)
	at sun.reflect.NativeMethodAccessorImpl.invoke(NativeMethodAccessorImpl.java:39)
	at sun.reflect.DelegatingMethodAccessorImpl.invoke(DelegatingMethodAccessorImpl.java:25)
	at java.lang.reflect.Method.invoke(Method.java:597)
	at org.codehaus.plexus.classworlds.launcher.Launcher.launchEnhanced(Launcher.java:290)
	at org.codehaus.plexus.classworlds.launcher.Launcher.launch(Launcher.java:230)
	at org.codehaus.plexus.classworlds.launcher.Launcher.mainWithExitCode(Launcher.java:409)
	at org.codehaus.plexus.classworlds.launcher.Launcher.main(Launcher.java:352)
Caused by: org.apache.maven.plugin.MojoFailureException: There are test failures.

Please refer to <https://builds.apache.org/job/HBase-0.92/ws/trunk/target/surefire-reports>
for the individual test results.
	at org.apache.maven.plugin.surefire.SurefireHelper.reportExecution(SurefireHelper.java:87)
	at org.apache.maven.plugin.surefire.SurefirePlugin.writeSummary(SurefirePlugin.java:631)
	at org.apache.maven.plugin.surefire.SurefirePlugin.handleSummary(SurefirePlugin.java:605)
	at org.apache.maven.plugin.surefire.AbstractSurefireMojo.executeAfterPreconditionsChecked(AbstractSurefireMojo.java:136)
	at org.apache.maven.plugin.surefire.AbstractSurefireMojo.execute(AbstractSurefireMojo.java:97)
	at org.apache.maven.plugin.DefaultBuildPluginManager.executeMojo(DefaultBuildPluginManager.java:101)
	at org.apache.maven.lifecycle.internal.MojoExecutor.execute(MojoExecutor.java:209)
	... 23 more
[ERROR] 
[ERROR] 
[ERROR] For more information about the errors and possible solutions, please read the following
articles:
[ERROR] [Help 1] http://cwiki.apache.org/confluence/display/MAVEN/MojoFailureException
Build step 'Invoke top-level Maven targets' marked build as failure
[locks-and-latches] Releasing all the locks
[locks-and-latches] All the locks released
Archiving artifacts
Recording test results


Mime
View raw message