hbase-dev mailing list archives

Site index · List index
Message view « Date » · « Thread »
Top « Date » · « Thread »
From Apache Jenkins Server <jenk...@builds.apache.org>
Subject Build failed in Jenkins: HBase-0.92-security #20
Date Mon, 28 Nov 2011 07:35:44 GMT
See <https://builds.apache.org/job/HBase-0.92-security/20/changes>

Changes:

[tedyu] HBASE-4862  Splitting hlog and opening region concurrently may cause data loss
               (Chunhui Shen) move JIRA to 0.90 section in CHANGES.txt

[tedyu] HBASE-4862  Splitting hlog and opening region concurrently may cause data loss
               (Chunhui Shen)

------------------------------------------
[...truncated 6705 lines...]
Running org.apache.hadoop.hbase.regionserver.TestFSErrorsExposed
Tests run: 3, Failures: 0, Errors: 0, Skipped: 0, Time elapsed: 36.984 sec
Forking command line: /bin/sh -c cd <https://builds.apache.org/job/HBase-0.92-security/ws/trunk>
&& /home/hudson/tools/java/jdk1.6.0_27-32/jre/bin/java -enableassertions -Xmx1400m
-Djava.security.egd=file:/dev/./urandom -jar <https://builds.apache.org/job/HBase-0.92-security/ws/trunk/target/surefire/surefirebooter3170497341917163883.jar>
<https://builds.apache.org/job/HBase-0.92-security/ws/trunk/target/surefire/surefire1703762806194328307tmp>
<https://builds.apache.org/job/HBase-0.92-security/ws/trunk/target/surefire/surefire6300679265304957479tmp>
Running org.apache.hadoop.hbase.regionserver.TestKeyValueScanFixture
Tests run: 1, Failures: 0, Errors: 0, Skipped: 0, Time elapsed: 0.115 sec
Forking command line: /bin/sh -c cd <https://builds.apache.org/job/HBase-0.92-security/ws/trunk>
&& /home/hudson/tools/java/jdk1.6.0_27-32/jre/bin/java -enableassertions -Xmx1400m
-Djava.security.egd=file:/dev/./urandom -jar <https://builds.apache.org/job/HBase-0.92-security/ws/trunk/target/surefire/surefirebooter4591845452866502683.jar>
<https://builds.apache.org/job/HBase-0.92-security/ws/trunk/target/surefire/surefire7676594084641276429tmp>
<https://builds.apache.org/job/HBase-0.92-security/ws/trunk/target/surefire/surefire6449192738991576747tmp>
Running org.apache.hadoop.hbase.regionserver.TestStoreFile
Tests run: 8, Failures: 0, Errors: 0, Skipped: 0, Time elapsed: 1.759 sec
Forking command line: /bin/sh -c cd <https://builds.apache.org/job/HBase-0.92-security/ws/trunk>
&& /home/hudson/tools/java/jdk1.6.0_27-32/jre/bin/java -enableassertions -Xmx1400m
-Djava.security.egd=file:/dev/./urandom -jar <https://builds.apache.org/job/HBase-0.92-security/ws/trunk/target/surefire/surefirebooter5301477460246306539.jar>
<https://builds.apache.org/job/HBase-0.92-security/ws/trunk/target/surefire/surefire2693310709587951601tmp>
<https://builds.apache.org/job/HBase-0.92-security/ws/trunk/target/surefire/surefire7863916046514387368tmp>
Running org.apache.hadoop.hbase.regionserver.TestKeyValueSkipListSet
Tests run: 4, Failures: 0, Errors: 0, Skipped: 0, Time elapsed: 0.121 sec
Forking command line: /bin/sh -c cd <https://builds.apache.org/job/HBase-0.92-security/ws/trunk>
&& /home/hudson/tools/java/jdk1.6.0_27-32/jre/bin/java -enableassertions -Xmx1400m
-Djava.security.egd=file:/dev/./urandom -jar <https://builds.apache.org/job/HBase-0.92-security/ws/trunk/target/surefire/surefirebooter8539770787496271850.jar>
<https://builds.apache.org/job/HBase-0.92-security/ws/trunk/target/surefire/surefire1827621038138880115tmp>
<https://builds.apache.org/job/HBase-0.92-security/ws/trunk/target/surefire/surefire7280607473928790431tmp>
Running org.apache.hadoop.hbase.regionserver.TestExplicitColumnTracker
Tests run: 4, Failures: 0, Errors: 0, Skipped: 0, Time elapsed: 0.901 sec
Forking command line: /bin/sh -c cd <https://builds.apache.org/job/HBase-0.92-security/ws/trunk>
&& /home/hudson/tools/java/jdk1.6.0_27-32/jre/bin/java -enableassertions -Xmx1400m
-Djava.security.egd=file:/dev/./urandom -jar <https://builds.apache.org/job/HBase-0.92-security/ws/trunk/target/surefire/surefirebooter9196151753054252067.jar>
<https://builds.apache.org/job/HBase-0.92-security/ws/trunk/target/surefire/surefire2648295108676413513tmp>
<https://builds.apache.org/job/HBase-0.92-security/ws/trunk/target/surefire/surefire6195676451560953222tmp>
Running org.apache.hadoop.hbase.regionserver.TestHRegionServerBulkLoad
Tests run: 1, Failures: 0, Errors: 0, Skipped: 0, Time elapsed: 55.234 sec
Forking command line: /bin/sh -c cd <https://builds.apache.org/job/HBase-0.92-security/ws/trunk>
&& /home/hudson/tools/java/jdk1.6.0_27-32/jre/bin/java -enableassertions -Xmx1400m
-Djava.security.egd=file:/dev/./urandom -jar <https://builds.apache.org/job/HBase-0.92-security/ws/trunk/target/surefire/surefirebooter6035213642547743917.jar>
<https://builds.apache.org/job/HBase-0.92-security/ws/trunk/target/surefire/surefire1975859575128599469tmp>
<https://builds.apache.org/job/HBase-0.92-security/ws/trunk/target/surefire/surefire8179640873141115379tmp>
Running org.apache.hadoop.hbase.regionserver.TestMemStoreLAB
Tests run: 3, Failures: 0, Errors: 0, Skipped: 0, Time elapsed: 1.379 sec
Forking command line: /bin/sh -c cd <https://builds.apache.org/job/HBase-0.92-security/ws/trunk>
&& /home/hudson/tools/java/jdk1.6.0_27-32/jre/bin/java -enableassertions -Xmx1400m
-Djava.security.egd=file:/dev/./urandom -jar <https://builds.apache.org/job/HBase-0.92-security/ws/trunk/target/surefire/surefirebooter7921407389486081908.jar>
<https://builds.apache.org/job/HBase-0.92-security/ws/trunk/target/surefire/surefire2468445994114946473tmp>
<https://builds.apache.org/job/HBase-0.92-security/ws/trunk/target/surefire/surefire5003101133160100890tmp>
Running org.apache.hadoop.hbase.regionserver.TestSplitLogWorker
Tests run: 5, Failures: 0, Errors: 0, Skipped: 0, Time elapsed: 2.719 sec
Forking command line: /bin/sh -c cd <https://builds.apache.org/job/HBase-0.92-security/ws/trunk>
&& /home/hudson/tools/java/jdk1.6.0_27-32/jre/bin/java -enableassertions -Xmx1400m
-Djava.security.egd=file:/dev/./urandom -jar <https://builds.apache.org/job/HBase-0.92-security/ws/trunk/target/surefire/surefirebooter4073251664503961226.jar>
<https://builds.apache.org/job/HBase-0.92-security/ws/trunk/target/surefire/surefire5970277849262852572tmp>
<https://builds.apache.org/job/HBase-0.92-security/ws/trunk/target/surefire/surefire7918041783493358040tmp>
Running org.apache.hadoop.hbase.regionserver.TestMultiColumnScanner
Tests run: 6, Failures: 0, Errors: 0, Skipped: 0, Time elapsed: 18.668 sec
Forking command line: /bin/sh -c cd <https://builds.apache.org/job/HBase-0.92-security/ws/trunk>
&& /home/hudson/tools/java/jdk1.6.0_27-32/jre/bin/java -enableassertions -Xmx1400m
-Djava.security.egd=file:/dev/./urandom -jar <https://builds.apache.org/job/HBase-0.92-security/ws/trunk/target/surefire/surefirebooter478010736736505301.jar>
<https://builds.apache.org/job/HBase-0.92-security/ws/trunk/target/surefire/surefire2485602963801461428tmp>
<https://builds.apache.org/job/HBase-0.92-security/ws/trunk/target/surefire/surefire6301129589078590944tmp>
Running org.apache.hadoop.hbase.regionserver.TestSplitTransaction
Tests run: 6, Failures: 0, Errors: 0, Skipped: 0, Time elapsed: 3.853 sec
Forking command line: /bin/sh -c cd <https://builds.apache.org/job/HBase-0.92-security/ws/trunk>
&& /home/hudson/tools/java/jdk1.6.0_27-32/jre/bin/java -enableassertions -Xmx1400m
-Djava.security.egd=file:/dev/./urandom -jar <https://builds.apache.org/job/HBase-0.92-security/ws/trunk/target/surefire/surefirebooter6174100385388629475.jar>
<https://builds.apache.org/job/HBase-0.92-security/ws/trunk/target/surefire/surefire2087110220323437566tmp>
<https://builds.apache.org/job/HBase-0.92-security/ws/trunk/target/surefire/surefire6770347664011902524tmp>
Running org.apache.hadoop.hbase.regionserver.TestCompoundBloomFilter
Tests run: 3, Failures: 0, Errors: 0, Skipped: 0, Time elapsed: 22.135 sec
Forking command line: /bin/sh -c cd <https://builds.apache.org/job/HBase-0.92-security/ws/trunk>
&& /home/hudson/tools/java/jdk1.6.0_27-32/jre/bin/java -enableassertions -Xmx1400m
-Djava.security.egd=file:/dev/./urandom -jar <https://builds.apache.org/job/HBase-0.92-security/ws/trunk/target/surefire/surefirebooter2666471830568388009.jar>
<https://builds.apache.org/job/HBase-0.92-security/ws/trunk/target/surefire/surefire8729884933287798218tmp>
<https://builds.apache.org/job/HBase-0.92-security/ws/trunk/target/surefire/surefire8228651012551778618tmp>
Running org.apache.hadoop.hbase.regionserver.TestEndToEndSplitTransaction
Tests run: 1, Failures: 0, Errors: 0, Skipped: 0, Time elapsed: 52.685 sec
Forking command line: /bin/sh -c cd <https://builds.apache.org/job/HBase-0.92-security/ws/trunk>
&& /home/hudson/tools/java/jdk1.6.0_27-32/jre/bin/java -enableassertions -Xmx1400m
-Djava.security.egd=file:/dev/./urandom -jar <https://builds.apache.org/job/HBase-0.92-security/ws/trunk/target/surefire/surefirebooter1456687726356076268.jar>
<https://builds.apache.org/job/HBase-0.92-security/ws/trunk/target/surefire/surefire4692025290311595033tmp>
<https://builds.apache.org/job/HBase-0.92-security/ws/trunk/target/surefire/surefire6192354631021057860tmp>
Running org.apache.hadoop.hbase.regionserver.TestWideScanner
Tests run: 1, Failures: 0, Errors: 0, Skipped: 0, Time elapsed: 1.966 sec
Forking command line: /bin/sh -c cd <https://builds.apache.org/job/HBase-0.92-security/ws/trunk>
&& /home/hudson/tools/java/jdk1.6.0_27-32/jre/bin/java -enableassertions -Xmx1400m
-Djava.security.egd=file:/dev/./urandom -jar <https://builds.apache.org/job/HBase-0.92-security/ws/trunk/target/surefire/surefirebooter7329122502071886969.jar>
<https://builds.apache.org/job/HBase-0.92-security/ws/trunk/target/surefire/surefire7347849391361298728tmp>
<https://builds.apache.org/job/HBase-0.92-security/ws/trunk/target/surefire/surefire5158439790155708402tmp>
Running org.apache.hadoop.hbase.regionserver.TestHRegion
Tests run: 57, Failures: 0, Errors: 0, Skipped: 0, Time elapsed: 41.57 sec
Forking command line: /bin/sh -c cd <https://builds.apache.org/job/HBase-0.92-security/ws/trunk>
&& /home/hudson/tools/java/jdk1.6.0_27-32/jre/bin/java -enableassertions -Xmx1400m
-Djava.security.egd=file:/dev/./urandom -jar <https://builds.apache.org/job/HBase-0.92-security/ws/trunk/target/surefire/surefirebooter5823192595697320239.jar>
<https://builds.apache.org/job/HBase-0.92-security/ws/trunk/target/surefire/surefire7916256414376714037tmp>
<https://builds.apache.org/job/HBase-0.92-security/ws/trunk/target/surefire/surefire7348344417978986975tmp>
Running org.apache.hadoop.hbase.regionserver.TestMinVersions
Tests run: 6, Failures: 0, Errors: 0, Skipped: 0, Time elapsed: 1.239 sec
Forking command line: /bin/sh -c cd <https://builds.apache.org/job/HBase-0.92-security/ws/trunk>
&& /home/hudson/tools/java/jdk1.6.0_27-32/jre/bin/java -enableassertions -Xmx1400m
-Djava.security.egd=file:/dev/./urandom -jar <https://builds.apache.org/job/HBase-0.92-security/ws/trunk/target/surefire/surefirebooter4308425569521123145.jar>
<https://builds.apache.org/job/HBase-0.92-security/ws/trunk/target/surefire/surefire2383892197870254522tmp>
<https://builds.apache.org/job/HBase-0.92-security/ws/trunk/target/surefire/surefire5257944666029642791tmp>
Running org.apache.hadoop.hbase.client.TestGet
Tests run: 2, Failures: 0, Errors: 0, Skipped: 0, Time elapsed: 0.138 sec
Forking command line: /bin/sh -c cd <https://builds.apache.org/job/HBase-0.92-security/ws/trunk>
&& /home/hudson/tools/java/jdk1.6.0_27-32/jre/bin/java -enableassertions -Xmx1400m
-Djava.security.egd=file:/dev/./urandom -jar <https://builds.apache.org/job/HBase-0.92-security/ws/trunk/target/surefire/surefirebooter5255863130517874606.jar>
<https://builds.apache.org/job/HBase-0.92-security/ws/trunk/target/surefire/surefire7782458927355073245tmp>
<https://builds.apache.org/job/HBase-0.92-security/ws/trunk/target/surefire/surefire3742688182880811912tmp>
Running org.apache.hadoop.hbase.client.TestAttributes
Tests run: 3, Failures: 0, Errors: 0, Skipped: 0, Time elapsed: 0.14 sec
Forking command line: /bin/sh -c cd <https://builds.apache.org/job/HBase-0.92-security/ws/trunk>
&& /home/hudson/tools/java/jdk1.6.0_27-32/jre/bin/java -enableassertions -Xmx1400m
-Djava.security.egd=file:/dev/./urandom -jar <https://builds.apache.org/job/HBase-0.92-security/ws/trunk/target/surefire/surefirebooter2539081358067655092.jar>
<https://builds.apache.org/job/HBase-0.92-security/ws/trunk/target/surefire/surefire8110616343294496509tmp>
<https://builds.apache.org/job/HBase-0.92-security/ws/trunk/target/surefire/surefire6919556251016859143tmp>
Running org.apache.hadoop.hbase.client.TestResult
Tests run: 3, Failures: 0, Errors: 0, Skipped: 0, Time elapsed: 0.143 sec
Forking command line: /bin/sh -c cd <https://builds.apache.org/job/HBase-0.92-security/ws/trunk>
&& /home/hudson/tools/java/jdk1.6.0_27-32/jre/bin/java -enableassertions -Xmx1400m
-Djava.security.egd=file:/dev/./urandom -jar <https://builds.apache.org/job/HBase-0.92-security/ws/trunk/target/surefire/surefirebooter2175619191606422498.jar>
<https://builds.apache.org/job/HBase-0.92-security/ws/trunk/target/surefire/surefire7856751152447853797tmp>
<https://builds.apache.org/job/HBase-0.92-security/ws/trunk/target/surefire/surefire5351756212501975995tmp>
Running org.apache.hadoop.hbase.client.replication.TestReplicationAdmin
Tests run: 1, Failures: 0, Errors: 0, Skipped: 0, Time elapsed: 1.232 sec
Forking command line: /bin/sh -c cd <https://builds.apache.org/job/HBase-0.92-security/ws/trunk>
&& /home/hudson/tools/java/jdk1.6.0_27-32/jre/bin/java -enableassertions -Xmx1400m
-Djava.security.egd=file:/dev/./urandom -jar <https://builds.apache.org/job/HBase-0.92-security/ws/trunk/target/surefire/surefirebooter6293813394078945507.jar>
<https://builds.apache.org/job/HBase-0.92-security/ws/trunk/target/surefire/surefire7722891109299165904tmp>
<https://builds.apache.org/job/HBase-0.92-security/ws/trunk/target/surefire/surefire8569924689649084648tmp>
Running org.apache.hadoop.hbase.client.TestTimestampsFilter
Tests run: 3, Failures: 0, Errors: 0, Skipped: 0, Time elapsed: 39.87 sec
Forking command line: /bin/sh -c cd <https://builds.apache.org/job/HBase-0.92-security/ws/trunk>
&& /home/hudson/tools/java/jdk1.6.0_27-32/jre/bin/java -enableassertions -Xmx1400m
-Djava.security.egd=file:/dev/./urandom -jar <https://builds.apache.org/job/HBase-0.92-security/ws/trunk/target/surefire/surefirebooter69004446526683479.jar>
<https://builds.apache.org/job/HBase-0.92-security/ws/trunk/target/surefire/surefire1142178010897756527tmp>
<https://builds.apache.org/job/HBase-0.92-security/ws/trunk/target/surefire/surefire5867030466590433541tmp>
Running org.apache.hadoop.hbase.client.TestMultipleTimestamps
Tests run: 8, Failures: 0, Errors: 0, Skipped: 0, Time elapsed: 74.143 sec
Forking command line: /bin/sh -c cd <https://builds.apache.org/job/HBase-0.92-security/ws/trunk>
&& /home/hudson/tools/java/jdk1.6.0_27-32/jre/bin/java -enableassertions -Xmx1400m
-Djava.security.egd=file:/dev/./urandom -jar <https://builds.apache.org/job/HBase-0.92-security/ws/trunk/target/surefire/surefirebooter3382905566149725831.jar>
<https://builds.apache.org/job/HBase-0.92-security/ws/trunk/target/surefire/surefire3942350678913238019tmp>
<https://builds.apache.org/job/HBase-0.92-security/ws/trunk/target/surefire/surefire189421965166878815tmp>
Running org.apache.hadoop.hbase.client.TestFromClientSide
Tests run: 46, Failures: 0, Errors: 0, Skipped: 3, Time elapsed: 189.856 sec
Forking command line: /bin/sh -c cd <https://builds.apache.org/job/HBase-0.92-security/ws/trunk>
&& /home/hudson/tools/java/jdk1.6.0_27-32/jre/bin/java -enableassertions -Xmx1400m
-Djava.security.egd=file:/dev/./urandom -jar <https://builds.apache.org/job/HBase-0.92-security/ws/trunk/target/surefire/surefirebooter2420955037520169369.jar>
<https://builds.apache.org/job/HBase-0.92-security/ws/trunk/target/surefire/surefire1806497826761752898tmp>
<https://builds.apache.org/job/HBase-0.92-security/ws/trunk/target/surefire/surefire3816289600247517171tmp>
Running org.apache.hadoop.hbase.client.TestHCM
Tests run: 5, Failures: 0, Errors: 0, Skipped: 0, Time elapsed: 30.98 sec
Forking command line: /bin/sh -c cd <https://builds.apache.org/job/HBase-0.92-security/ws/trunk>
&& /home/hudson/tools/java/jdk1.6.0_27-32/jre/bin/java -enableassertions -Xmx1400m
-Djava.security.egd=file:/dev/./urandom -jar <https://builds.apache.org/job/HBase-0.92-security/ws/trunk/target/surefire/surefirebooter2504215375424927890.jar>
<https://builds.apache.org/job/HBase-0.92-security/ws/trunk/target/surefire/surefire5126619210465537070tmp>
<https://builds.apache.org/job/HBase-0.92-security/ws/trunk/target/surefire/surefire3431283967129327718tmp>
Running org.apache.hadoop.hbase.client.TestHTablePool
Tests run: 18, Failures: 0, Errors: 0, Skipped: 0, Time elapsed: 33.664 sec
Forking command line: /bin/sh -c cd <https://builds.apache.org/job/HBase-0.92-security/ws/trunk>
&& /home/hudson/tools/java/jdk1.6.0_27-32/jre/bin/java -enableassertions -Xmx1400m
-Djava.security.egd=file:/dev/./urandom -jar <https://builds.apache.org/job/HBase-0.92-security/ws/trunk/target/surefire/surefirebooter6119389936171044307.jar>
<https://builds.apache.org/job/HBase-0.92-security/ws/trunk/target/surefire/surefire7670346831363924566tmp>
<https://builds.apache.org/job/HBase-0.92-security/ws/trunk/target/surefire/surefire3834279221167756692tmp>
Running org.apache.hadoop.hbase.client.TestHTableUtil
Tests run: 2, Failures: 0, Errors: 0, Skipped: 0, Time elapsed: 27.169 sec
Forking command line: /bin/sh -c cd <https://builds.apache.org/job/HBase-0.92-security/ws/trunk>
&& /home/hudson/tools/java/jdk1.6.0_27-32/jre/bin/java -enableassertions -Xmx1400m
-Djava.security.egd=file:/dev/./urandom -jar <https://builds.apache.org/job/HBase-0.92-security/ws/trunk/target/surefire/surefirebooter8593069926161455590.jar>
<https://builds.apache.org/job/HBase-0.92-security/ws/trunk/target/surefire/surefire7501654787292276552tmp>
<https://builds.apache.org/job/HBase-0.92-security/ws/trunk/target/surefire/surefire2834479271759765607tmp>
Running org.apache.hadoop.hbase.client.TestScan
Tests run: 2, Failures: 0, Errors: 0, Skipped: 0, Time elapsed: 0.142 sec
Forking command line: /bin/sh -c cd <https://builds.apache.org/job/HBase-0.92-security/ws/trunk>
&& /home/hudson/tools/java/jdk1.6.0_27-32/jre/bin/java -enableassertions -Xmx1400m
-Djava.security.egd=file:/dev/./urandom -jar <https://builds.apache.org/job/HBase-0.92-security/ws/trunk/target/surefire/surefirebooter8934267163616962674.jar>
<https://builds.apache.org/job/HBase-0.92-security/ws/trunk/target/surefire/surefire6805244638019521319tmp>
<https://builds.apache.org/job/HBase-0.92-security/ws/trunk/target/surefire/surefire4263977234551658773tmp>
Running org.apache.hadoop.hbase.client.TestAdmin
Tests run: 34, Failures: 0, Errors: 0, Skipped: 0, Time elapsed: 584.662 sec
Forking command line: /bin/sh -c cd <https://builds.apache.org/job/HBase-0.92-security/ws/trunk>
&& /home/hudson/tools/java/jdk1.6.0_27-32/jre/bin/java -enableassertions -Xmx1400m
-Djava.security.egd=file:/dev/./urandom -jar <https://builds.apache.org/job/HBase-0.92-security/ws/trunk/target/surefire/surefirebooter9101118724618787693.jar>
<https://builds.apache.org/job/HBase-0.92-security/ws/trunk/target/surefire/surefire6721904855047525440tmp>
<https://builds.apache.org/job/HBase-0.92-security/ws/trunk/target/surefire/surefire4519850446979670251tmp>
Running org.apache.hadoop.hbase.client.TestMetaScanner
Tests run: 1, Failures: 0, Errors: 0, Skipped: 0, Time elapsed: 28.322 sec
Forking command line: /bin/sh -c cd <https://builds.apache.org/job/HBase-0.92-security/ws/trunk>
&& /home/hudson/tools/java/jdk1.6.0_27-32/jre/bin/java -enableassertions -Xmx1400m
-Djava.security.egd=file:/dev/./urandom -jar <https://builds.apache.org/job/HBase-0.92-security/ws/trunk/target/surefire/surefirebooter7265995068220346600.jar>
<https://builds.apache.org/job/HBase-0.92-security/ws/trunk/target/surefire/surefire2455585956921179016tmp>
<https://builds.apache.org/job/HBase-0.92-security/ws/trunk/target/surefire/surefire4291821765353640097tmp>
Running org.apache.hadoop.hbase.client.TestShell
Tests run: 1, Failures: 0, Errors: 0, Skipped: 0, Time elapsed: 125.437 sec
Forking command line: /bin/sh -c cd <https://builds.apache.org/job/HBase-0.92-security/ws/trunk>
&& /home/hudson/tools/java/jdk1.6.0_27-32/jre/bin/java -enableassertions -Xmx1400m
-Djava.security.egd=file:/dev/./urandom -jar <https://builds.apache.org/job/HBase-0.92-security/ws/trunk/target/surefire/surefirebooter4280420727541416234.jar>
<https://builds.apache.org/job/HBase-0.92-security/ws/trunk/target/surefire/surefire5736600429174119903tmp>
<https://builds.apache.org/job/HBase-0.92-security/ws/trunk/target/surefire/surefire3802607622071816488tmp>
Running org.apache.hadoop.hbase.client.TestScannerTimeout
Tests run: 4, Failures: 0, Errors: 0, Skipped: 0, Time elapsed: 58.169 sec
Forking command line: /bin/sh -c cd <https://builds.apache.org/job/HBase-0.92-security/ws/trunk>
&& /home/hudson/tools/java/jdk1.6.0_27-32/jre/bin/java -enableassertions -Xmx1400m
-Djava.security.egd=file:/dev/./urandom -jar <https://builds.apache.org/job/HBase-0.92-security/ws/trunk/target/surefire/surefirebooter3344338640978401306.jar>
<https://builds.apache.org/job/HBase-0.92-security/ws/trunk/target/surefire/surefire7541402382958617635tmp>
<https://builds.apache.org/job/HBase-0.92-security/ws/trunk/target/surefire/surefire5315210784507363851tmp>
Running org.apache.hadoop.hbase.client.TestMetaMigrationRemovingHTD
Tests run: 3, Failures: 0, Errors: 0, Skipped: 0, Time elapsed: 34.355 sec
Forking command line: /bin/sh -c cd <https://builds.apache.org/job/HBase-0.92-security/ws/trunk>
&& /home/hudson/tools/java/jdk1.6.0_27-32/jre/bin/java -enableassertions -Xmx1400m
-Djava.security.egd=file:/dev/./urandom -jar <https://builds.apache.org/job/HBase-0.92-security/ws/trunk/target/surefire/surefirebooter3337575748003122874.jar>
<https://builds.apache.org/job/HBase-0.92-security/ws/trunk/target/surefire/surefire9056837363350467224tmp>
<https://builds.apache.org/job/HBase-0.92-security/ws/trunk/target/surefire/surefire1829900802162683250tmp>
Running org.apache.hadoop.hbase.client.TestOperation
Tests run: 1, Failures: 0, Errors: 0, Skipped: 0, Time elapsed: 0.569 sec
Forking command line: /bin/sh -c cd <https://builds.apache.org/job/HBase-0.92-security/ws/trunk>
&& /home/hudson/tools/java/jdk1.6.0_27-32/jre/bin/java -enableassertions -Xmx1400m
-Djava.security.egd=file:/dev/./urandom -jar <https://builds.apache.org/job/HBase-0.92-security/ws/trunk/target/surefire/surefirebooter4883433718363898296.jar>
<https://builds.apache.org/job/HBase-0.92-security/ws/trunk/target/surefire/surefire8523612258870644338tmp>
<https://builds.apache.org/job/HBase-0.92-security/ws/trunk/target/surefire/surefire3754757238144228796tmp>
Running org.apache.hadoop.hbase.client.TestMultiParallel
Tests run: 10, Failures: 0, Errors: 0, Skipped: 0, Time elapsed: 56.311 sec
Forking command line: /bin/sh -c cd <https://builds.apache.org/job/HBase-0.92-security/ws/trunk>
&& /home/hudson/tools/java/jdk1.6.0_27-32/jre/bin/java -enableassertions -Xmx1400m
-Djava.security.egd=file:/dev/./urandom -jar <https://builds.apache.org/job/HBase-0.92-security/ws/trunk/target/surefire/surefirebooter8425879843172719932.jar>
<https://builds.apache.org/job/HBase-0.92-security/ws/trunk/target/surefire/surefire6437271987450986408tmp>
<https://builds.apache.org/job/HBase-0.92-security/ws/trunk/target/surefire/surefire3287140463727738532tmp>
Running org.apache.hadoop.hbase.TestMultiVersions
Tests run: 3, Failures: 0, Errors: 0, Skipped: 0, Time elapsed: 41.883 sec
Forking command line: /bin/sh -c cd <https://builds.apache.org/job/HBase-0.92-security/ws/trunk>
&& /home/hudson/tools/java/jdk1.6.0_27-32/jre/bin/java -enableassertions -Xmx1400m
-Djava.security.egd=file:/dev/./urandom -jar <https://builds.apache.org/job/HBase-0.92-security/ws/trunk/target/surefire/surefirebooter3648001183477464968.jar>
<https://builds.apache.org/job/HBase-0.92-security/ws/trunk/target/surefire/surefire5279494794633099770tmp>
<https://builds.apache.org/job/HBase-0.92-security/ws/trunk/target/surefire/surefire8125371412733598614tmp>
Running org.apache.hadoop.hbase.thrift.TestThriftServer
Tests run: 1, Failures: 0, Errors: 0, Skipped: 0, Time elapsed: 30.384 sec
Forking command line: /bin/sh -c cd <https://builds.apache.org/job/HBase-0.92-security/ws/trunk>
&& /home/hudson/tools/java/jdk1.6.0_27-32/jre/bin/java -enableassertions -Xmx1400m
-Djava.security.egd=file:/dev/./urandom -jar <https://builds.apache.org/job/HBase-0.92-security/ws/trunk/target/surefire/surefirebooter8666382986247291953.jar>
<https://builds.apache.org/job/HBase-0.92-security/ws/trunk/target/surefire/surefire8257107437364454704tmp>
<https://builds.apache.org/job/HBase-0.92-security/ws/trunk/target/surefire/surefire2167579675365420451tmp>
Running org.apache.hadoop.hbase.master.TestRollingRestart
Tests run: 1, Failures: 0, Errors: 0, Skipped: 0, Time elapsed: 103.345 sec
Forking command line: /bin/sh -c cd <https://builds.apache.org/job/HBase-0.92-security/ws/trunk>
&& /home/hudson/tools/java/jdk1.6.0_27-32/jre/bin/java -enableassertions -Xmx1400m
-Djava.security.egd=file:/dev/./urandom -jar <https://builds.apache.org/job/HBase-0.92-security/ws/trunk/target/surefire/surefirebooter2650166304099503957.jar>
<https://builds.apache.org/job/HBase-0.92-security/ws/trunk/target/surefire/surefire1299807173474081514tmp>
<https://builds.apache.org/job/HBase-0.92-security/ws/trunk/target/surefire/surefire2640774488698371249tmp>
Running org.apache.hadoop.hbase.master.TestActiveMasterManager
Tests run: 2, Failures: 0, Errors: 0, Skipped: 0, Time elapsed: 1.022 sec
Forking command line: /bin/sh -c cd <https://builds.apache.org/job/HBase-0.92-security/ws/trunk>
&& /home/hudson/tools/java/jdk1.6.0_27-32/jre/bin/java -enableassertions -Xmx1400m
-Djava.security.egd=file:/dev/./urandom -jar <https://builds.apache.org/job/HBase-0.92-security/ws/trunk/target/surefire/surefirebooter1868343931698218947.jar>
<https://builds.apache.org/job/HBase-0.92-security/ws/trunk/target/surefire/surefire115267959324850362tmp>
<https://builds.apache.org/job/HBase-0.92-security/ws/trunk/target/surefire/surefire5364342125284913579tmp>
Running org.apache.hadoop.hbase.master.TestDeadServer
Tests run: 1, Failures: 0, Errors: 0, Skipped: 0, Time elapsed: 0.135 sec
Forking command line: /bin/sh -c cd <https://builds.apache.org/job/HBase-0.92-security/ws/trunk>
&& /home/hudson/tools/java/jdk1.6.0_27-32/jre/bin/java -enableassertions -Xmx1400m
-Djava.security.egd=file:/dev/./urandom -jar <https://builds.apache.org/job/HBase-0.92-security/ws/trunk/target/surefire/surefirebooter3818579745325886594.jar>
<https://builds.apache.org/job/HBase-0.92-security/ws/trunk/target/surefire/surefire2832399068875644233tmp>
<https://builds.apache.org/job/HBase-0.92-security/ws/trunk/target/surefire/surefire5565465165457617257tmp>
Running org.apache.hadoop.hbase.master.TestLogsCleaner
Tests run: 1, Failures: 0, Errors: 0, Skipped: 0, Time elapsed: 3.378 sec
Forking command line: /bin/sh -c cd <https://builds.apache.org/job/HBase-0.92-security/ws/trunk>
&& /home/hudson/tools/java/jdk1.6.0_27-32/jre/bin/java -enableassertions -Xmx1400m
-Djava.security.egd=file:/dev/./urandom -jar <https://builds.apache.org/job/HBase-0.92-security/ws/trunk/target/surefire/surefirebooter6614561159038261619.jar>
<https://builds.apache.org/job/HBase-0.92-security/ws/trunk/target/surefire/surefire8994624593398075241tmp>
<https://builds.apache.org/job/HBase-0.92-security/ws/trunk/target/surefire/surefire2784821486100044161tmp>
Running org.apache.hadoop.hbase.master.TestZKBasedOpenCloseRegion
Tests run: 3, Failures: 0, Errors: 0, Skipped: 0, Time elapsed: 34.905 sec
Forking command line: /bin/sh -c cd <https://builds.apache.org/job/HBase-0.92-security/ws/trunk>
&& /home/hudson/tools/java/jdk1.6.0_27-32/jre/bin/java -enableassertions -Xmx1400m
-Djava.security.egd=file:/dev/./urandom -jar <https://builds.apache.org/job/HBase-0.92-security/ws/trunk/target/surefire/surefirebooter8902826578448884936.jar>
<https://builds.apache.org/job/HBase-0.92-security/ws/trunk/target/surefire/surefire4629882105241387645tmp>
<https://builds.apache.org/job/HBase-0.92-security/ws/trunk/target/surefire/surefire1125024428688389854tmp>
Running org.apache.hadoop.hbase.master.TestMaster
Tests run: 1, Failures: 0, Errors: 0, Skipped: 0, Time elapsed: 26.362 sec
Forking command line: /bin/sh -c cd <https://builds.apache.org/job/HBase-0.92-security/ws/trunk>
&& /home/hudson/tools/java/jdk1.6.0_27-32/jre/bin/java -enableassertions -Xmx1400m
-Djava.security.egd=file:/dev/./urandom -jar <https://builds.apache.org/job/HBase-0.92-security/ws/trunk/target/surefire/surefirebooter5226669606721194252.jar>
<https://builds.apache.org/job/HBase-0.92-security/ws/trunk/target/surefire/surefire1803758941446115571tmp>
<https://builds.apache.org/job/HBase-0.92-security/ws/trunk/target/surefire/surefire8916466193585190666tmp>
Running org.apache.hadoop.hbase.master.TestMasterTransitions
Tests run: 3, Failures: 0, Errors: 0, Skipped: 3, Time elapsed: 37.791 sec
Forking command line: /bin/sh -c cd <https://builds.apache.org/job/HBase-0.92-security/ws/trunk>
&& /home/hudson/tools/java/jdk1.6.0_27-32/jre/bin/java -enableassertions -Xmx1400m
-Djava.security.egd=file:/dev/./urandom -jar <https://builds.apache.org/job/HBase-0.92-security/ws/trunk/target/surefire/surefirebooter4050360680961457449.jar>
<https://builds.apache.org/job/HBase-0.92-security/ws/trunk/target/surefire/surefire8106956331690655385tmp>
<https://builds.apache.org/job/HBase-0.92-security/ws/trunk/target/surefire/surefire1184284032560059320tmp>
Running org.apache.hadoop.hbase.master.TestOpenedRegionHandler
Tests run: 2, Failures: 0, Errors: 0, Skipped: 0, Time elapsed: 33.54 sec
Forking command line: /bin/sh -c cd <https://builds.apache.org/job/HBase-0.92-security/ws/trunk>
&& /home/hudson/tools/java/jdk1.6.0_27-32/jre/bin/java -enableassertions -Xmx1400m
-Djava.security.egd=file:/dev/./urandom -jar <https://builds.apache.org/job/HBase-0.92-security/ws/trunk/target/surefire/surefirebooter5925814574589609932.jar>
<https://builds.apache.org/job/HBase-0.92-security/ws/trunk/target/surefire/surefire5917548545316858420tmp>
<https://builds.apache.org/job/HBase-0.92-security/ws/trunk/target/surefire/surefire3960240684762034392tmp>
Running org.apache.hadoop.hbase.master.TestClockSkewDetection
Tests run: 1, Failures: 0, Errors: 0, Skipped: 0, Time elapsed: 0.243 sec
Forking command line: /bin/sh -c cd <https://builds.apache.org/job/HBase-0.92-security/ws/trunk>
&& /home/hudson/tools/java/jdk1.6.0_27-32/jre/bin/java -enableassertions -Xmx1400m
-Djava.security.egd=file:/dev/./urandom -jar <https://builds.apache.org/job/HBase-0.92-security/ws/trunk/target/surefire/surefirebooter4649985716164619812.jar>
<https://builds.apache.org/job/HBase-0.92-security/ws/trunk/target/surefire/surefire5278815024878862034tmp>
<https://builds.apache.org/job/HBase-0.92-security/ws/trunk/target/surefire/surefire7030268094227162231tmp>
Running org.apache.hadoop.hbase.master.TestCatalogJanitor
Tests run: 3, Failures: 0, Errors: 0, Skipped: 0, Time elapsed: 4.246 sec
Forking command line: /bin/sh -c cd <https://builds.apache.org/job/HBase-0.92-security/ws/trunk>
&& /home/hudson/tools/java/jdk1.6.0_27-32/jre/bin/java -enableassertions -Xmx1400m
-Djava.security.egd=file:/dev/./urandom -jar <https://builds.apache.org/job/HBase-0.92-security/ws/trunk/target/surefire/surefirebooter159324758319071190.jar>
<https://builds.apache.org/job/HBase-0.92-security/ws/trunk/target/surefire/surefire7334287743954768436tmp>
<https://builds.apache.org/job/HBase-0.92-security/ws/trunk/target/surefire/surefire8088184672550665507tmp>
Running org.apache.hadoop.hbase.master.TestSplitLogManager
Tests run: 10, Failures: 0, Errors: 0, Skipped: 0, Time elapsed: 14.021 sec
Forking command line: /bin/sh -c cd <https://builds.apache.org/job/HBase-0.92-security/ws/trunk>
&& /home/hudson/tools/java/jdk1.6.0_27-32/jre/bin/java -enableassertions -Xmx1400m
-Djava.security.egd=file:/dev/./urandom -jar <https://builds.apache.org/job/HBase-0.92-security/ws/trunk/target/surefire/surefirebooter3159936102717007916.jar>
<https://builds.apache.org/job/HBase-0.92-security/ws/trunk/target/surefire/surefire8459440604369571040tmp>
<https://builds.apache.org/job/HBase-0.92-security/ws/trunk/target/surefire/surefire6896871930384457628tmp>
Running org.apache.hadoop.hbase.master.TestMasterRestartAfterDisablingTable
Forking command line: /bin/sh -c cd <https://builds.apache.org/job/HBase-0.92-security/ws/trunk>
&& /home/hudson/tools/java/jdk1.6.0_27-32/jre/bin/java -enableassertions -Xmx1400m
-Djava.security.egd=file:/dev/./urandom -jar <https://builds.apache.org/job/HBase-0.92-security/ws/trunk/target/surefire/surefirebooter7915485398292888671.jar>
<https://builds.apache.org/job/HBase-0.92-security/ws/trunk/target/surefire/surefire5717574172225153706tmp>
<https://builds.apache.org/job/HBase-0.92-security/ws/trunk/target/surefire/surefire6751976563442034391tmp>
Running org.apache.hadoop.hbase.master.TestDistributedLogSplitting
Tests run: 4, Failures: 0, Errors: 0, Skipped: 0, Time elapsed: 209.916 sec
Forking command line: /bin/sh -c cd <https://builds.apache.org/job/HBase-0.92-security/ws/trunk>
&& /home/hudson/tools/java/jdk1.6.0_27-32/jre/bin/java -enableassertions -Xmx1400m
-Djava.security.egd=file:/dev/./urandom -jar <https://builds.apache.org/job/HBase-0.92-security/ws/trunk/target/surefire/surefirebooter1428785066856754731.jar>
<https://builds.apache.org/job/HBase-0.92-security/ws/trunk/target/surefire/surefire5090071930014556115tmp>
<https://builds.apache.org/job/HBase-0.92-security/ws/trunk/target/surefire/surefire4338848505903529821tmp>
Running org.apache.hadoop.hbase.master.TestDefaultLoadBalancer
Tests run: 4, Failures: 0, Errors: 0, Skipped: 0, Time elapsed: 1.555 sec
Forking command line: /bin/sh -c cd <https://builds.apache.org/job/HBase-0.92-security/ws/trunk>
&& /home/hudson/tools/java/jdk1.6.0_27-32/jre/bin/java -enableassertions -Xmx1400m
-Djava.security.egd=file:/dev/./urandom -jar <https://builds.apache.org/job/HBase-0.92-security/ws/trunk/target/surefire/surefirebooter6599074843653365997.jar>
<https://builds.apache.org/job/HBase-0.92-security/ws/trunk/target/surefire/surefire7002812870389602062tmp>
<https://builds.apache.org/job/HBase-0.92-security/ws/trunk/target/surefire/surefire5465567358453134820tmp>
Running org.apache.hadoop.hbase.master.TestMasterStatusServlet
Tests run: 5, Failures: 0, Errors: 0, Skipped: 0, Time elapsed: 1.194 sec
Forking command line: /bin/sh -c cd <https://builds.apache.org/job/HBase-0.92-security/ws/trunk>
&& /home/hudson/tools/java/jdk1.6.0_27-32/jre/bin/java -enableassertions -Xmx1400m
-Djava.security.egd=file:/dev/./urandom -jar <https://builds.apache.org/job/HBase-0.92-security/ws/trunk/target/surefire/surefirebooter7166554733602999460.jar>
<https://builds.apache.org/job/HBase-0.92-security/ws/trunk/target/surefire/surefire8395913518945268164tmp>
<https://builds.apache.org/job/HBase-0.92-security/ws/trunk/target/surefire/surefire5530635846100654321tmp>
Running org.apache.hadoop.hbase.master.TestHMasterRPCException
Tests run: 1, Failures: 0, Errors: 0, Skipped: 0, Time elapsed: 1.555 sec
Forking command line: /bin/sh -c cd <https://builds.apache.org/job/HBase-0.92-security/ws/trunk>
&& /home/hudson/tools/java/jdk1.6.0_27-32/jre/bin/java -enableassertions -Xmx1400m
-Djava.security.egd=file:/dev/./urandom -jar <https://builds.apache.org/job/HBase-0.92-security/ws/trunk/target/surefire/surefirebooter5117278412761220488.jar>
<https://builds.apache.org/job/HBase-0.92-security/ws/trunk/target/surefire/surefire5616886243831586826tmp>
<https://builds.apache.org/job/HBase-0.92-security/ws/trunk/target/surefire/surefire893139231866780370tmp>
Running org.apache.hadoop.hbase.master.TestMasterFailover
Tests run: 4, Failures: 0, Errors: 1, Skipped: 0, Time elapsed: 277.067 sec <<< FAILURE!
Forking command line: /bin/sh -c cd <https://builds.apache.org/job/HBase-0.92-security/ws/trunk>
&& /home/hudson/tools/java/jdk1.6.0_27-32/jre/bin/java -enableassertions -Xmx1400m
-Djava.security.egd=file:/dev/./urandom -jar <https://builds.apache.org/job/HBase-0.92-security/ws/trunk/target/surefire/surefirebooter4977085914991458366.jar>
<https://builds.apache.org/job/HBase-0.92-security/ws/trunk/target/surefire/surefire3887573983711599041tmp>
<https://builds.apache.org/job/HBase-0.92-security/ws/trunk/target/surefire/surefire6244283758564698571tmp>
Running org.apache.hadoop.hbase.master.TestRestartCluster
Tests run: 2, Failures: 0, Errors: 0, Skipped: 0, Time elapsed: 65.393 sec
Forking command line: /bin/sh -c cd <https://builds.apache.org/job/HBase-0.92-security/ws/trunk>
&& /home/hudson/tools/java/jdk1.6.0_27-32/jre/bin/java -enableassertions -Xmx1400m
-Djava.security.egd=file:/dev/./urandom -jar <https://builds.apache.org/job/HBase-0.92-security/ws/trunk/target/surefire/surefirebooter2793708878804795143.jar>
<https://builds.apache.org/job/HBase-0.92-security/ws/trunk/target/surefire/surefire9098744934505736432tmp>
<https://builds.apache.org/job/HBase-0.92-security/ws/trunk/target/surefire/surefire4896444070651744410tmp>
Running org.apache.hadoop.hbase.migration.TestMigrationFrom090To092
Tests run: 1, Failures: 0, Errors: 0, Skipped: 0, Time elapsed: 0.272 sec
Forking command line: /bin/sh -c cd <https://builds.apache.org/job/HBase-0.92-security/ws/trunk>
&& /home/hudson/tools/java/jdk1.6.0_27-32/jre/bin/java -enableassertions -Xmx1400m
-Djava.security.egd=file:/dev/./urandom -jar <https://builds.apache.org/job/HBase-0.92-security/ws/trunk/target/surefire/surefirebooter7683250133344602722.jar>
<https://builds.apache.org/job/HBase-0.92-security/ws/trunk/target/surefire/surefire8845092170764366652tmp>
<https://builds.apache.org/job/HBase-0.92-security/ws/trunk/target/surefire/surefire4095533414439297708tmp>
Running org.apache.hadoop.hbase.TestRegionRebalancing
Tests run: 1, Failures: 0, Errors: 0, Skipped: 0, Time elapsed: 56.203 sec
Forking command line: /bin/sh -c cd <https://builds.apache.org/job/HBase-0.92-security/ws/trunk>
&& /home/hudson/tools/java/jdk1.6.0_27-32/jre/bin/java -enableassertions -Xmx1400m
-Djava.security.egd=file:/dev/./urandom -jar <https://builds.apache.org/job/HBase-0.92-security/ws/trunk/target/surefire/surefirebooter9120145053996591512.jar>
<https://builds.apache.org/job/HBase-0.92-security/ws/trunk/target/surefire/surefire7418617126591709689tmp>
<https://builds.apache.org/job/HBase-0.92-security/ws/trunk/target/surefire/surefire823827541780351808tmp>
Running org.apache.hadoop.hbase.avro.TestAvroUtil
Tests run: 1, Failures: 0, Errors: 0, Skipped: 0, Time elapsed: 1.006 sec
Forking command line: /bin/sh -c cd <https://builds.apache.org/job/HBase-0.92-security/ws/trunk>
&& /home/hudson/tools/java/jdk1.6.0_27-32/jre/bin/java -enableassertions -Xmx1400m
-Djava.security.egd=file:/dev/./urandom -jar <https://builds.apache.org/job/HBase-0.92-security/ws/trunk/target/surefire/surefirebooter668529558860125846.jar>
<https://builds.apache.org/job/HBase-0.92-security/ws/trunk/target/surefire/surefire7863108446962861618tmp>
<https://builds.apache.org/job/HBase-0.92-security/ws/trunk/target/surefire/surefire814775706204863386tmp>
Running org.apache.hadoop.hbase.avro.TestAvroServer
Tests run: 3, Failures: 0, Errors: 0, Skipped: 0, Time elapsed: 41.012 sec
Forking command line: /bin/sh -c cd <https://builds.apache.org/job/HBase-0.92-security/ws/trunk>
&& /home/hudson/tools/java/jdk1.6.0_27-32/jre/bin/java -enableassertions -Xmx1400m
-Djava.security.egd=file:/dev/./urandom -jar <https://builds.apache.org/job/HBase-0.92-security/ws/trunk/target/surefire/surefirebooter1603482773897503487.jar>
<https://builds.apache.org/job/HBase-0.92-security/ws/trunk/target/surefire/surefire5835309296918481667tmp>
<https://builds.apache.org/job/HBase-0.92-security/ws/trunk/target/surefire/surefire2133176121129973863tmp>
Running org.apache.hadoop.hbase.TestAcidGuarantees
Tests run: 3, Failures: 0, Errors: 0, Skipped: 0, Time elapsed: 127.811 sec
Forking command line: /bin/sh -c cd <https://builds.apache.org/job/HBase-0.92-security/ws/trunk>
&& /home/hudson/tools/java/jdk1.6.0_27-32/jre/bin/java -enableassertions -Xmx1400m
-Djava.security.egd=file:/dev/./urandom -jar <https://builds.apache.org/job/HBase-0.92-security/ws/trunk/target/surefire/surefirebooter5277204302714875801.jar>
<https://builds.apache.org/job/HBase-0.92-security/ws/trunk/target/surefire/surefire35147666758299789tmp>
<https://builds.apache.org/job/HBase-0.92-security/ws/trunk/target/surefire/surefire3626823923423286468tmp>
Running org.apache.hadoop.hbase.TestHRegionLocation
Tests run: 3, Failures: 0, Errors: 0, Skipped: 0, Time elapsed: 0.142 sec
Forking command line: /bin/sh -c cd <https://builds.apache.org/job/HBase-0.92-security/ws/trunk>
&& /home/hudson/tools/java/jdk1.6.0_27-32/jre/bin/java -enableassertions -Xmx1400m
-Djava.security.egd=file:/dev/./urandom -jar <https://builds.apache.org/job/HBase-0.92-security/ws/trunk/target/surefire/surefirebooter4030396407359727813.jar>
<https://builds.apache.org/job/HBase-0.92-security/ws/trunk/target/surefire/surefire7315005624534043472tmp>
<https://builds.apache.org/job/HBase-0.92-security/ws/trunk/target/surefire/surefire6422295855351555929tmp>
Running org.apache.hadoop.hbase.TestZooKeeper
Tests run: 7, Failures: 0, Errors: 0, Skipped: 0, Time elapsed: 95.039 sec
Forking command line: /bin/sh -c cd <https://builds.apache.org/job/HBase-0.92-security/ws/trunk>
&& /home/hudson/tools/java/jdk1.6.0_27-32/jre/bin/java -enableassertions -Xmx1400m
-Djava.security.egd=file:/dev/./urandom -jar <https://builds.apache.org/job/HBase-0.92-security/ws/trunk/target/surefire/surefirebooter7082672895446891580.jar>
<https://builds.apache.org/job/HBase-0.92-security/ws/trunk/target/surefire/surefire2736617454702174360tmp>
<https://builds.apache.org/job/HBase-0.92-security/ws/trunk/target/surefire/surefire7387503296467841679tmp>
Running org.apache.hadoop.hbase.TestCompare
Tests run: 1, Failures: 0, Errors: 0, Skipped: 0, Time elapsed: 0.25 sec
Forking command line: /bin/sh -c cd <https://builds.apache.org/job/HBase-0.92-security/ws/trunk>
&& /home/hudson/tools/java/jdk1.6.0_27-32/jre/bin/java -enableassertions -Xmx1400m
-Djava.security.egd=file:/dev/./urandom -jar <https://builds.apache.org/job/HBase-0.92-security/ws/trunk/target/surefire/surefirebooter2467249307402980801.jar>
<https://builds.apache.org/job/HBase-0.92-security/ws/trunk/target/surefire/surefire4852116035629951605tmp>
<https://builds.apache.org/job/HBase-0.92-security/ws/trunk/target/surefire/surefire1349179207134278551tmp>
Running org.apache.hadoop.hbase.ipc.TestDelayedRpc
Tests run: 4, Failures: 0, Errors: 0, Skipped: 0, Time elapsed: 2.321 sec
Forking command line: /bin/sh -c cd <https://builds.apache.org/job/HBase-0.92-security/ws/trunk>
&& /home/hudson/tools/java/jdk1.6.0_27-32/jre/bin/java -enableassertions -Xmx1400m
-Djava.security.egd=file:/dev/./urandom -jar <https://builds.apache.org/job/HBase-0.92-security/ws/trunk/target/surefire/surefirebooter4888423925639565350.jar>
<https://builds.apache.org/job/HBase-0.92-security/ws/trunk/target/surefire/surefire7285920889682454149tmp>
<https://builds.apache.org/job/HBase-0.92-security/ws/trunk/target/surefire/surefire1333589924844582590tmp>
Running org.apache.hadoop.hbase.TestFSTableDescriptorForceCreation
Tests run: 3, Failures: 0, Errors: 0, Skipped: 0, Time elapsed: 0.631 sec
Forking command line: /bin/sh -c cd <https://builds.apache.org/job/HBase-0.92-security/ws/trunk>
&& /home/hudson/tools/java/jdk1.6.0_27-32/jre/bin/java -enableassertions -Xmx1400m
-Djava.security.egd=file:/dev/./urandom -jar <https://builds.apache.org/job/HBase-0.92-security/ws/trunk/target/surefire/surefirebooter8980833567908282068.jar>
<https://builds.apache.org/job/HBase-0.92-security/ws/trunk/target/surefire/surefire4530660155907941266tmp>
<https://builds.apache.org/job/HBase-0.92-security/ws/trunk/target/surefire/surefire3308010597784383209tmp>
Running org.apache.hadoop.hbase.TestInfoServers
Tests run: 2, Failures: 0, Errors: 0, Skipped: 0, Time elapsed: 22.751 sec

Results :

Tests in error: 
  testMasterFailoverWithMockedRITOnDeadRS(org.apache.hadoop.hbase.master.TestMasterFailover):
test timed out after 180000 milliseconds

Tests run: 1093, Failures: 0, Errors: 1, Skipped: 7

[INFO] ------------------------------------------------------------------------
[INFO] BUILD FAILURE
[INFO] ------------------------------------------------------------------------
[INFO] Total time: 2:28:33.248s
[INFO] Finished at: Mon Nov 28 07:35:13 UTC 2011
[INFO] Final Memory: 51M/839M
[INFO] ------------------------------------------------------------------------
[ERROR] Failed to execute goal org.apache.maven.plugins:maven-surefire-plugin:2.10:test (default-test)
on project hbase: Failure or timeout -> [Help 1]
org.apache.maven.lifecycle.LifecycleExecutionException: Failed to execute goal org.apache.maven.plugins:maven-surefire-plugin:2.10:test
(default-test) on project hbase: Failure or timeout
	at org.apache.maven.lifecycle.internal.MojoExecutor.execute(MojoExecutor.java:217)
	at org.apache.maven.lifecycle.internal.MojoExecutor.execute(MojoExecutor.java:153)
	at org.apache.maven.lifecycle.internal.MojoExecutor.execute(MojoExecutor.java:145)
	at org.apache.maven.lifecycle.internal.MojoExecutor.executeForkedExecutions(MojoExecutor.java:365)
	at org.apache.maven.lifecycle.internal.MojoExecutor.execute(MojoExecutor.java:199)
	at org.apache.maven.lifecycle.internal.MojoExecutor.execute(MojoExecutor.java:153)
	at org.apache.maven.lifecycle.internal.MojoExecutor.execute(MojoExecutor.java:145)
	at org.apache.maven.lifecycle.internal.LifecycleModuleBuilder.buildProject(LifecycleModuleBuilder.java:84)
	at org.apache.maven.lifecycle.internal.LifecycleModuleBuilder.buildProject(LifecycleModuleBuilder.java:59)
	at org.apache.maven.lifecycle.internal.LifecycleStarter.singleThreadedBuild(LifecycleStarter.java:183)
	at org.apache.maven.lifecycle.internal.LifecycleStarter.execute(LifecycleStarter.java:161)
	at org.apache.maven.DefaultMaven.doExecute(DefaultMaven.java:319)
	at org.apache.maven.DefaultMaven.execute(DefaultMaven.java:156)
	at org.apache.maven.cli.MavenCli.execute(MavenCli.java:537)
	at org.apache.maven.cli.MavenCli.doMain(MavenCli.java:196)
	at org.apache.maven.cli.MavenCli.main(MavenCli.java:141)
	at sun.reflect.NativeMethodAccessorImpl.invoke0(Native Method)
	at sun.reflect.NativeMethodAccessorImpl.invoke(NativeMethodAccessorImpl.java:39)
	at sun.reflect.DelegatingMethodAccessorImpl.invoke(DelegatingMethodAccessorImpl.java:25)
	at java.lang.reflect.Method.invoke(Method.java:597)
	at org.codehaus.plexus.classworlds.launcher.Launcher.launchEnhanced(Launcher.java:290)
	at org.codehaus.plexus.classworlds.launcher.Launcher.launch(Launcher.java:230)
	at org.codehaus.plexus.classworlds.launcher.Launcher.mainWithExitCode(Launcher.java:409)
	at org.codehaus.plexus.classworlds.launcher.Launcher.main(Launcher.java:352)
Caused by: org.apache.maven.plugin.MojoExecutionException: Failure or timeout
	at org.apache.maven.plugin.surefire.SurefirePlugin.assertNoFailureOrTimeout(SurefirePlugin.java:633)
	at org.apache.maven.plugin.surefire.SurefirePlugin.handleSummary(SurefirePlugin.java:614)
	at org.apache.maven.plugin.surefire.AbstractSurefireMojo.executeAfterPreconditionsChecked(AbstractSurefireMojo.java:137)
	at org.apache.maven.plugin.surefire.AbstractSurefireMojo.execute(AbstractSurefireMojo.java:98)
	at org.apache.maven.plugin.DefaultBuildPluginManager.executeMojo(DefaultBuildPluginManager.java:101)
	at org.apache.maven.lifecycle.internal.MojoExecutor.execute(MojoExecutor.java:209)
	... 23 more
[ERROR] 
[ERROR] 
[ERROR] For more information about the errors and possible solutions, please read the following
articles:
[ERROR] [Help 1] http://cwiki.apache.org/confluence/display/MAVEN/MojoExecutionException
Build step 'Invoke top-level Maven targets' marked build as failure
[locks-and-latches] Releasing all the locks
[locks-and-latches] All the locks released
Archiving artifacts
Recording test results
Updating HBASE-4862


Mime
View raw message