hbase-dev mailing list archives

Site index · List index
Message view « Date » · « Thread »
Top « Date » · « Thread »
From Apache Jenkins Server <jenk...@builds.apache.org>
Subject Build failed in Jenkins: HBase-0.92 #152
Date Sun, 20 Nov 2011 21:56:26 GMT
See <https://builds.apache.org/job/HBase-0.92/152/changes>

Changes:

[apurtell] HBASE-2418 Support for ZooKeeper authentication

------------------------------------------
[...truncated 1399 lines...]
<configuration>
  <basedir>${basedir}</basedir>
  <forceCreation default-value="false">${xml.forceCreation}</forceCreation>
  <project>${project}</project>
  <settings>${settings}</settings>
  <transformationSets>
    <transformationSet>
      <dir><https://builds.apache.org/job/HBase-0.92/ws/trunk/src/main/resources/</dir>>
      <includes>
        <include>hbase-default.xml</include>
      </includes>
      <stylesheet><https://builds.apache.org/job/HBase-0.92/ws/trunk/src/main/xslt/configuration_to_docbook_section.xsl</stylesheet>>
      <outputDir><https://builds.apache.org/job/HBase-0.92/ws/trunk/target/site/</outputDir>>
    </transformationSet>
  </transformationSets>
  <transformerFactory>${xml.transformerFactory}</transformerFactory>
</configuration>
[DEBUG] -----------------------------------------------------------------------
[DEBUG] Goal:          com.agilejava.docbkx:docbkx-maven-plugin:2.0.11:generate-html (multipage)
[DEBUG] Style:         Regular
[DEBUG] Configuration: <?xml version="1.0" encoding="UTF-8"?>
<configuration>
  <artifacts>${plugin.artifacts}</artifacts>
  <chunkedOutput>true</chunkedOutput>
  <htmlStylesheet>../css/freebsd_docbook.css</htmlStylesheet>
  <imgSrcPath>../images/</imgSrcPath>
  <includes default-value="*.xml"/>
  <navigShowtitles>true</navigShowtitles>
  <project>${project}</project>
  <sectionAutolabel>true</sectionAutolabel>
  <sectionAutolabelMaxDepth>100</sectionAutolabelMaxDepth>
  <sectionLabelIncludesComponentLabel>true</sectionLabelIncludesComponentLabel>
  <sourceDirectory>${basedir}/src/docbkx</sourceDirectory>
  <targetDirectory><https://builds.apache.org/job/HBase-0.92/ws/trunk/target/site/book/</targetDirectory>>
  <targetFileExtension default-value="html"/>
  <useIdAsFilename>true</useIdAsFilename>
  <xincludeSupported>true</xincludeSupported>
</configuration>
[DEBUG] -----------------------------------------------------------------------
[DEBUG] Goal:          com.agilejava.docbkx:docbkx-maven-plugin:2.0.11:generate-html (onepage)
[DEBUG] Style:         Regular
[DEBUG] Configuration: <?xml version="1.0" encoding="UTF-8"?>
<configuration>
  <artifacts>${plugin.artifacts}</artifacts>
  <htmlStylesheet>css/freebsd_docbook.css</htmlStylesheet>
  <imgSrcPath>images/</imgSrcPath>
  <includes default-value="*.xml"/>
  <project>${project}</project>
  <sectionAutolabel>true</sectionAutolabel>
  <sectionAutolabelMaxDepth>100</sectionAutolabelMaxDepth>
  <sectionLabelIncludesComponentLabel>true</sectionLabelIncludesComponentLabel>
  <sourceDirectory>${basedir}/src/docbkx</sourceDirectory>
  <targetDirectory><https://builds.apache.org/job/HBase-0.92/ws/trunk/target/site/</targetDirectory>>
  <targetFileExtension default-value="html"/>
  <useIdAsFilename>true</useIdAsFilename>
  <xincludeSupported>true</xincludeSupported>
</configuration>
[DEBUG] -----------------------------------------------------------------------
[DEBUG] Goal:          org.apache.maven.plugins:maven-site-plugin:2.0.1:site (default-site)
[DEBUG] Style:         Regular
[DEBUG] Configuration: <?xml version="1.0" encoding="UTF-8"?>
<configuration>
  <attributes>${attributes}</attributes>
  <generateReports default-value="true">${generateReports}</generateReports>
  <generatedSiteDirectory>${project.build.directory}/generated-site</generatedSiteDirectory>
  <inputEncoding default-value="${project.build.sourceEncoding}">${encoding}</inputEncoding>
  <localRepository>${localRepository}</localRepository>
  <locales>${locales}</locales>
  <outputDirectory default-value="${project.reporting.outputDirectory}"><https://builds.apache.org/job/HBase-0.92/ws/trunk/target/site</outputDirectory>>
  <outputEncoding default-value="${project.reporting.outputEncoding}">${outputEncoding}</outputEncoding>
  <project>${project}</project>
  <reactorProjects>${reactorProjects}</reactorProjects>
  <reports>${reports}</reports>
  <repositories>${project.remoteArtifactRepositories}</repositories>
  <siteDirectory>${basedir}/src/site</siteDirectory>
  <template>${template}</template>
  <templateDirectory default-value="src/site">${templateDirectory}</templateDirectory>
  <templateFile>${templateFile}</templateFile>
  <xdocDirectory default-value="${basedir}/xdocs"/>
</configuration>
[DEBUG] =======================================================================
[DEBUG] Could not find metadata org.apache.zookeeper:zookeeper:3.4.0-SNAPSHOT/maven-metadata.xml
in local (/home/jenkins/.m2/repository)
[DEBUG] Using connector WagonRepositoryConnector with priority 0 for https://repository.apache.org/content/repositories/releases/
[DEBUG] Using connector WagonRepositoryConnector with priority 0 for http://repository.apache.org/snapshots
Downloading: https://repository.apache.org/content/repositories/releases/org/apache/zookeeper/zookeeper/3.4.0-SNAPSHOT/maven-metadata.xml
Downloading: http://repository.apache.org/snapshots/org/apache/zookeeper/zookeeper/3.4.0-SNAPSHOT/maven-metadata.xml

[DEBUG] Reading resolution tracking file /home/jenkins/.m2/repository/org/apache/zookeeper/zookeeper/3.4.0-SNAPSHOT/resolver-status.properties
[DEBUG] Writing resolution tracking file /home/jenkins/.m2/repository/org/apache/zookeeper/zookeeper/3.4.0-SNAPSHOT/resolver-status.properties

[DEBUG] Reading resolution tracking file /home/jenkins/.m2/repository/org/apache/zookeeper/zookeeper/3.4.0-SNAPSHOT/resolver-status.properties
[DEBUG] Writing resolution tracking file /home/jenkins/.m2/repository/org/apache/zookeeper/zookeeper/3.4.0-SNAPSHOT/resolver-status.properties
[DEBUG] Could not find metadata org.apache.zookeeper:zookeeper:3.4.0-SNAPSHOT/maven-metadata.xml
in apache release (https://repository.apache.org/content/repositories/releases/)
[DEBUG] Could not find metadata org.apache.zookeeper:zookeeper:3.4.0-SNAPSHOT/maven-metadata.xml
in Nexus (http://repository.apache.org/snapshots)
[DEBUG] Could not find metadata org.apache.zookeeper:zookeeper:3.4.0-SNAPSHOT/maven-metadata.xml
in local (/home/jenkins/.m2/repository)
[DEBUG] Failure to find org.apache.zookeeper:zookeeper:3.4.0-SNAPSHOT/maven-metadata.xml in
https://repository.apache.org/content/repositories/releases/ was cached in the local repository,
resolution will not be reattempted until the update interval of apache release has elapsed
or updates are forced
[DEBUG] Failure to find org.apache.zookeeper:zookeeper:3.4.0-SNAPSHOT/maven-metadata.xml in
http://repository.apache.org/snapshots was cached in the local repository, resolution will
not be reattempted until the update interval of Nexus has elapsed or updates are forced
[DEBUG] Using connector WagonRepositoryConnector with priority 0 for https://repository.apache.org/content/repositories/releases/
Downloading: https://repository.apache.org/content/repositories/releases/org/apache/zookeeper/zookeeper/3.4.0-SNAPSHOT/zookeeper-3.4.0-SNAPSHOT.pom

[DEBUG] Reading resolution tracking file /home/jenkins/.m2/repository/org/apache/zookeeper/zookeeper/3.4.0-SNAPSHOT/zookeeper-3.4.0-SNAPSHOT.pom.lastUpdated
[DEBUG] Writing resolution tracking file /home/jenkins/.m2/repository/org/apache/zookeeper/zookeeper/3.4.0-SNAPSHOT/zookeeper-3.4.0-SNAPSHOT.pom.lastUpdated
[DEBUG] Using connector WagonRepositoryConnector with priority 0 for http://repository.apache.org/snapshots
Downloading: http://repository.apache.org/snapshots/org/apache/zookeeper/zookeeper/3.4.0-SNAPSHOT/zookeeper-3.4.0-SNAPSHOT.pom

[DEBUG] Reading resolution tracking file /home/jenkins/.m2/repository/org/apache/zookeeper/zookeeper/3.4.0-SNAPSHOT/zookeeper-3.4.0-SNAPSHOT.pom.lastUpdated
[DEBUG] Writing resolution tracking file /home/jenkins/.m2/repository/org/apache/zookeeper/zookeeper/3.4.0-SNAPSHOT/zookeeper-3.4.0-SNAPSHOT.pom.lastUpdated
[WARNING] The POM for org.apache.zookeeper:zookeeper:jar:3.4.0-SNAPSHOT is missing, no dependency
information available
[DEBUG] org.apache.hbase:hbase:jar:0.92.0-SNAPSHOT
[DEBUG]    com.google.guava:guava:jar:r09:compile
[DEBUG]    commons-cli:commons-cli:jar:1.2:compile
[DEBUG]    com.github.stephenc.high-scale-lib:high-scale-lib:jar:1.1.1:compile
[DEBUG]    commons-codec:commons-codec:jar:1.4:compile
[DEBUG]    commons-httpclient:commons-httpclient:jar:3.1:compile
[DEBUG]    commons-lang:commons-lang:jar:2.5:compile
[DEBUG]    commons-logging:commons-logging:jar:1.1.1:compile
[DEBUG]    log4j:log4j:jar:1.2.16:compile
[DEBUG]    org.apache.avro:avro:jar:1.5.3:compile
[DEBUG]       org.xerial.snappy:snappy-java:jar:1.0.3.2:compile
[DEBUG]    org.apache.avro:avro-ipc:jar:1.5.3:compile
[DEBUG]       org.jboss.netty:netty:jar:3.2.4.Final:compile
[DEBUG]       org.apache.velocity:velocity:jar:1.7:compile
[DEBUG]          commons-collections:commons-collections:jar:3.2.1:compile
[DEBUG]    org.apache.zookeeper:zookeeper:jar:3.4.0-SNAPSHOT:compile
[DEBUG]    org.apache.thrift:libthrift:jar:0.7.0:compile
[DEBUG]       javax.servlet:servlet-api:jar:2.5:compile
[DEBUG]       org.apache.httpcomponents:httpclient:jar:4.0.1:compile
[DEBUG]          org.apache.httpcomponents:httpcore:jar:4.0.1:compile
[DEBUG]    org.jruby:jruby-complete:jar:1.6.0:compile
[DEBUG]    org.mortbay.jetty:jetty:jar:6.1.26:compile
[DEBUG]    org.mortbay.jetty:jetty-util:jar:6.1.26:compile
[DEBUG]    org.mortbay.jetty:jsp-2.1:jar:6.1.14:compile
[DEBUG]       org.eclipse.jdt:core:jar:3.1.1:compile
[DEBUG]    org.mortbay.jetty:jsp-api-2.1:jar:6.1.14:compile
[DEBUG]    org.mortbay.jetty:servlet-api-2.5:jar:6.1.14:compile
[DEBUG]    org.codehaus.jackson:jackson-core-asl:jar:1.5.5:compile
[DEBUG]    org.codehaus.jackson:jackson-mapper-asl:jar:1.5.5:compile
[DEBUG]    org.codehaus.jackson:jackson-jaxrs:jar:1.5.5:compile
[DEBUG]    org.codehaus.jackson:jackson-xc:jar:1.5.5:compile
[DEBUG]    org.slf4j:slf4j-api:jar:1.5.8:compile
[DEBUG]    org.slf4j:slf4j-log4j12:jar:1.5.8:compile
[DEBUG]    tomcat:jasper-compiler:jar:5.5.23:runtime
[DEBUG]    tomcat:jasper-runtime:jar:5.5.23:runtime
[DEBUG]       commons-el:commons-el:jar:1.0:compile
[DEBUG]    org.jamon:jamon-runtime:jar:2.3.1:compile
[DEBUG]    com.google.protobuf:protobuf-java:jar:2.4.0a:compile
[DEBUG]    com.sun.jersey:jersey-core:jar:1.4:compile
[DEBUG]    com.sun.jersey:jersey-json:jar:1.4:compile
[DEBUG]       org.codehaus.jettison:jettison:jar:1.1:compile
[DEBUG]       com.sun.xml.bind:jaxb-impl:jar:2.1.12:compile
[DEBUG]    com.sun.jersey:jersey-server:jar:1.4:compile
[DEBUG]       asm:asm:jar:3.1:compile
[DEBUG]    javax.xml.bind:jaxb-api:jar:2.1:compile
[DEBUG]       javax.activation:activation:jar:1.1:compile
[DEBUG]    stax:stax-api:jar:1.0.1:compile
[DEBUG]    junit:junit:jar:4.10:test
[DEBUG]       org.hamcrest:hamcrest-core:jar:1.1:test
[DEBUG]    org.mockito:mockito-all:jar:1.8.5:test
[DEBUG]    org.apache.commons:commons-math:jar:2.1:test
[DEBUG]    org.apache.hadoop:hadoop-core:jar:0.20.205.0:compile
[DEBUG]       xmlenc:xmlenc:jar:0.52:compile
[DEBUG]       commons-configuration:commons-configuration:jar:1.6:compile
[DEBUG]          commons-digester:commons-digester:jar:1.8:compile
[DEBUG]             commons-beanutils:commons-beanutils:jar:1.7.0:compile
[DEBUG]          commons-beanutils:commons-beanutils-core:jar:1.8.0:compile
[DEBUG]       commons-net:commons-net:jar:1.4.1:compile
[DEBUG]    org.apache.hadoop:hadoop-test:jar:0.20.205.0:test
[DEBUG]       org.apache.ftpserver:ftplet-api:jar:1.0.0:test
[DEBUG]       org.apache.mina:mina-core:jar:2.0.0-M5:test
[DEBUG]       org.apache.ftpserver:ftpserver-core:jar:1.0.0:test
[DEBUG]       org.apache.ftpserver:ftpserver-deprecated:jar:1.0.0-M2:test
[DEBUG] Using connector WagonRepositoryConnector with priority 0 for https://repository.apache.org/content/repositories/releases/
Downloading: https://repository.apache.org/content/repositories/releases/org/apache/zookeeper/zookeeper/3.4.0-SNAPSHOT/zookeeper-3.4.0-SNAPSHOT.jar

[DEBUG] Reading resolution tracking file /home/jenkins/.m2/repository/org/apache/zookeeper/zookeeper/3.4.0-SNAPSHOT/zookeeper-3.4.0-SNAPSHOT.jar.lastUpdated
[DEBUG] Writing resolution tracking file /home/jenkins/.m2/repository/org/apache/zookeeper/zookeeper/3.4.0-SNAPSHOT/zookeeper-3.4.0-SNAPSHOT.jar.lastUpdated
[DEBUG] Using connector WagonRepositoryConnector with priority 0 for http://repository.apache.org/snapshots
Downloading: http://repository.apache.org/snapshots/org/apache/zookeeper/zookeeper/3.4.0-SNAPSHOT/zookeeper-3.4.0-SNAPSHOT.jar

[DEBUG] Reading resolution tracking file /home/jenkins/.m2/repository/org/apache/zookeeper/zookeeper/3.4.0-SNAPSHOT/zookeeper-3.4.0-SNAPSHOT.jar.lastUpdated
[DEBUG] Writing resolution tracking file /home/jenkins/.m2/repository/org/apache/zookeeper/zookeeper/3.4.0-SNAPSHOT/zookeeper-3.4.0-SNAPSHOT.jar.lastUpdated
[INFO]                                                                         
[INFO] ------------------------------------------------------------------------
[INFO] Skipping HBase
[INFO] This project has been banned from the build due to previous failures.
[INFO] ------------------------------------------------------------------------
[INFO] ------------------------------------------------------------------------
[INFO] BUILD FAILURE
[INFO] ------------------------------------------------------------------------
[INFO] Total time: 2.466s
[INFO] Finished at: Sun Nov 20 21:56:24 UTC 2011
[INFO] Final Memory: 10M/114M
[INFO] ------------------------------------------------------------------------
[ERROR] Failed to execute goal on project hbase: Could not resolve dependencies for project
org.apache.hbase:hbase:jar:0.92.0-SNAPSHOT: Could not find artifact org.apache.zookeeper:zookeeper:jar:3.4.0-SNAPSHOT
in apache release (https://repository.apache.org/content/repositories/releases/) -> [Help
1]
org.apache.maven.lifecycle.LifecycleExecutionException: Failed to execute goal on project
hbase: Could not resolve dependencies for project org.apache.hbase:hbase:jar:0.92.0-SNAPSHOT:
Could not find artifact org.apache.zookeeper:zookeeper:jar:3.4.0-SNAPSHOT in apache release
(https://repository.apache.org/content/repositories/releases/)
	at org.apache.maven.lifecycle.internal.LifecycleDependencyResolver.getDependencies(LifecycleDependencyResolver.java:196)
	at org.apache.maven.lifecycle.internal.LifecycleDependencyResolver.resolveProjectDependencies(LifecycleDependencyResolver.java:108)
	at org.apache.maven.lifecycle.internal.MojoExecutor.ensureDependenciesAreResolved(MojoExecutor.java:258)
	at org.apache.maven.lifecycle.internal.MojoExecutor.execute(MojoExecutor.java:201)
	at org.apache.maven.lifecycle.internal.MojoExecutor.execute(MojoExecutor.java:153)
	at org.apache.maven.lifecycle.internal.MojoExecutor.execute(MojoExecutor.java:145)
	at org.apache.maven.lifecycle.internal.LifecycleModuleBuilder.buildProject(LifecycleModuleBuilder.java:84)
	at org.apache.maven.lifecycle.internal.LifecycleModuleBuilder.buildProject(LifecycleModuleBuilder.java:59)
	at org.apache.maven.lifecycle.internal.LifecycleStarter.singleThreadedBuild(LifecycleStarter.java:183)
	at org.apache.maven.lifecycle.internal.LifecycleStarter.execute(LifecycleStarter.java:161)
	at org.apache.maven.DefaultMaven.doExecute(DefaultMaven.java:319)
	at org.apache.maven.DefaultMaven.execute(DefaultMaven.java:156)
	at org.apache.maven.cli.MavenCli.execute(MavenCli.java:537)
	at org.apache.maven.cli.MavenCli.doMain(MavenCli.java:196)
	at org.apache.maven.cli.MavenCli.main(MavenCli.java:141)
	at sun.reflect.NativeMethodAccessorImpl.invoke0(Native Method)
	at sun.reflect.NativeMethodAccessorImpl.invoke(NativeMethodAccessorImpl.java:39)
	at sun.reflect.DelegatingMethodAccessorImpl.invoke(DelegatingMethodAccessorImpl.java:25)
	at java.lang.reflect.Method.invoke(Method.java:597)
	at org.codehaus.plexus.classworlds.launcher.Launcher.launchEnhanced(Launcher.java:290)
	at org.codehaus.plexus.classworlds.launcher.Launcher.launch(Launcher.java:230)
	at org.codehaus.plexus.classworlds.launcher.Launcher.mainWithExitCode(Launcher.java:409)
	at org.codehaus.plexus.classworlds.launcher.Launcher.main(Launcher.java:352)
Caused by: org.apache.maven.project.DependencyResolutionException: Could not resolve dependencies
for project org.apache.hbase:hbase:jar:0.92.0-SNAPSHOT: Could not find artifact org.apache.zookeeper:zookeeper:jar:3.4.0-SNAPSHOT
in apache release (https://repository.apache.org/content/repositories/releases/)
	at org.apache.maven.project.DefaultProjectDependenciesResolver.resolve(DefaultProjectDependenciesResolver.java:170)
	at org.apache.maven.lifecycle.internal.LifecycleDependencyResolver.getDependencies(LifecycleDependencyResolver.java:171)
	... 22 more
Caused by: org.sonatype.aether.resolution.DependencyResolutionException: Could not find artifact
org.apache.zookeeper:zookeeper:jar:3.4.0-SNAPSHOT in apache release (https://repository.apache.org/content/repositories/releases/)
	at org.sonatype.aether.impl.internal.DefaultRepositorySystem.resolveDependencies(DefaultRepositorySystem.java:412)
	at org.apache.maven.project.DefaultProjectDependenciesResolver.resolve(DefaultProjectDependenciesResolver.java:164)
	... 23 more
Caused by: org.sonatype.aether.resolution.ArtifactResolutionException: Could not find artifact
org.apache.zookeeper:zookeeper:jar:3.4.0-SNAPSHOT in apache release (https://repository.apache.org/content/repositories/releases/)
	at org.sonatype.aether.impl.internal.DefaultArtifactResolver.resolve(DefaultArtifactResolver.java:541)
	at org.sonatype.aether.impl.internal.DefaultArtifactResolver.resolveArtifacts(DefaultArtifactResolver.java:220)
	at org.sonatype.aether.impl.internal.DefaultRepositorySystem.resolveDependencies(DefaultRepositorySystem.java:395)
	... 24 more
Caused by: org.sonatype.aether.transfer.ArtifactNotFoundException: Could not find artifact
org.apache.zookeeper:zookeeper:jar:3.4.0-SNAPSHOT in apache release (https://repository.apache.org/content/repositories/releases/)
	at org.sonatype.aether.connector.wagon.WagonRepositoryConnector$4.wrap(WagonRepositoryConnector.java:945)
	at org.sonatype.aether.connector.wagon.WagonRepositoryConnector$4.wrap(WagonRepositoryConnector.java:940)
	at org.sonatype.aether.connector.wagon.WagonRepositoryConnector$GetTask.flush(WagonRepositoryConnector.java:695)
	at org.sonatype.aether.connector.wagon.WagonRepositoryConnector$GetTask.flush(WagonRepositoryConnector.java:689)
	at org.sonatype.aether.connector.wagon.WagonRepositoryConnector.get(WagonRepositoryConnector.java:445)
	at org.sonatype.aether.impl.internal.DefaultArtifactResolver.resolve(DefaultArtifactResolver.java:460)
	... 26 more
[ERROR] 
[ERROR] 
[ERROR] For more information about the errors and possible solutions, please read the following
articles:
[ERROR] [Help 1] http://cwiki.apache.org/confluence/display/MAVEN/DependencyResolutionException
Build step 'Invoke top-level Maven targets' marked build as failure
[locks-and-latches] Releasing all the locks
[locks-and-latches] All the locks released
Archiving artifacts
Recording test results
Updating HBASE-2418


Mime
View raw message