hbase-dev mailing list archives

Site index · List index
Message view « Date » · « Thread »
Top « Date » · « Thread »
From Apache Jenkins Server <jenk...@builds.apache.org>
Subject Build failed in Jenkins: HBase-0.92 #96
Date Wed, 02 Nov 2011 02:56:59 GMT
See <https://builds.apache.org/job/HBase-0.92/96/changes>

Changes:

[jdcryans] HBASE-3515  [replication] ReplicationSource can miss a log after RS comes out of
GC

[stack] HBASE-4711 Remove jsr jar; not needed

[stack] HBASE-4708 Revert safemode related pieces of hbase-4510

[nspiegelberg] HBASE-4611 Add support for Phabricator/Differential as an alternative code
review tool

------------------------------------------
[...truncated 6433 lines...]
Running org.apache.hadoop.hbase.regionserver.TestHRegion
Tests run: 57, Failures: 0, Errors: 0, Skipped: 0, Time elapsed: 29.34 sec
Forking command line: /bin/sh -c cd <https://builds.apache.org/job/HBase-0.92/ws/trunk>
&& /home/jenkins/tools/java/jdk1.6.0_27-32/jre/bin/java -enableassertions -Xmx1400m
-jar <https://builds.apache.org/job/HBase-0.92/ws/trunk/target/surefire/surefirebooter3731202828630581639.jar>
<https://builds.apache.org/job/HBase-0.92/ws/trunk/target/surefire/surefire8592398997084314672tmp>
<https://builds.apache.org/job/HBase-0.92/ws/trunk/target/surefire/surefire5748543966130452085tmp>
Running org.apache.hadoop.hbase.regionserver.TestMasterAddressManager
Tests run: 1, Failures: 0, Errors: 0, Skipped: 0, Time elapsed: 0.53 sec
Forking command line: /bin/sh -c cd <https://builds.apache.org/job/HBase-0.92/ws/trunk>
&& /home/jenkins/tools/java/jdk1.6.0_27-32/jre/bin/java -enableassertions -Xmx1400m
-jar <https://builds.apache.org/job/HBase-0.92/ws/trunk/target/surefire/surefirebooter7780894953689902220.jar>
<https://builds.apache.org/job/HBase-0.92/ws/trunk/target/surefire/surefire4137363559529659184tmp>
<https://builds.apache.org/job/HBase-0.92/ws/trunk/target/surefire/surefire5165485191724480059tmp>
Running org.apache.hadoop.hbase.regionserver.TestCompoundBloomFilter
Tests run: 3, Failures: 0, Errors: 0, Skipped: 0, Time elapsed: 21.689 sec
Forking command line: /bin/sh -c cd <https://builds.apache.org/job/HBase-0.92/ws/trunk>
&& /home/jenkins/tools/java/jdk1.6.0_27-32/jre/bin/java -enableassertions -Xmx1400m
-jar <https://builds.apache.org/job/HBase-0.92/ws/trunk/target/surefire/surefirebooter6074665375050726135.jar>
<https://builds.apache.org/job/HBase-0.92/ws/trunk/target/surefire/surefire3887996332034924212tmp>
<https://builds.apache.org/job/HBase-0.92/ws/trunk/target/surefire/surefire5150537237769206789tmp>
Running org.apache.hadoop.hbase.regionserver.TestSplitLogWorker
Tests run: 5, Failures: 0, Errors: 0, Skipped: 0, Time elapsed: 2.048 sec
Forking command line: /bin/sh -c cd <https://builds.apache.org/job/HBase-0.92/ws/trunk>
&& /home/jenkins/tools/java/jdk1.6.0_27-32/jre/bin/java -enableassertions -Xmx1400m
-jar <https://builds.apache.org/job/HBase-0.92/ws/trunk/target/surefire/surefirebooter3900216113572116764.jar>
<https://builds.apache.org/job/HBase-0.92/ws/trunk/target/surefire/surefire6902081510364544335tmp>
<https://builds.apache.org/job/HBase-0.92/ws/trunk/target/surefire/surefire6902258741330600249tmp>
Running org.apache.hadoop.hbase.regionserver.TestServerCustomProtocol
Tests run: 6, Failures: 0, Errors: 0, Skipped: 0, Time elapsed: 19.554 sec
Forking command line: /bin/sh -c cd <https://builds.apache.org/job/HBase-0.92/ws/trunk>
&& /home/jenkins/tools/java/jdk1.6.0_27-32/jre/bin/java -enableassertions -Xmx1400m
-jar <https://builds.apache.org/job/HBase-0.92/ws/trunk/target/surefire/surefirebooter7331600887032636451.jar>
<https://builds.apache.org/job/HBase-0.92/ws/trunk/target/surefire/surefire4523803940602562071tmp>
<https://builds.apache.org/job/HBase-0.92/ws/trunk/target/surefire/surefire911657518390225353tmp>
Running org.apache.hadoop.hbase.regionserver.TestScanWithBloomError
Tests run: 3, Failures: 0, Errors: 0, Skipped: 0, Time elapsed: 1.022 sec
Forking command line: /bin/sh -c cd <https://builds.apache.org/job/HBase-0.92/ws/trunk>
&& /home/jenkins/tools/java/jdk1.6.0_27-32/jre/bin/java -enableassertions -Xmx1400m
-jar <https://builds.apache.org/job/HBase-0.92/ws/trunk/target/surefire/surefirebooter2245932406607448826.jar>
<https://builds.apache.org/job/HBase-0.92/ws/trunk/target/surefire/surefire7329847885048779332tmp>
<https://builds.apache.org/job/HBase-0.92/ws/trunk/target/surefire/surefire1555262121558605900tmp>
Running org.apache.hadoop.hbase.regionserver.TestStoreFileBlockCacheSummary
Tests run: 1, Failures: 0, Errors: 0, Skipped: 0, Time elapsed: 19.048 sec
Forking command line: /bin/sh -c cd <https://builds.apache.org/job/HBase-0.92/ws/trunk>
&& /home/jenkins/tools/java/jdk1.6.0_27-32/jre/bin/java -enableassertions -Xmx1400m
-jar <https://builds.apache.org/job/HBase-0.92/ws/trunk/target/surefire/surefirebooter2874600301708815961.jar>
<https://builds.apache.org/job/HBase-0.92/ws/trunk/target/surefire/surefire470985530109522682tmp>
<https://builds.apache.org/job/HBase-0.92/ws/trunk/target/surefire/surefire3212951421664477480tmp>
Running org.apache.hadoop.hbase.regionserver.TestStore
Tests run: 11, Failures: 0, Errors: 0, Skipped: 0, Time elapsed: 1.774 sec
Forking command line: /bin/sh -c cd <https://builds.apache.org/job/HBase-0.92/ws/trunk>
&& /home/jenkins/tools/java/jdk1.6.0_27-32/jre/bin/java -enableassertions -Xmx1400m
-jar <https://builds.apache.org/job/HBase-0.92/ws/trunk/target/surefire/surefirebooter3790990766132149564.jar>
<https://builds.apache.org/job/HBase-0.92/ws/trunk/target/surefire/surefire5723644561854466793tmp>
<https://builds.apache.org/job/HBase-0.92/ws/trunk/target/surefire/surefire7985559738752954730tmp>
Running org.apache.hadoop.hbase.regionserver.TestBlocksRead
Tests run: 3, Failures: 0, Errors: 0, Skipped: 0, Time elapsed: 1.019 sec
Forking command line: /bin/sh -c cd <https://builds.apache.org/job/HBase-0.92/ws/trunk>
&& /home/jenkins/tools/java/jdk1.6.0_27-32/jre/bin/java -enableassertions -Xmx1400m
-jar <https://builds.apache.org/job/HBase-0.92/ws/trunk/target/surefire/surefirebooter3404541433180692023.jar>
<https://builds.apache.org/job/HBase-0.92/ws/trunk/target/surefire/surefire3183879945984600736tmp>
<https://builds.apache.org/job/HBase-0.92/ws/trunk/target/surefire/surefire1392988003413092492tmp>
Running org.apache.hadoop.hbase.regionserver.TestFSErrorsExposed
Tests run: 3, Failures: 0, Errors: 0, Skipped: 0, Time elapsed: 32.876 sec
Forking command line: /bin/sh -c cd <https://builds.apache.org/job/HBase-0.92/ws/trunk>
&& /home/jenkins/tools/java/jdk1.6.0_27-32/jre/bin/java -enableassertions -Xmx1400m
-jar <https://builds.apache.org/job/HBase-0.92/ws/trunk/target/surefire/surefirebooter3686276680640927082.jar>
<https://builds.apache.org/job/HBase-0.92/ws/trunk/target/surefire/surefire4012165299389612870tmp>
<https://builds.apache.org/job/HBase-0.92/ws/trunk/target/surefire/surefire1113336789870108793tmp>
Running org.apache.hadoop.hbase.regionserver.handler.TestCloseRegionHandler
Tests run: 1, Failures: 0, Errors: 0, Skipped: 0, Time elapsed: 0.816 sec
Forking command line: /bin/sh -c cd <https://builds.apache.org/job/HBase-0.92/ws/trunk>
&& /home/jenkins/tools/java/jdk1.6.0_27-32/jre/bin/java -enableassertions -Xmx1400m
-jar <https://builds.apache.org/job/HBase-0.92/ws/trunk/target/surefire/surefirebooter144625336767048533.jar>
<https://builds.apache.org/job/HBase-0.92/ws/trunk/target/surefire/surefire2017961110554191750tmp>
<https://builds.apache.org/job/HBase-0.92/ws/trunk/target/surefire/surefire1296352782510900261tmp>
Running org.apache.hadoop.hbase.regionserver.handler.TestOpenRegionHandler
Tests run: 3, Failures: 0, Errors: 0, Skipped: 0, Time elapsed: 0.877 sec
Forking command line: /bin/sh -c cd <https://builds.apache.org/job/HBase-0.92/ws/trunk>
&& /home/jenkins/tools/java/jdk1.6.0_27-32/jre/bin/java -enableassertions -Xmx1400m
-jar <https://builds.apache.org/job/HBase-0.92/ws/trunk/target/surefire/surefirebooter2828257483080224202.jar>
<https://builds.apache.org/job/HBase-0.92/ws/trunk/target/surefire/surefire4346960408725550027tmp>
<https://builds.apache.org/job/HBase-0.92/ws/trunk/target/surefire/surefire7656272934422675120tmp>
Running org.apache.hadoop.hbase.regionserver.TestScanDeleteTracker
Tests run: 6, Failures: 0, Errors: 0, Skipped: 0, Time elapsed: 0.596 sec
Forking command line: /bin/sh -c cd <https://builds.apache.org/job/HBase-0.92/ws/trunk>
&& /home/jenkins/tools/java/jdk1.6.0_27-32/jre/bin/java -enableassertions -Xmx1400m
-jar <https://builds.apache.org/job/HBase-0.92/ws/trunk/target/surefire/surefirebooter126310838453354608.jar>
<https://builds.apache.org/job/HBase-0.92/ws/trunk/target/surefire/surefire1324996423339782524tmp>
<https://builds.apache.org/job/HBase-0.92/ws/trunk/target/surefire/surefire1471054530117457387tmp>
Running org.apache.hadoop.hbase.regionserver.TestSplitTransactionOnCluster
Tests run: 4, Failures: 0, Errors: 0, Skipped: 0, Time elapsed: 46.958 sec
Forking command line: /bin/sh -c cd <https://builds.apache.org/job/HBase-0.92/ws/trunk>
&& /home/jenkins/tools/java/jdk1.6.0_27-32/jre/bin/java -enableassertions -Xmx1400m
-jar <https://builds.apache.org/job/HBase-0.92/ws/trunk/target/surefire/surefirebooter4842430006125225744.jar>
<https://builds.apache.org/job/HBase-0.92/ws/trunk/target/surefire/surefire7152107445252897285tmp>
<https://builds.apache.org/job/HBase-0.92/ws/trunk/target/surefire/surefire7256444387962722614tmp>
Running org.apache.hadoop.hbase.regionserver.TestHRegionServerBulkLoad
Tests run: 1, Failures: 0, Errors: 0, Skipped: 0, Time elapsed: 48.123 sec
Forking command line: /bin/sh -c cd <https://builds.apache.org/job/HBase-0.92/ws/trunk>
&& /home/jenkins/tools/java/jdk1.6.0_27-32/jre/bin/java -enableassertions -Xmx1400m
-jar <https://builds.apache.org/job/HBase-0.92/ws/trunk/target/surefire/surefirebooter8516916579051692650.jar>
<https://builds.apache.org/job/HBase-0.92/ws/trunk/target/surefire/surefire4910352984320515320tmp>
<https://builds.apache.org/job/HBase-0.92/ws/trunk/target/surefire/surefire7821562142061001467tmp>
Running org.apache.hadoop.hbase.regionserver.TestSplitTransaction
Tests run: 6, Failures: 0, Errors: 0, Skipped: 0, Time elapsed: 3.727 sec
Forking command line: /bin/sh -c cd <https://builds.apache.org/job/HBase-0.92/ws/trunk>
&& /home/jenkins/tools/java/jdk1.6.0_27-32/jre/bin/java -enableassertions -Xmx1400m
-jar <https://builds.apache.org/job/HBase-0.92/ws/trunk/target/surefire/surefirebooter3908573047432378575.jar>
<https://builds.apache.org/job/HBase-0.92/ws/trunk/target/surefire/surefire1403255150928338298tmp>
<https://builds.apache.org/job/HBase-0.92/ws/trunk/target/surefire/surefire8282209303032116637tmp>
Running org.apache.hadoop.hbase.regionserver.TestReadWriteConsistencyControl
Tests run: 1, Failures: 0, Errors: 0, Skipped: 0, Time elapsed: 10.105 sec
Forking command line: /bin/sh -c cd <https://builds.apache.org/job/HBase-0.92/ws/trunk>
&& /home/jenkins/tools/java/jdk1.6.0_27-32/jre/bin/java -enableassertions -Xmx1400m
-jar <https://builds.apache.org/job/HBase-0.92/ws/trunk/target/surefire/surefirebooter2418754834030935913.jar>
<https://builds.apache.org/job/HBase-0.92/ws/trunk/target/surefire/surefire9063033774922664556tmp>
<https://builds.apache.org/job/HBase-0.92/ws/trunk/target/surefire/surefire6696576473305835828tmp>
Running org.apache.hadoop.hbase.regionserver.TestKeyValueHeap
Tests run: 3, Failures: 0, Errors: 0, Skipped: 0, Time elapsed: 0.503 sec
Forking command line: /bin/sh -c cd <https://builds.apache.org/job/HBase-0.92/ws/trunk>
&& /home/jenkins/tools/java/jdk1.6.0_27-32/jre/bin/java -enableassertions -Xmx1400m
-jar <https://builds.apache.org/job/HBase-0.92/ws/trunk/target/surefire/surefirebooter3156116758308576431.jar>
<https://builds.apache.org/job/HBase-0.92/ws/trunk/target/surefire/surefire2828516634112231867tmp>
<https://builds.apache.org/job/HBase-0.92/ws/trunk/target/surefire/surefire6883369334683643874tmp>
Running org.apache.hadoop.hbase.regionserver.TestCompactSelection
Tests run: 1, Failures: 0, Errors: 0, Skipped: 0, Time elapsed: 0.669 sec
Forking command line: /bin/sh -c cd <https://builds.apache.org/job/HBase-0.92/ws/trunk>
&& /home/jenkins/tools/java/jdk1.6.0_27-32/jre/bin/java -enableassertions -Xmx1400m
-jar <https://builds.apache.org/job/HBase-0.92/ws/trunk/target/surefire/surefirebooter1668187836601137916.jar>
<https://builds.apache.org/job/HBase-0.92/ws/trunk/target/surefire/surefire8742830725061037493tmp>
<https://builds.apache.org/job/HBase-0.92/ws/trunk/target/surefire/surefire2210115871604391353tmp>
Running org.apache.hadoop.hbase.regionserver.TestMinVersions
Tests run: 6, Failures: 0, Errors: 0, Skipped: 0, Time elapsed: 1.149 sec
Forking command line: /bin/sh -c cd <https://builds.apache.org/job/HBase-0.92/ws/trunk>
&& /home/jenkins/tools/java/jdk1.6.0_27-32/jre/bin/java -enableassertions -Xmx1400m
-jar <https://builds.apache.org/job/HBase-0.92/ws/trunk/target/surefire/surefirebooter842972084083841326.jar>
<https://builds.apache.org/job/HBase-0.92/ws/trunk/target/surefire/surefire3601242368272004678tmp>
<https://builds.apache.org/job/HBase-0.92/ws/trunk/target/surefire/surefire2296957927724355212tmp>
Running org.apache.hadoop.hbase.regionserver.TestWideScanner
Tests run: 1, Failures: 0, Errors: 0, Skipped: 0, Time elapsed: 1.833 sec
Forking command line: /bin/sh -c cd <https://builds.apache.org/job/HBase-0.92/ws/trunk>
&& /home/jenkins/tools/java/jdk1.6.0_27-32/jre/bin/java -enableassertions -Xmx1400m
-jar <https://builds.apache.org/job/HBase-0.92/ws/trunk/target/surefire/surefirebooter8039060278249832454.jar>
<https://builds.apache.org/job/HBase-0.92/ws/trunk/target/surefire/surefire2196565534523457244tmp>
<https://builds.apache.org/job/HBase-0.92/ws/trunk/target/surefire/surefire2560830851224970546tmp>
Running org.apache.hadoop.hbase.regionserver.TestColumnSeeking
Tests run: 2, Failures: 0, Errors: 0, Skipped: 0, Time elapsed: 4.77 sec
Forking command line: /bin/sh -c cd <https://builds.apache.org/job/HBase-0.92/ws/trunk>
&& /home/jenkins/tools/java/jdk1.6.0_27-32/jre/bin/java -enableassertions -Xmx1400m
-jar <https://builds.apache.org/job/HBase-0.92/ws/trunk/target/surefire/surefirebooter1671543247672648804.jar>
<https://builds.apache.org/job/HBase-0.92/ws/trunk/target/surefire/surefire6533831638279166892tmp>
<https://builds.apache.org/job/HBase-0.92/ws/trunk/target/surefire/surefire5346867271317451037tmp>
Running org.apache.hadoop.hbase.regionserver.TestGetClosestAtOrBefore
Tests run: 3, Failures: 0, Errors: 0, Skipped: 0, Time elapsed: 1.152 sec
Forking command line: /bin/sh -c cd <https://builds.apache.org/job/HBase-0.92/ws/trunk>
&& /home/jenkins/tools/java/jdk1.6.0_27-32/jre/bin/java -enableassertions -Xmx1400m
-jar <https://builds.apache.org/job/HBase-0.92/ws/trunk/target/surefire/surefirebooter803200943395248342.jar>
<https://builds.apache.org/job/HBase-0.92/ws/trunk/target/surefire/surefire1458595544734327477tmp>
<https://builds.apache.org/job/HBase-0.92/ws/trunk/target/surefire/surefire3012165940590911316tmp>
Running org.apache.hadoop.hbase.regionserver.TestExplicitColumnTracker
Tests run: 4, Failures: 0, Errors: 0, Skipped: 0, Time elapsed: 0.884 sec
Forking command line: /bin/sh -c cd <https://builds.apache.org/job/HBase-0.92/ws/trunk>
&& /home/jenkins/tools/java/jdk1.6.0_27-32/jre/bin/java -enableassertions -Xmx1400m
-jar <https://builds.apache.org/job/HBase-0.92/ws/trunk/target/surefire/surefirebooter7195111086113308745.jar>
<https://builds.apache.org/job/HBase-0.92/ws/trunk/target/surefire/surefire6415418425051038654tmp>
<https://builds.apache.org/job/HBase-0.92/ws/trunk/target/surefire/surefire8432300409715788434tmp>
Running org.apache.hadoop.hbase.regionserver.TestMemStoreLAB
Tests run: 3, Failures: 0, Errors: 0, Skipped: 0, Time elapsed: 1.419 sec
Forking command line: /bin/sh -c cd <https://builds.apache.org/job/HBase-0.92/ws/trunk>
&& /home/jenkins/tools/java/jdk1.6.0_27-32/jre/bin/java -enableassertions -Xmx1400m
-jar <https://builds.apache.org/job/HBase-0.92/ws/trunk/target/surefire/surefirebooter5543207494209415306.jar>
<https://builds.apache.org/job/HBase-0.92/ws/trunk/target/surefire/surefire3256613338516507718tmp>
<https://builds.apache.org/job/HBase-0.92/ws/trunk/target/surefire/surefire3846820269541323839tmp>
Running org.apache.hadoop.hbase.regionserver.TestKeyValueScanFixture
Tests run: 1, Failures: 0, Errors: 0, Skipped: 0, Time elapsed: 0.115 sec
Forking command line: /bin/sh -c cd <https://builds.apache.org/job/HBase-0.92/ws/trunk>
&& /home/jenkins/tools/java/jdk1.6.0_27-32/jre/bin/java -enableassertions -Xmx1400m
-jar <https://builds.apache.org/job/HBase-0.92/ws/trunk/target/surefire/surefirebooter6216106612479952193.jar>
<https://builds.apache.org/job/HBase-0.92/ws/trunk/target/surefire/surefire7506947239561598932tmp>
<https://builds.apache.org/job/HBase-0.92/ws/trunk/target/surefire/surefire3278435243232583633tmp>
Running org.apache.hadoop.hbase.regionserver.wal.TestLogRollAbort
Tests run: 1, Failures: 0, Errors: 0, Skipped: 0, Time elapsed: 24.783 sec
Forking command line: /bin/sh -c cd <https://builds.apache.org/job/HBase-0.92/ws/trunk>
&& /home/jenkins/tools/java/jdk1.6.0_27-32/jre/bin/java -enableassertions -Xmx1400m
-jar <https://builds.apache.org/job/HBase-0.92/ws/trunk/target/surefire/surefirebooter8840089417712769159.jar>
<https://builds.apache.org/job/HBase-0.92/ws/trunk/target/surefire/surefire2321275956064191865tmp>
<https://builds.apache.org/job/HBase-0.92/ws/trunk/target/surefire/surefire3211826000038935081tmp>
Running org.apache.hadoop.hbase.regionserver.wal.TestWALActionsListener
Tests run: 1, Failures: 0, Errors: 0, Skipped: 0, Time elapsed: 0.613 sec
Forking command line: /bin/sh -c cd <https://builds.apache.org/job/HBase-0.92/ws/trunk>
&& /home/jenkins/tools/java/jdk1.6.0_27-32/jre/bin/java -enableassertions -Xmx1400m
-jar <https://builds.apache.org/job/HBase-0.92/ws/trunk/target/surefire/surefirebooter1165285679218951134.jar>
<https://builds.apache.org/job/HBase-0.92/ws/trunk/target/surefire/surefire3311182634122000934tmp>
<https://builds.apache.org/job/HBase-0.92/ws/trunk/target/surefire/surefire5295111329675791176tmp>
Running org.apache.hadoop.hbase.regionserver.wal.TestLogRolling
Tests run: 3, Failures: 0, Errors: 0, Skipped: 0, Time elapsed: 481.132 sec
Forking command line: /bin/sh -c cd <https://builds.apache.org/job/HBase-0.92/ws/trunk>
&& /home/jenkins/tools/java/jdk1.6.0_27-32/jre/bin/java -enableassertions -Xmx1400m
-jar <https://builds.apache.org/job/HBase-0.92/ws/trunk/target/surefire/surefirebooter8959993947849632254.jar>
<https://builds.apache.org/job/HBase-0.92/ws/trunk/target/surefire/surefire3532373580899045756tmp>
<https://builds.apache.org/job/HBase-0.92/ws/trunk/target/surefire/surefire6659559551582718297tmp>
Running org.apache.hadoop.hbase.regionserver.wal.TestHLog
Tests run: 9, Failures: 0, Errors: 0, Skipped: 0, Time elapsed: 60.625 sec
Forking command line: /bin/sh -c cd <https://builds.apache.org/job/HBase-0.92/ws/trunk>
&& /home/jenkins/tools/java/jdk1.6.0_27-32/jre/bin/java -enableassertions -Xmx1400m
-jar <https://builds.apache.org/job/HBase-0.92/ws/trunk/target/surefire/surefirebooter5410969034740821562.jar>
<https://builds.apache.org/job/HBase-0.92/ws/trunk/target/surefire/surefire1996914303953977361tmp>
<https://builds.apache.org/job/HBase-0.92/ws/trunk/target/surefire/surefire2241674177098059353tmp>
Running org.apache.hadoop.hbase.regionserver.wal.TestHLogSplit
Tests run: 28, Failures: 0, Errors: 0, Skipped: 0, Time elapsed: 234.145 sec
Forking command line: /bin/sh -c cd <https://builds.apache.org/job/HBase-0.92/ws/trunk>
&& /home/jenkins/tools/java/jdk1.6.0_27-32/jre/bin/java -enableassertions -Xmx1400m
-jar <https://builds.apache.org/job/HBase-0.92/ws/trunk/target/surefire/surefirebooter899210608086236174.jar>
<https://builds.apache.org/job/HBase-0.92/ws/trunk/target/surefire/surefire3144705994813500340tmp>
<https://builds.apache.org/job/HBase-0.92/ws/trunk/target/surefire/surefire6103626215291130005tmp>
Running org.apache.hadoop.hbase.regionserver.wal.TestWALReplay
Tests run: 5, Failures: 0, Errors: 0, Skipped: 0, Time elapsed: 29.186 sec
Forking command line: /bin/sh -c cd <https://builds.apache.org/job/HBase-0.92/ws/trunk>
&& /home/jenkins/tools/java/jdk1.6.0_27-32/jre/bin/java -enableassertions -Xmx1400m
-jar <https://builds.apache.org/job/HBase-0.92/ws/trunk/target/surefire/surefirebooter2071428679268256200.jar>
<https://builds.apache.org/job/HBase-0.92/ws/trunk/target/surefire/surefire3067421498605339909tmp>
<https://builds.apache.org/job/HBase-0.92/ws/trunk/target/surefire/surefire8478632386404920078tmp>
Running org.apache.hadoop.hbase.regionserver.wal.TestHLogMethods
Tests run: 3, Failures: 0, Errors: 0, Skipped: 0, Time elapsed: 0.807 sec
Forking command line: /bin/sh -c cd <https://builds.apache.org/job/HBase-0.92/ws/trunk>
&& /home/jenkins/tools/java/jdk1.6.0_27-32/jre/bin/java -enableassertions -Xmx1400m
-jar <https://builds.apache.org/job/HBase-0.92/ws/trunk/target/surefire/surefirebooter3344443804013596937.jar>
<https://builds.apache.org/job/HBase-0.92/ws/trunk/target/surefire/surefire9086374387645706619tmp>
<https://builds.apache.org/job/HBase-0.92/ws/trunk/target/surefire/surefire7270369984437989420tmp>
Running org.apache.hadoop.hbase.regionserver.TestRSStatusServlet
Tests run: 2, Failures: 0, Errors: 0, Skipped: 0, Time elapsed: 0.674 sec
Forking command line: /bin/sh -c cd <https://builds.apache.org/job/HBase-0.92/ws/trunk>
&& /home/jenkins/tools/java/jdk1.6.0_27-32/jre/bin/java -enableassertions -Xmx1400m
-jar <https://builds.apache.org/job/HBase-0.92/ws/trunk/target/surefire/surefirebooter1242005373764859735.jar>
<https://builds.apache.org/job/HBase-0.92/ws/trunk/target/surefire/surefire8301797259858146379tmp>
<https://builds.apache.org/job/HBase-0.92/ws/trunk/target/surefire/surefire7328672305066470956tmp>
Running org.apache.hadoop.hbase.regionserver.TestStoreScanner
Tests run: 14, Failures: 0, Errors: 0, Skipped: 0, Time elapsed: 0.142 sec
Forking command line: /bin/sh -c cd <https://builds.apache.org/job/HBase-0.92/ws/trunk>
&& /home/jenkins/tools/java/jdk1.6.0_27-32/jre/bin/java -enableassertions -Xmx1400m
-jar <https://builds.apache.org/job/HBase-0.92/ws/trunk/target/surefire/surefirebooter4277475852110368095.jar>
<https://builds.apache.org/job/HBase-0.92/ws/trunk/target/surefire/surefire8521507042450059720tmp>
<https://builds.apache.org/job/HBase-0.92/ws/trunk/target/surefire/surefire958393921953187731tmp>
Running org.apache.hadoop.hbase.regionserver.TestResettingCounters
Tests run: 1, Failures: 0, Errors: 0, Skipped: 0, Time elapsed: 0.715 sec
Forking command line: /bin/sh -c cd <https://builds.apache.org/job/HBase-0.92/ws/trunk>
&& /home/jenkins/tools/java/jdk1.6.0_27-32/jre/bin/java -enableassertions -Xmx1400m
-jar <https://builds.apache.org/job/HBase-0.92/ws/trunk/target/surefire/surefirebooter1452035677800150761.jar>
<https://builds.apache.org/job/HBase-0.92/ws/trunk/target/surefire/surefire297625558078351519tmp>
<https://builds.apache.org/job/HBase-0.92/ws/trunk/target/surefire/surefire1171641870139212243tmp>
Running org.apache.hadoop.hbase.regionserver.TestStoreFile
Tests run: 8, Failures: 0, Errors: 0, Skipped: 0, Time elapsed: 1.689 sec
Forking command line: /bin/sh -c cd <https://builds.apache.org/job/HBase-0.92/ws/trunk>
&& /home/jenkins/tools/java/jdk1.6.0_27-32/jre/bin/java -enableassertions -Xmx1400m
-jar <https://builds.apache.org/job/HBase-0.92/ws/trunk/target/surefire/surefirebooter6714391091428302275.jar>
<https://builds.apache.org/job/HBase-0.92/ws/trunk/target/surefire/surefire4133740264711169033tmp>
<https://builds.apache.org/job/HBase-0.92/ws/trunk/target/surefire/surefire2683017619242723687tmp>
Running org.apache.hadoop.hbase.regionserver.TestEndToEndSplitTransaction
Tests run: 1, Failures: 0, Errors: 0, Skipped: 0, Time elapsed: 42.924 sec
Forking command line: /bin/sh -c cd <https://builds.apache.org/job/HBase-0.92/ws/trunk>
&& /home/jenkins/tools/java/jdk1.6.0_27-32/jre/bin/java -enableassertions -Xmx1400m
-jar <https://builds.apache.org/job/HBase-0.92/ws/trunk/target/surefire/surefirebooter7066901051659676289.jar>
<https://builds.apache.org/job/HBase-0.92/ws/trunk/target/surefire/surefire1516934309055031264tmp>
<https://builds.apache.org/job/HBase-0.92/ws/trunk/target/surefire/surefire4336660849053706459tmp>
Running org.apache.hadoop.hbase.regionserver.TestScanWildcardColumnTracker
Tests run: 2, Failures: 0, Errors: 0, Skipped: 0, Time elapsed: 0.46 sec
Forking command line: /bin/sh -c cd <https://builds.apache.org/job/HBase-0.92/ws/trunk>
&& /home/jenkins/tools/java/jdk1.6.0_27-32/jre/bin/java -enableassertions -Xmx1400m
-jar <https://builds.apache.org/job/HBase-0.92/ws/trunk/target/surefire/surefirebooter5521462610593921309.jar>
<https://builds.apache.org/job/HBase-0.92/ws/trunk/target/surefire/surefire1307783603056921353tmp>
<https://builds.apache.org/job/HBase-0.92/ws/trunk/target/surefire/surefire6007446020538564323tmp>
Running org.apache.hadoop.hbase.regionserver.TestCompaction
Tests run: 10, Failures: 0, Errors: 0, Skipped: 0, Time elapsed: 12.023 sec
Forking command line: /bin/sh -c cd <https://builds.apache.org/job/HBase-0.92/ws/trunk>
&& /home/jenkins/tools/java/jdk1.6.0_27-32/jre/bin/java -enableassertions -Xmx1400m
-jar <https://builds.apache.org/job/HBase-0.92/ws/trunk/target/surefire/surefirebooter1055612559454906580.jar>
<https://builds.apache.org/job/HBase-0.92/ws/trunk/target/surefire/surefire6364229708160765112tmp>
<https://builds.apache.org/job/HBase-0.92/ws/trunk/target/surefire/surefire1756550006380715113tmp>
Running org.apache.hadoop.hbase.regionserver.TestQueryMatcher
Tests run: 4, Failures: 0, Errors: 0, Skipped: 0, Time elapsed: 0.537 sec
Forking command line: /bin/sh -c cd <https://builds.apache.org/job/HBase-0.92/ws/trunk>
&& /home/jenkins/tools/java/jdk1.6.0_27-32/jre/bin/java -enableassertions -Xmx1400m
-jar <https://builds.apache.org/job/HBase-0.92/ws/trunk/target/surefire/surefirebooter4328751641705954617.jar>
<https://builds.apache.org/job/HBase-0.92/ws/trunk/target/surefire/surefire1369157551083611640tmp>
<https://builds.apache.org/job/HBase-0.92/ws/trunk/target/surefire/surefire9031970996560032210tmp>
Running org.apache.hadoop.hbase.regionserver.TestRpcMetrics
Tests run: 1, Failures: 0, Errors: 0, Skipped: 0, Time elapsed: 2.024 sec
Forking command line: /bin/sh -c cd <https://builds.apache.org/job/HBase-0.92/ws/trunk>
&& /home/jenkins/tools/java/jdk1.6.0_27-32/jre/bin/java -enableassertions -Xmx1400m
-jar <https://builds.apache.org/job/HBase-0.92/ws/trunk/target/surefire/surefirebooter9106876757876852530.jar>
<https://builds.apache.org/job/HBase-0.92/ws/trunk/target/surefire/surefire4194786931299934529tmp>
<https://builds.apache.org/job/HBase-0.92/ws/trunk/target/surefire/surefire2338765140240264482tmp>
Running org.apache.hadoop.hbase.regionserver.TestScanner
Tests run: 6, Failures: 0, Errors: 0, Skipped: 0, Time elapsed: 4.571 sec
Forking command line: /bin/sh -c cd <https://builds.apache.org/job/HBase-0.92/ws/trunk>
&& /home/jenkins/tools/java/jdk1.6.0_27-32/jre/bin/java -enableassertions -Xmx1400m
-jar <https://builds.apache.org/job/HBase-0.92/ws/trunk/target/surefire/surefirebooter9159774704029465027.jar>
<https://builds.apache.org/job/HBase-0.92/ws/trunk/target/surefire/surefire2757470767553868634tmp>
<https://builds.apache.org/job/HBase-0.92/ws/trunk/target/surefire/surefire1876971199490502782tmp>
Running org.apache.hadoop.hbase.regionserver.TestMultiColumnScanner
Tests run: 6, Failures: 0, Errors: 0, Skipped: 0, Time elapsed: 18.21 sec
Forking command line: /bin/sh -c cd <https://builds.apache.org/job/HBase-0.92/ws/trunk>
&& /home/jenkins/tools/java/jdk1.6.0_27-32/jre/bin/java -enableassertions -Xmx1400m
-jar <https://builds.apache.org/job/HBase-0.92/ws/trunk/target/surefire/surefirebooter489550396684753124.jar>
<https://builds.apache.org/job/HBase-0.92/ws/trunk/target/surefire/surefire3889928836885572283tmp>
<https://builds.apache.org/job/HBase-0.92/ws/trunk/target/surefire/surefire3373480061278980874tmp>
Running org.apache.hadoop.hbase.regionserver.TestRegionSplitPolicy
Tests run: 3, Failures: 0, Errors: 0, Skipped: 0, Time elapsed: 0.701 sec
Forking command line: /bin/sh -c cd <https://builds.apache.org/job/HBase-0.92/ws/trunk>
&& /home/jenkins/tools/java/jdk1.6.0_27-32/jre/bin/java -enableassertions -Xmx1400m
-jar <https://builds.apache.org/job/HBase-0.92/ws/trunk/target/surefire/surefirebooter3227091330350029701.jar>
<https://builds.apache.org/job/HBase-0.92/ws/trunk/target/surefire/surefire6269822146565257653tmp>
<https://builds.apache.org/job/HBase-0.92/ws/trunk/target/surefire/surefire4539990527580942343tmp>
Running org.apache.hadoop.hbase.regionserver.TestKeyValueSkipListSet
Tests run: 4, Failures: 0, Errors: 0, Skipped: 0, Time elapsed: 0.121 sec
Forking command line: /bin/sh -c cd <https://builds.apache.org/job/HBase-0.92/ws/trunk>
&& /home/jenkins/tools/java/jdk1.6.0_27-32/jre/bin/java -enableassertions -Xmx1400m
-jar <https://builds.apache.org/job/HBase-0.92/ws/trunk/target/surefire/surefirebooter3093819645199038987.jar>
<https://builds.apache.org/job/HBase-0.92/ws/trunk/target/surefire/surefire3462517435024819389tmp>
<https://builds.apache.org/job/HBase-0.92/ws/trunk/target/surefire/surefire1621387703286015319tmp>
Running org.apache.hadoop.hbase.mapred.TestTableMapReduce
Tests run: 1, Failures: 0, Errors: 0, Skipped: 0, Time elapsed: 61.39 sec
Forking command line: /bin/sh -c cd <https://builds.apache.org/job/HBase-0.92/ws/trunk>
&& /home/jenkins/tools/java/jdk1.6.0_27-32/jre/bin/java -enableassertions -Xmx1400m
-jar <https://builds.apache.org/job/HBase-0.92/ws/trunk/target/surefire/surefirebooter8560780603157311048.jar>
<https://builds.apache.org/job/HBase-0.92/ws/trunk/target/surefire/surefire571435080697408819tmp>
<https://builds.apache.org/job/HBase-0.92/ws/trunk/target/surefire/surefire6377212948234302277tmp>
Running org.apache.hadoop.hbase.mapred.TestTableInputFormat
Tests run: 6, Failures: 0, Errors: 0, Skipped: 0, Time elapsed: 21.495 sec
Forking command line: /bin/sh -c cd <https://builds.apache.org/job/HBase-0.92/ws/trunk>
&& /home/jenkins/tools/java/jdk1.6.0_27-32/jre/bin/java -enableassertions -Xmx1400m
-jar <https://builds.apache.org/job/HBase-0.92/ws/trunk/target/surefire/surefirebooter7561664963502076287.jar>
<https://builds.apache.org/job/HBase-0.92/ws/trunk/target/surefire/surefire3217088313143242027tmp>
<https://builds.apache.org/job/HBase-0.92/ws/trunk/target/surefire/surefire6869655505256988184tmp>
Running org.apache.hadoop.hbase.TestFSTableDescriptorForceCreation
Tests run: 3, Failures: 0, Errors: 0, Skipped: 0, Time elapsed: 0.52 sec
Forking command line: /bin/sh -c cd <https://builds.apache.org/job/HBase-0.92/ws/trunk>
&& /home/jenkins/tools/java/jdk1.6.0_27-32/jre/bin/java -enableassertions -Xmx1400m
-jar <https://builds.apache.org/job/HBase-0.92/ws/trunk/target/surefire/surefirebooter4926790319988899920.jar>
<https://builds.apache.org/job/HBase-0.92/ws/trunk/target/surefire/surefire61996187475633439tmp>
<https://builds.apache.org/job/HBase-0.92/ws/trunk/target/surefire/surefire8421301197022732163tmp>
Running org.apache.hadoop.hbase.executor.TestExecutorService
Tests run: 1, Failures: 0, Errors: 0, Skipped: 0, Time elapsed: 2.435 sec
Forking command line: /bin/sh -c cd <https://builds.apache.org/job/HBase-0.92/ws/trunk>
&& /home/jenkins/tools/java/jdk1.6.0_27-32/jre/bin/java -enableassertions -Xmx1400m
-jar <https://builds.apache.org/job/HBase-0.92/ws/trunk/target/surefire/surefirebooter3800753083762544084.jar>
<https://builds.apache.org/job/HBase-0.92/ws/trunk/target/surefire/surefire1084767673972291921tmp>
<https://builds.apache.org/job/HBase-0.92/ws/trunk/target/surefire/surefire4435414156540404652tmp>
Running org.apache.hadoop.hbase.mapreduce.TestTimeRangeMapRed
Tests run: 1, Failures: 0, Errors: 0, Skipped: 0, Time elapsed: 38.814 sec
Forking command line: /bin/sh -c cd <https://builds.apache.org/job/HBase-0.92/ws/trunk>
&& /home/jenkins/tools/java/jdk1.6.0_27-32/jre/bin/java -enableassertions -Xmx1400m
-jar <https://builds.apache.org/job/HBase-0.92/ws/trunk/target/surefire/surefirebooter4495630484455199584.jar>
<https://builds.apache.org/job/HBase-0.92/ws/trunk/target/surefire/surefire8621694777605064511tmp>
<https://builds.apache.org/job/HBase-0.92/ws/trunk/target/surefire/surefire8100957294577782066tmp>
Running org.apache.hadoop.hbase.mapreduce.TestHFileOutputFormat
Tests run: 8, Failures: 0, Errors: 0, Skipped: 0, Time elapsed: 148.453 sec
Forking command line: /bin/sh -c cd <https://builds.apache.org/job/HBase-0.92/ws/trunk>
&& /home/jenkins/tools/java/jdk1.6.0_27-32/jre/bin/java -enableassertions -Xmx1400m
-jar <https://builds.apache.org/job/HBase-0.92/ws/trunk/target/surefire/surefirebooter751096918516650362.jar>
<https://builds.apache.org/job/HBase-0.92/ws/trunk/target/surefire/surefire3099835638467226645tmp>
<https://builds.apache.org/job/HBase-0.92/ws/trunk/target/surefire/surefire1603185912432189017tmp>
Running org.apache.hadoop.hbase.mapreduce.TestImportTsv
Tests run: 8, Failures: 0, Errors: 0, Skipped: 0, Time elapsed: 41.243 sec
Forking command line: /bin/sh -c cd <https://builds.apache.org/job/HBase-0.92/ws/trunk>
&& /home/jenkins/tools/java/jdk1.6.0_27-32/jre/bin/java -enableassertions -Xmx1400m
-jar <https://builds.apache.org/job/HBase-0.92/ws/trunk/target/surefire/surefirebooter6938396168880808709.jar>
<https://builds.apache.org/job/HBase-0.92/ws/trunk/target/surefire/surefire5514809914465296512tmp>
<https://builds.apache.org/job/HBase-0.92/ws/trunk/target/surefire/surefire1024315773116664078tmp>
Running org.apache.hadoop.hbase.mapreduce.TestTableInputFormatScan
Tests run: 11, Failures: 0, Errors: 0, Skipped: 0, Time elapsed: 510.398 sec
Forking command line: /bin/sh -c cd <https://builds.apache.org/job/HBase-0.92/ws/trunk>
&& /home/jenkins/tools/java/jdk1.6.0_27-32/jre/bin/java -enableassertions -Xmx1400m
-jar <https://builds.apache.org/job/HBase-0.92/ws/trunk/target/surefire/surefirebooter6412261289269881690.jar>
<https://builds.apache.org/job/HBase-0.92/ws/trunk/target/surefire/surefire6420103598444024373tmp>
<https://builds.apache.org/job/HBase-0.92/ws/trunk/target/surefire/surefire8562794827764846904tmp>
Running org.apache.hadoop.hbase.mapreduce.TestLoadIncrementalHFilesSplitRecovery
Tests run: 3, Failures: 0, Errors: 0, Skipped: 0, Time elapsed: 76.016 sec
Forking command line: /bin/sh -c cd <https://builds.apache.org/job/HBase-0.92/ws/trunk>
&& /home/jenkins/tools/java/jdk1.6.0_27-32/jre/bin/java -enableassertions -Xmx1400m
-jar <https://builds.apache.org/job/HBase-0.92/ws/trunk/target/surefire/surefirebooter8621870285263168972.jar>
<https://builds.apache.org/job/HBase-0.92/ws/trunk/target/surefire/surefire4156754685306876266tmp>
<https://builds.apache.org/job/HBase-0.92/ws/trunk/target/surefire/surefire4874022499495489196tmp>
Running org.apache.hadoop.hbase.mapreduce.TestTableSplit
Tests run: 1, Failures: 0, Errors: 0, Skipped: 0, Time elapsed: 0.133 sec
Forking command line: /bin/sh -c cd <https://builds.apache.org/job/HBase-0.92/ws/trunk>
&& /home/jenkins/tools/java/jdk1.6.0_27-32/jre/bin/java -enableassertions -Xmx1400m
-jar <https://builds.apache.org/job/HBase-0.92/ws/trunk/target/surefire/surefirebooter4475807427263888682.jar>
<https://builds.apache.org/job/HBase-0.92/ws/trunk/target/surefire/surefire842765399141765778tmp>
<https://builds.apache.org/job/HBase-0.92/ws/trunk/target/surefire/surefire2658776892719734083tmp>
Running org.apache.hadoop.hbase.mapreduce.TestSimpleTotalOrderPartitioner
Tests run: 1, Failures: 0, Errors: 0, Skipped: 0, Time elapsed: 0.423 sec
Forking command line: /bin/sh -c cd <https://builds.apache.org/job/HBase-0.92/ws/trunk>
&& /home/jenkins/tools/java/jdk1.6.0_27-32/jre/bin/java -enableassertions -Xmx1400m
-jar <https://builds.apache.org/job/HBase-0.92/ws/trunk/target/surefire/surefirebooter6392592258970267580.jar>
<https://builds.apache.org/job/HBase-0.92/ws/trunk/target/surefire/surefire4493357245803728034tmp>
<https://builds.apache.org/job/HBase-0.92/ws/trunk/target/surefire/surefire5454526971547273154tmp>
Running org.apache.hadoop.hbase.mapreduce.TestTableMapReduce
Tests run: 1, Failures: 0, Errors: 0, Skipped: 0, Time elapsed: 92.464 sec
Forking command line: /bin/sh -c cd <https://builds.apache.org/job/HBase-0.92/ws/trunk>
&& /home/jenkins/tools/java/jdk1.6.0_27-32/jre/bin/java -enableassertions -Xmx1400m
-jar <https://builds.apache.org/job/HBase-0.92/ws/trunk/target/surefire/surefirebooter2157466835600508250.jar>
<https://builds.apache.org/job/HBase-0.92/ws/trunk/target/surefire/surefire7503502858955900464tmp>
<https://builds.apache.org/job/HBase-0.92/ws/trunk/target/surefire/surefire5377869143490149632tmp>
Running org.apache.hadoop.hbase.mapreduce.TestLoadIncrementalHFiles
Tests run: 6, Failures: 0, Errors: 0, Skipped: 0, Time elapsed: 30.501 sec
Forking command line: /bin/sh -c cd <https://builds.apache.org/job/HBase-0.92/ws/trunk>
&& /home/jenkins/tools/java/jdk1.6.0_27-32/jre/bin/java -enableassertions -Xmx1400m
-jar <https://builds.apache.org/job/HBase-0.92/ws/trunk/target/surefire/surefirebooter6950237845674771658.jar>
<https://builds.apache.org/job/HBase-0.92/ws/trunk/target/surefire/surefire6181280969245509993tmp>
<https://builds.apache.org/job/HBase-0.92/ws/trunk/target/surefire/surefire2520307391170288398tmp>
Running org.apache.hadoop.hbase.TestHRegionLocation
Tests run: 3, Failures: 0, Errors: 0, Skipped: 0, Time elapsed: 0.14 sec

Results :

Failed tests:   testGlobalMemStore(org.apache.hadoop.hbase.TestGlobalMemStoreSize): expected:<496>
but was:<0>

Tests run: 1040, Failures: 1, Errors: 0, Skipped: 9

[INFO] ------------------------------------------------------------------------
[INFO] BUILD FAILURE
[INFO] ------------------------------------------------------------------------
[INFO] Total time: 1:37:39.175s
[INFO] Finished at: Wed Nov 02 02:56:08 UTC 2011
[INFO] Final Memory: 44M/967M
[INFO] ------------------------------------------------------------------------
[ERROR] Failed to execute goal org.apache.maven.plugins:maven-surefire-plugin:2.9:test (default-test)
on project hbase: There are test failures.
[ERROR] 
[ERROR] Please refer to <https://builds.apache.org/job/HBase-0.92/ws/trunk/target/surefire-reports>
for the individual test results.
[ERROR] -> [Help 1]
org.apache.maven.lifecycle.LifecycleExecutionException: Failed to execute goal org.apache.maven.plugins:maven-surefire-plugin:2.9:test
(default-test) on project hbase: There are test failures.

Please refer to <https://builds.apache.org/job/HBase-0.92/ws/trunk/target/surefire-reports>
for the individual test results.
	at org.apache.maven.lifecycle.internal.MojoExecutor.execute(MojoExecutor.java:213)
	at org.apache.maven.lifecycle.internal.MojoExecutor.execute(MojoExecutor.java:153)
	at org.apache.maven.lifecycle.internal.MojoExecutor.execute(MojoExecutor.java:145)
	at org.apache.maven.lifecycle.internal.MojoExecutor.executeForkedExecutions(MojoExecutor.java:365)
	at org.apache.maven.lifecycle.internal.MojoExecutor.execute(MojoExecutor.java:199)
	at org.apache.maven.lifecycle.internal.MojoExecutor.execute(MojoExecutor.java:153)
	at org.apache.maven.lifecycle.internal.MojoExecutor.execute(MojoExecutor.java:145)
	at org.apache.maven.lifecycle.internal.LifecycleModuleBuilder.buildProject(LifecycleModuleBuilder.java:84)
	at org.apache.maven.lifecycle.internal.LifecycleModuleBuilder.buildProject(LifecycleModuleBuilder.java:59)
	at org.apache.maven.lifecycle.internal.LifecycleStarter.singleThreadedBuild(LifecycleStarter.java:183)
	at org.apache.maven.lifecycle.internal.LifecycleStarter.execute(LifecycleStarter.java:161)
	at org.apache.maven.DefaultMaven.doExecute(DefaultMaven.java:319)
	at org.apache.maven.DefaultMaven.execute(DefaultMaven.java:156)
	at org.apache.maven.cli.MavenCli.execute(MavenCli.java:537)
	at org.apache.maven.cli.MavenCli.doMain(MavenCli.java:196)
	at org.apache.maven.cli.MavenCli.main(MavenCli.java:141)
	at sun.reflect.NativeMethodAccessorImpl.invoke0(Native Method)
	at sun.reflect.NativeMethodAccessorImpl.invoke(NativeMethodAccessorImpl.java:39)
	at sun.reflect.DelegatingMethodAccessorImpl.invoke(DelegatingMethodAccessorImpl.java:25)
	at java.lang.reflect.Method.invoke(Method.java:597)
	at org.codehaus.plexus.classworlds.launcher.Launcher.launchEnhanced(Launcher.java:290)
	at org.codehaus.plexus.classworlds.launcher.Launcher.launch(Launcher.java:230)
	at org.codehaus.plexus.classworlds.launcher.Launcher.mainWithExitCode(Launcher.java:409)
	at org.codehaus.plexus.classworlds.launcher.Launcher.main(Launcher.java:352)
Caused by: org.apache.maven.plugin.MojoFailureException: There are test failures.

Please refer to <https://builds.apache.org/job/HBase-0.92/ws/trunk/target/surefire-reports>
for the individual test results.
	at org.apache.maven.plugin.surefire.SurefireHelper.reportExecution(SurefireHelper.java:87)
	at org.apache.maven.plugin.surefire.SurefirePlugin.writeSummary(SurefirePlugin.java:631)
	at org.apache.maven.plugin.surefire.SurefirePlugin.handleSummary(SurefirePlugin.java:605)
	at org.apache.maven.plugin.surefire.AbstractSurefireMojo.executeAfterPreconditionsChecked(AbstractSurefireMojo.java:136)
	at org.apache.maven.plugin.surefire.AbstractSurefireMojo.execute(AbstractSurefireMojo.java:97)
	at org.apache.maven.plugin.DefaultBuildPluginManager.executeMojo(DefaultBuildPluginManager.java:101)
	at org.apache.maven.lifecycle.internal.MojoExecutor.execute(MojoExecutor.java:209)
	... 23 more
[ERROR] 
[ERROR] 
[ERROR] For more information about the errors and possible solutions, please read the following
articles:
[ERROR] [Help 1] http://cwiki.apache.org/confluence/display/MAVEN/MojoFailureException
Build step 'Invoke top-level Maven targets' marked build as failure
[locks-and-latches] Releasing all the locks
[locks-and-latches] All the locks released
Archiving artifacts
Recording test results
Updating HBASE-3515
Updating HBASE-4611
Updating HBASE-4510
Updating HBASE-4711
Updating HBASE-4708


Mime
View raw message