hbase-dev mailing list archives

Site index · List index
Message view « Date » · « Thread »
Top « Date » · « Thread »
From Apache Jenkins Server <jenk...@builds.apache.org>
Subject Build failed in Jenkins: HBase-0.92-security #2
Date Mon, 21 Nov 2011 01:15:57 GMT
See <https://builds.apache.org/job/HBase-0.92-security/2/changes>

Changes:

[tedyu] HBASE-2418 Addendum adds Gary's maven repo to pom.xml

[apurtell] HBASE-2418 Support for ZooKeeper authentication

------------------------------------------
[...truncated 1418 lines...]
[DEBUG] Goal:          com.agilejava.docbkx:docbkx-maven-plugin:2.0.11:generate-html (multipage)
[DEBUG] Style:         Regular
[DEBUG] Configuration: <?xml version="1.0" encoding="UTF-8"?>
<configuration>
  <artifacts>${plugin.artifacts}</artifacts>
  <chunkedOutput>true</chunkedOutput>
  <htmlStylesheet>../css/freebsd_docbook.css</htmlStylesheet>
  <imgSrcPath>../images/</imgSrcPath>
  <includes default-value="*.xml"/>
  <navigShowtitles>true</navigShowtitles>
  <project>${project}</project>
  <sectionAutolabel>true</sectionAutolabel>
  <sectionAutolabelMaxDepth>100</sectionAutolabelMaxDepth>
  <sectionLabelIncludesComponentLabel>true</sectionLabelIncludesComponentLabel>
  <sourceDirectory>${basedir}/src/docbkx</sourceDirectory>
  <targetDirectory><https://builds.apache.org/job/HBase-0.92-security/ws/trunk/target/site/book/</targetDirectory>>
  <targetFileExtension default-value="html"/>
  <useIdAsFilename>true</useIdAsFilename>
  <xincludeSupported>true</xincludeSupported>
</configuration>
[DEBUG] -----------------------------------------------------------------------
[DEBUG] Goal:          com.agilejava.docbkx:docbkx-maven-plugin:2.0.11:generate-html (onepage)
[DEBUG] Style:         Regular
[DEBUG] Configuration: <?xml version="1.0" encoding="UTF-8"?>
<configuration>
  <artifacts>${plugin.artifacts}</artifacts>
  <htmlStylesheet>css/freebsd_docbook.css</htmlStylesheet>
  <imgSrcPath>images/</imgSrcPath>
  <includes default-value="*.xml"/>
  <project>${project}</project>
  <sectionAutolabel>true</sectionAutolabel>
  <sectionAutolabelMaxDepth>100</sectionAutolabelMaxDepth>
  <sectionLabelIncludesComponentLabel>true</sectionLabelIncludesComponentLabel>
  <sourceDirectory>${basedir}/src/docbkx</sourceDirectory>
  <targetDirectory><https://builds.apache.org/job/HBase-0.92-security/ws/trunk/target/site/</targetDirectory>>
  <targetFileExtension default-value="html"/>
  <useIdAsFilename>true</useIdAsFilename>
  <xincludeSupported>true</xincludeSupported>
</configuration>
[DEBUG] -----------------------------------------------------------------------
[DEBUG] Goal:          org.apache.maven.plugins:maven-site-plugin:2.0.1:site (default-site)
[DEBUG] Style:         Regular
[DEBUG] Configuration: <?xml version="1.0" encoding="UTF-8"?>
<configuration>
  <attributes>${attributes}</attributes>
  <generateReports default-value="true">${generateReports}</generateReports>
  <generatedSiteDirectory>${project.build.directory}/generated-site</generatedSiteDirectory>
  <inputEncoding default-value="${project.build.sourceEncoding}">${encoding}</inputEncoding>
  <localRepository>${localRepository}</localRepository>
  <locales>${locales}</locales>
  <outputDirectory default-value="${project.reporting.outputDirectory}"><https://builds.apache.org/job/HBase-0.92-security/ws/trunk/target/site</outputDirectory>>
  <outputEncoding default-value="${project.reporting.outputEncoding}">${outputEncoding}</outputEncoding>
  <project>${project}</project>
  <reactorProjects>${reactorProjects}</reactorProjects>
  <reports>${reports}</reports>
  <repositories>${project.remoteArtifactRepositories}</repositories>
  <siteDirectory>${basedir}/src/site</siteDirectory>
  <template>${template}</template>
  <templateDirectory default-value="src/site">${templateDirectory}</templateDirectory>
  <templateFile>${templateFile}</templateFile>
  <xdocDirectory default-value="${basedir}/xdocs"/>
</configuration>
[DEBUG] =======================================================================
[DEBUG] Could not find metadata org.apache.zookeeper:zookeeper:3.4.0-SNAPSHOT/maven-metadata.xml
in local (/home/jenkins/.m2/repository)
[DEBUG] Failure to find org.apache.zookeeper:zookeeper:3.4.0-SNAPSHOT/maven-metadata.xml in
https://repository.apache.org/content/repositories/releases/ was cached in the local repository,
resolution will not be reattempted until the update interval of apache release has elapsed
or updates are forced
[DEBUG] Skipped remote update check for org.apache.zookeeper:zookeeper:3.4.0-SNAPSHOT/maven-metadata.xml,
locally cached metadata up-to-date.
[DEBUG] Failure to find org.apache.zookeeper:zookeeper:3.4.0-SNAPSHOT/maven-metadata.xml in
http://repository.apache.org/snapshots was cached in the local repository, resolution will
not be reattempted until the update interval of Nexus has elapsed or updates are forced
[DEBUG] Could not find metadata org.apache.hadoop:hadoop-core:0.20.205.1-7070-SNAPSHOT/maven-metadata.xml
in local (/home/jenkins/.m2/repository)
[DEBUG] Using connector WagonRepositoryConnector with priority 0 for https://repository.apache.org/content/repositories/releases/
[DEBUG] Using connector WagonRepositoryConnector with priority 0 for http://people.apache.org/~garyh/mvn/
[DEBUG] Using connector WagonRepositoryConnector with priority 0 for http://repository.apache.org/snapshots
Downloading: http://repository.apache.org/snapshots/org/apache/hadoop/hadoop-core/0.20.205.1-7070-SNAPSHOT/maven-metadata.xml
Downloading: https://repository.apache.org/content/repositories/releases/org/apache/hadoop/hadoop-core/0.20.205.1-7070-SNAPSHOT/maven-metadata.xml
Downloading: http://people.apache.org/~garyh/mvn/org/apache/hadoop/hadoop-core/0.20.205.1-7070-SNAPSHOT/maven-metadata.xml
374 B   
        
Downloaded: http://people.apache.org/~garyh/mvn/org/apache/hadoop/hadoop-core/0.20.205.1-7070-SNAPSHOT/maven-metadata.xml
(374 B at 1.5 KB/sec)
[DEBUG] Reading resolution tracking file /home/jenkins/.m2/repository/org/apache/hadoop/hadoop-core/0.20.205.1-7070-SNAPSHOT/resolver-status.properties
[DEBUG] Writing resolution tracking file /home/jenkins/.m2/repository/org/apache/hadoop/hadoop-core/0.20.205.1-7070-SNAPSHOT/resolver-status.properties
        
[DEBUG] Reading resolution tracking file /home/jenkins/.m2/repository/org/apache/hadoop/hadoop-core/0.20.205.1-7070-SNAPSHOT/resolver-status.properties
[DEBUG] Writing resolution tracking file /home/jenkins/.m2/repository/org/apache/hadoop/hadoop-core/0.20.205.1-7070-SNAPSHOT/resolver-status.properties
        
[DEBUG] Reading resolution tracking file /home/jenkins/.m2/repository/org/apache/hadoop/hadoop-core/0.20.205.1-7070-SNAPSHOT/resolver-status.properties
[DEBUG] Writing resolution tracking file /home/jenkins/.m2/repository/org/apache/hadoop/hadoop-core/0.20.205.1-7070-SNAPSHOT/resolver-status.properties
[DEBUG] Could not find metadata org.apache.hadoop:hadoop-core:0.20.205.1-7070-SNAPSHOT/maven-metadata.xml
in apache release (https://repository.apache.org/content/repositories/releases/)
[DEBUG] Could not find metadata org.apache.hadoop:hadoop-core:0.20.205.1-7070-SNAPSHOT/maven-metadata.xml
in Nexus (http://repository.apache.org/snapshots)
[DEBUG] Using connector WagonRepositoryConnector with priority 0 for https://repository.apache.org/content/repositories/releases/
Downloading: https://repository.apache.org/content/repositories/releases/org/apache/hadoop/hadoop-core/0.20.205.1-7070-SNAPSHOT/hadoop-core-0.20.205.1-7070-20111103.180708-1.pom
        
[DEBUG] Reading resolution tracking file /home/jenkins/.m2/repository/org/apache/hadoop/hadoop-core/0.20.205.1-7070-SNAPSHOT/hadoop-core-0.20.205.1-7070-20111103.180708-1.pom.lastUpdated
[DEBUG] Writing resolution tracking file /home/jenkins/.m2/repository/org/apache/hadoop/hadoop-core/0.20.205.1-7070-SNAPSHOT/hadoop-core-0.20.205.1-7070-20111103.180708-1.pom.lastUpdated
[DEBUG] Using connector WagonRepositoryConnector with priority 0 for http://people.apache.org/~garyh/mvn/
Downloading: http://people.apache.org/~garyh/mvn/org/apache/hadoop/hadoop-core/0.20.205.1-7070-SNAPSHOT/hadoop-core-0.20.205.1-7070-20111103.180708-1.pom
        
[DEBUG] Reading resolution tracking file /home/jenkins/.m2/repository/org/apache/hadoop/hadoop-core/0.20.205.1-7070-SNAPSHOT/hadoop-core-0.20.205.1-7070-20111103.180708-1.pom.lastUpdated
[DEBUG] Writing resolution tracking file /home/jenkins/.m2/repository/org/apache/hadoop/hadoop-core/0.20.205.1-7070-SNAPSHOT/hadoop-core-0.20.205.1-7070-20111103.180708-1.pom.lastUpdated
[DEBUG] Using connector WagonRepositoryConnector with priority 0 for http://repository.apache.org/snapshots
Downloading: http://repository.apache.org/snapshots/org/apache/hadoop/hadoop-core/0.20.205.1-7070-SNAPSHOT/hadoop-core-0.20.205.1-7070-20111103.180708-1.pom
        
[DEBUG] Reading resolution tracking file /home/jenkins/.m2/repository/org/apache/hadoop/hadoop-core/0.20.205.1-7070-SNAPSHOT/hadoop-core-0.20.205.1-7070-20111103.180708-1.pom.lastUpdated
[DEBUG] Writing resolution tracking file /home/jenkins/.m2/repository/org/apache/hadoop/hadoop-core/0.20.205.1-7070-SNAPSHOT/hadoop-core-0.20.205.1-7070-20111103.180708-1.pom.lastUpdated
[DEBUG] Could not find metadata org.apache.hadoop:hadoop-test:0.20.205.1-7070-SNAPSHOT/maven-metadata.xml
in local (/home/jenkins/.m2/repository)
[DEBUG] Using connector WagonRepositoryConnector with priority 0 for http://people.apache.org/~garyh/mvn/
[DEBUG] Using connector WagonRepositoryConnector with priority 0 for https://repository.apache.org/content/repositories/releases/
[DEBUG] Using connector WagonRepositoryConnector with priority 0 for http://repository.apache.org/snapshots
Downloading: http://people.apache.org/~garyh/mvn/org/apache/hadoop/hadoop-test/0.20.205.1-7070-SNAPSHOT/maven-metadata.xml
Downloading: https://repository.apache.org/content/repositories/releases/org/apache/hadoop/hadoop-test/0.20.205.1-7070-SNAPSHOT/maven-metadata.xml
Downloading: http://repository.apache.org/snapshots/org/apache/hadoop/hadoop-test/0.20.205.1-7070-SNAPSHOT/maven-metadata.xml
374 B   
        
[DEBUG] Reading resolution tracking file /home/jenkins/.m2/repository/org/apache/hadoop/hadoop-test/0.20.205.1-7070-SNAPSHOT/resolver-status.properties
[DEBUG] Writing resolution tracking file /home/jenkins/.m2/repository/org/apache/hadoop/hadoop-test/0.20.205.1-7070-SNAPSHOT/resolver-status.properties
        
Downloaded: http://people.apache.org/~garyh/mvn/org/apache/hadoop/hadoop-test/0.20.205.1-7070-SNAPSHOT/maven-metadata.xml
(374 B at 2.9 KB/sec)
[DEBUG] Reading resolution tracking file /home/jenkins/.m2/repository/org/apache/hadoop/hadoop-test/0.20.205.1-7070-SNAPSHOT/resolver-status.properties
[DEBUG] Writing resolution tracking file /home/jenkins/.m2/repository/org/apache/hadoop/hadoop-test/0.20.205.1-7070-SNAPSHOT/resolver-status.properties
        
[DEBUG] Reading resolution tracking file /home/jenkins/.m2/repository/org/apache/hadoop/hadoop-test/0.20.205.1-7070-SNAPSHOT/resolver-status.properties
[DEBUG] Writing resolution tracking file /home/jenkins/.m2/repository/org/apache/hadoop/hadoop-test/0.20.205.1-7070-SNAPSHOT/resolver-status.properties
[DEBUG] Could not find metadata org.apache.hadoop:hadoop-test:0.20.205.1-7070-SNAPSHOT/maven-metadata.xml
in apache release (https://repository.apache.org/content/repositories/releases/)
[DEBUG] Could not find metadata org.apache.hadoop:hadoop-test:0.20.205.1-7070-SNAPSHOT/maven-metadata.xml
in Nexus (http://repository.apache.org/snapshots)
[DEBUG] Using connector WagonRepositoryConnector with priority 0 for https://repository.apache.org/content/repositories/releases/
Downloading: https://repository.apache.org/content/repositories/releases/org/apache/hadoop/hadoop-test/0.20.205.1-7070-SNAPSHOT/hadoop-test-0.20.205.1-7070-20111103.180814-1.pom
        
[DEBUG] Reading resolution tracking file /home/jenkins/.m2/repository/org/apache/hadoop/hadoop-test/0.20.205.1-7070-SNAPSHOT/hadoop-test-0.20.205.1-7070-20111103.180814-1.pom.lastUpdated
[DEBUG] Writing resolution tracking file /home/jenkins/.m2/repository/org/apache/hadoop/hadoop-test/0.20.205.1-7070-SNAPSHOT/hadoop-test-0.20.205.1-7070-20111103.180814-1.pom.lastUpdated
[DEBUG] Using connector WagonRepositoryConnector with priority 0 for http://people.apache.org/~garyh/mvn/
Downloading: http://people.apache.org/~garyh/mvn/org/apache/hadoop/hadoop-test/0.20.205.1-7070-SNAPSHOT/hadoop-test-0.20.205.1-7070-20111103.180814-1.pom
3 KB    
       
Downloaded: http://people.apache.org/~garyh/mvn/org/apache/hadoop/hadoop-test/0.20.205.1-7070-SNAPSHOT/hadoop-test-0.20.205.1-7070-20111103.180814-1.pom
(3 KB at 20.3 KB/sec)
[DEBUG] Reading resolution tracking file /home/jenkins/.m2/repository/org/apache/hadoop/hadoop-test/0.20.205.1-7070-SNAPSHOT/hadoop-test-0.20.205.1-7070-20111103.180814-1.pom.lastUpdated
[DEBUG] Writing resolution tracking file /home/jenkins/.m2/repository/org/apache/hadoop/hadoop-test/0.20.205.1-7070-SNAPSHOT/hadoop-test-0.20.205.1-7070-20111103.180814-1.pom.lastUpdated
[DEBUG] Using connector WagonRepositoryConnector with priority 0 for http://people.apache.org/~garyh/mvn/
Downloading: http://people.apache.org/~garyh/mvn/org/apache/hadoop/hadoop-core/0.20.205.1-7070-SNAPSHOT/hadoop-core-0.20.205.1-7070-20111103.180708-1.pom
4 KB   
5 KB   
       
Downloaded: http://people.apache.org/~garyh/mvn/org/apache/hadoop/hadoop-core/0.20.205.1-7070-SNAPSHOT/hadoop-core-0.20.205.1-7070-20111103.180708-1.pom
(5 KB at 36.1 KB/sec)
[DEBUG] Reading resolution tracking file /home/jenkins/.m2/repository/org/apache/hadoop/hadoop-core/0.20.205.1-7070-SNAPSHOT/hadoop-core-0.20.205.1-7070-20111103.180708-1.pom.lastUpdated
[DEBUG] Writing resolution tracking file /home/jenkins/.m2/repository/org/apache/hadoop/hadoop-core/0.20.205.1-7070-SNAPSHOT/hadoop-core-0.20.205.1-7070-20111103.180708-1.pom.lastUpdated
[INFO]                                                                         
[INFO] ------------------------------------------------------------------------
[INFO] Skipping HBase
[INFO] This project has been banned from the build due to previous failures.
[INFO] ------------------------------------------------------------------------
[INFO] ------------------------------------------------------------------------
[INFO] BUILD FAILURE
[INFO] ------------------------------------------------------------------------
[INFO] Total time: 36.490s
[INFO] Finished at: Mon Nov 21 01:15:55 UTC 2011
[INFO] Final Memory: 7M/112M
[INFO] ------------------------------------------------------------------------
[ERROR] Failed to execute goal on project hbase: Could not resolve dependencies for project
org.apache.hbase:hbase:jar:0.92.0-SNAPSHOT: Failed to collect dependencies for [com.google.guava:guava:jar:r09
(compile), commons-cli:commons-cli:jar:1.2 (compile), com.github.stephenc.high-scale-lib:high-scale-lib:jar:1.1.1
(compile), commons-codec:commons-codec:jar:1.4 (compile), commons-httpclient:commons-httpclient:jar:3.1
(compile), commons-lang:commons-lang:jar:2.5 (compile), commons-logging:commons-logging:jar:1.1.1
(compile), log4j:log4j:jar:1.2.16 (compile), org.apache.avro:avro:jar:1.5.3 (compile), org.apache.avro:avro-ipc:jar:1.5.3
(compile), org.apache.zookeeper:zookeeper:jar:3.4.0-SNAPSHOT (compile), org.apache.thrift:libthrift:jar:0.7.0
(compile), org.jruby:jruby-complete:jar:1.6.0 (compile), org.mortbay.jetty:jetty:jar:6.1.26
(compile), org.mortbay.jetty:jetty-util:jar:6.1.26 (compile), org.mortbay.jetty:jsp-2.1:jar:6.1.14
(compile), org.mortbay.jetty:jsp-api-2.1:jar:6.1.14 (compile), org.mortbay.jetty:servlet-api-2.5:jar:6.1.14
(compile), org.codehaus.jackson:jackson-core-asl:jar:1.5.5 (compile), org.codehaus.jackson:jackson-mapper-asl:jar:1.5.5
(compile), org.codehaus.jackson:jackson-jaxrs:jar:1.5.5 (compile), org.codehaus.jackson:jackson-xc:jar:1.5.5
(compile), org.slf4j:slf4j-api:jar:1.5.8 (compile), org.slf4j:slf4j-log4j12:jar:1.5.8 (compile),
tomcat:jasper-compiler:jar:5.5.23 (runtime), tomcat:jasper-runtime:jar:5.5.23 (runtime), org.jamon:jamon-runtime:jar:2.3.1
(compile), com.google.protobuf:protobuf-java:jar:2.4.0a (compile), com.sun.jersey:jersey-core:jar:1.4
(compile), com.sun.jersey:jersey-json:jar:1.4 (compile), com.sun.jersey:jersey-server:jar:1.4
(compile), javax.xml.bind:jaxb-api:jar:2.1 (compile), stax:stax-api:jar:1.0.1 (compile), junit:junit:jar:4.10
(test), org.mockito:mockito-all:jar:1.8.5 (test), org.apache.commons:commons-math:jar:2.1
(test), org.apache.hadoop:hadoop-core:jar:0.20.205.1-7070-SNAPSHOT (compile), org.apache.hadoop:hadoop-test:jar:0.20.205.1-7070-SNAPSHOT
(test)]: Failed to read artifact descriptor for org.apache.hadoop:hadoop-core:jar:0.20.205.1-7070-SNAPSHOT:
Could not transfer artifact org.apache.hadoop:hadoop-core:pom:0.20.205.1-7070-20111103.180708-1
from/to ghelmling.testing (http://people.apache.org/~garyh/mvn/): Error transferring file:
Connection timed out -> [Help 1]
org.apache.maven.lifecycle.LifecycleExecutionException: Failed to execute goal on project
hbase: Could not resolve dependencies for project org.apache.hbase:hbase:jar:0.92.0-SNAPSHOT:
Failed to collect dependencies for [com.google.guava:guava:jar:r09 (compile), commons-cli:commons-cli:jar:1.2
(compile), com.github.stephenc.high-scale-lib:high-scale-lib:jar:1.1.1 (compile), commons-codec:commons-codec:jar:1.4
(compile), commons-httpclient:commons-httpclient:jar:3.1 (compile), commons-lang:commons-lang:jar:2.5
(compile), commons-logging:commons-logging:jar:1.1.1 (compile), log4j:log4j:jar:1.2.16 (compile),
org.apache.avro:avro:jar:1.5.3 (compile), org.apache.avro:avro-ipc:jar:1.5.3 (compile), org.apache.zookeeper:zookeeper:jar:3.4.0-SNAPSHOT
(compile), org.apache.thrift:libthrift:jar:0.7.0 (compile), org.jruby:jruby-complete:jar:1.6.0
(compile), org.mortbay.jetty:jetty:jar:6.1.26 (compile), org.mortbay.jetty:jetty-util:jar:6.1.26
(compile), org.mortbay.jetty:jsp-2.1:jar:6.1.14 (compile), org.mortbay.jetty:jsp-api-2.1:jar:6.1.14
(compile), org.mortbay.jetty:servlet-api-2.5:jar:6.1.14 (compile), org.codehaus.jackson:jackson-core-asl:jar:1.5.5
(compile), org.codehaus.jackson:jackson-mapper-asl:jar:1.5.5 (compile), org.codehaus.jackson:jackson-jaxrs:jar:1.5.5
(compile), org.codehaus.jackson:jackson-xc:jar:1.5.5 (compile), org.slf4j:slf4j-api:jar:1.5.8
(compile), org.slf4j:slf4j-log4j12:jar:1.5.8 (compile), tomcat:jasper-compiler:jar:5.5.23
(runtime), tomcat:jasper-runtime:jar:5.5.23 (runtime), org.jamon:jamon-runtime:jar:2.3.1 (compile),
com.google.protobuf:protobuf-java:jar:2.4.0a (compile), com.sun.jersey:jersey-core:jar:1.4
(compile), com.sun.jersey:jersey-json:jar:1.4 (compile), com.sun.jersey:jersey-server:jar:1.4
(compile), javax.xml.bind:jaxb-api:jar:2.1 (compile), stax:stax-api:jar:1.0.1 (compile), junit:junit:jar:4.10
(test), org.mockito:mockito-all:jar:1.8.5 (test), org.apache.commons:commons-math:jar:2.1
(test), org.apache.hadoop:hadoop-core:jar:0.20.205.1-7070-SNAPSHOT (compile), org.apache.hadoop:hadoop-test:jar:0.20.205.1-7070-SNAPSHOT
(test)]
	at org.apache.maven.lifecycle.internal.LifecycleDependencyResolver.getDependencies(LifecycleDependencyResolver.java:196)
	at org.apache.maven.lifecycle.internal.LifecycleDependencyResolver.resolveProjectDependencies(LifecycleDependencyResolver.java:108)
	at org.apache.maven.lifecycle.internal.MojoExecutor.ensureDependenciesAreResolved(MojoExecutor.java:258)
	at org.apache.maven.lifecycle.internal.MojoExecutor.execute(MojoExecutor.java:201)
	at org.apache.maven.lifecycle.internal.MojoExecutor.execute(MojoExecutor.java:153)
	at org.apache.maven.lifecycle.internal.MojoExecutor.execute(MojoExecutor.java:145)
	at org.apache.maven.lifecycle.internal.LifecycleModuleBuilder.buildProject(LifecycleModuleBuilder.java:84)
	at org.apache.maven.lifecycle.internal.LifecycleModuleBuilder.buildProject(LifecycleModuleBuilder.java:59)
	at org.apache.maven.lifecycle.internal.LifecycleStarter.singleThreadedBuild(LifecycleStarter.java:183)
	at org.apache.maven.lifecycle.internal.LifecycleStarter.execute(LifecycleStarter.java:161)
	at org.apache.maven.DefaultMaven.doExecute(DefaultMaven.java:319)
	at org.apache.maven.DefaultMaven.execute(DefaultMaven.java:156)
	at org.apache.maven.cli.MavenCli.execute(MavenCli.java:537)
	at org.apache.maven.cli.MavenCli.doMain(MavenCli.java:196)
	at org.apache.maven.cli.MavenCli.main(MavenCli.java:141)
	at sun.reflect.NativeMethodAccessorImpl.invoke0(Native Method)
	at sun.reflect.NativeMethodAccessorImpl.invoke(NativeMethodAccessorImpl.java:39)
	at sun.reflect.DelegatingMethodAccessorImpl.invoke(DelegatingMethodAccessorImpl.java:25)
	at java.lang.reflect.Method.invoke(Method.java:597)
	at org.codehaus.plexus.classworlds.launcher.Launcher.launchEnhanced(Launcher.java:290)
	at org.codehaus.plexus.classworlds.launcher.Launcher.launch(Launcher.java:230)
	at org.codehaus.plexus.classworlds.launcher.Launcher.mainWithExitCode(Launcher.java:409)
	at org.codehaus.plexus.classworlds.launcher.Launcher.main(Launcher.java:352)
Caused by: org.apache.maven.project.DependencyResolutionException: Could not resolve dependencies
for project org.apache.hbase:hbase:jar:0.92.0-SNAPSHOT: Failed to collect dependencies for
[com.google.guava:guava:jar:r09 (compile), commons-cli:commons-cli:jar:1.2 (compile), com.github.stephenc.high-scale-lib:high-scale-lib:jar:1.1.1
(compile), commons-codec:commons-codec:jar:1.4 (compile), commons-httpclient:commons-httpclient:jar:3.1
(compile), commons-lang:commons-lang:jar:2.5 (compile), commons-logging:commons-logging:jar:1.1.1
(compile), log4j:log4j:jar:1.2.16 (compile), org.apache.avro:avro:jar:1.5.3 (compile), org.apache.avro:avro-ipc:jar:1.5.3
(compile), org.apache.zookeeper:zookeeper:jar:3.4.0-SNAPSHOT (compile), org.apache.thrift:libthrift:jar:0.7.0
(compile), org.jruby:jruby-complete:jar:1.6.0 (compile), org.mortbay.jetty:jetty:jar:6.1.26
(compile), org.mortbay.jetty:jetty-util:jar:6.1.26 (compile), org.mortbay.jetty:jsp-2.1:jar:6.1.14
(compile), org.mortbay.jetty:jsp-api-2.1:jar:6.1.14 (compile), org.mortbay.jetty:servlet-api-2.5:jar:6.1.14
(compile), org.codehaus.jackson:jackson-core-asl:jar:1.5.5 (compile), org.codehaus.jackson:jackson-mapper-asl:jar:1.5.5
(compile), org.codehaus.jackson:jackson-jaxrs:jar:1.5.5 (compile), org.codehaus.jackson:jackson-xc:jar:1.5.5
(compile), org.slf4j:slf4j-api:jar:1.5.8 (compile), org.slf4j:slf4j-log4j12:jar:1.5.8 (compile),
tomcat:jasper-compiler:jar:5.5.23 (runtime), tomcat:jasper-runtime:jar:5.5.23 (runtime), org.jamon:jamon-runtime:jar:2.3.1
(compile), com.google.protobuf:protobuf-java:jar:2.4.0a (compile), com.sun.jersey:jersey-core:jar:1.4
(compile), com.sun.jersey:jersey-json:jar:1.4 (compile), com.sun.jersey:jersey-server:jar:1.4
(compile), javax.xml.bind:jaxb-api:jar:2.1 (compile), stax:stax-api:jar:1.0.1 (compile), junit:junit:jar:4.10
(test), org.mockito:mockito-all:jar:1.8.5 (test), org.apache.commons:commons-math:jar:2.1
(test), org.apache.hadoop:hadoop-core:jar:0.20.205.1-7070-SNAPSHOT (compile), org.apache.hadoop:hadoop-test:jar:0.20.205.1-7070-SNAPSHOT
(test)]
	at org.apache.maven.project.DefaultProjectDependenciesResolver.resolve(DefaultProjectDependenciesResolver.java:139)
	at org.apache.maven.lifecycle.internal.LifecycleDependencyResolver.getDependencies(LifecycleDependencyResolver.java:171)
	... 22 more
Caused by: org.sonatype.aether.collection.DependencyCollectionException: Failed to collect
dependencies for [com.google.guava:guava:jar:r09 (compile), commons-cli:commons-cli:jar:1.2
(compile), com.github.stephenc.high-scale-lib:high-scale-lib:jar:1.1.1 (compile), commons-codec:commons-codec:jar:1.4
(compile), commons-httpclient:commons-httpclient:jar:3.1 (compile), commons-lang:commons-lang:jar:2.5
(compile), commons-logging:commons-logging:jar:1.1.1 (compile), log4j:log4j:jar:1.2.16 (compile),
org.apache.avro:avro:jar:1.5.3 (compile), org.apache.avro:avro-ipc:jar:1.5.3 (compile), org.apache.zookeeper:zookeeper:jar:3.4.0-SNAPSHOT
(compile), org.apache.thrift:libthrift:jar:0.7.0 (compile), org.jruby:jruby-complete:jar:1.6.0
(compile), org.mortbay.jetty:jetty:jar:6.1.26 (compile), org.mortbay.jetty:jetty-util:jar:6.1.26
(compile), org.mortbay.jetty:jsp-2.1:jar:6.1.14 (compile), org.mortbay.jetty:jsp-api-2.1:jar:6.1.14
(compile), org.mortbay.jetty:servlet-api-2.5:jar:6.1.14 (compile), org.codehaus.jackson:jackson-core-asl:jar:1.5.5
(compile), org.codehaus.jackson:jackson-mapper-asl:jar:1.5.5 (compile), org.codehaus.jackson:jackson-jaxrs:jar:1.5.5
(compile), org.codehaus.jackson:jackson-xc:jar:1.5.5 (compile), org.slf4j:slf4j-api:jar:1.5.8
(compile), org.slf4j:slf4j-log4j12:jar:1.5.8 (compile), tomcat:jasper-compiler:jar:5.5.23
(runtime), tomcat:jasper-runtime:jar:5.5.23 (runtime), org.jamon:jamon-runtime:jar:2.3.1 (compile),
com.google.protobuf:protobuf-java:jar:2.4.0a (compile), com.sun.jersey:jersey-core:jar:1.4
(compile), com.sun.jersey:jersey-json:jar:1.4 (compile), com.sun.jersey:jersey-server:jar:1.4
(compile), javax.xml.bind:jaxb-api:jar:2.1 (compile), stax:stax-api:jar:1.0.1 (compile), junit:junit:jar:4.10
(test), org.mockito:mockito-all:jar:1.8.5 (test), org.apache.commons:commons-math:jar:2.1
(test), org.apache.hadoop:hadoop-core:jar:0.20.205.1-7070-SNAPSHOT (compile), org.apache.hadoop:hadoop-test:jar:0.20.205.1-7070-SNAPSHOT
(test)]
	at org.sonatype.aether.impl.internal.DefaultDependencyCollector.collectDependencies(DefaultDependencyCollector.java:262)
	at org.sonatype.aether.impl.internal.DefaultRepositorySystem.collectDependencies(DefaultRepositorySystem.java:345)
	at org.apache.maven.project.DefaultProjectDependenciesResolver.resolve(DefaultProjectDependenciesResolver.java:131)
	... 23 more
Caused by: org.sonatype.aether.resolution.ArtifactDescriptorException: Failed to read artifact
descriptor for org.apache.hadoop:hadoop-core:jar:0.20.205.1-7070-SNAPSHOT
	at org.apache.maven.repository.internal.DefaultArtifactDescriptorReader.loadPom(DefaultArtifactDescriptorReader.java:282)
	at org.apache.maven.repository.internal.DefaultArtifactDescriptorReader.readArtifactDescriptor(DefaultArtifactDescriptorReader.java:172)
	at org.sonatype.aether.impl.internal.DefaultDependencyCollector.process(DefaultDependencyCollector.java:419)
	at org.sonatype.aether.impl.internal.DefaultDependencyCollector.collectDependencies(DefaultDependencyCollector.java:243)
	... 25 more
Caused by: org.sonatype.aether.resolution.ArtifactResolutionException: Could not transfer
artifact org.apache.hadoop:hadoop-core:pom:0.20.205.1-7070-20111103.180708-1 from/to ghelmling.testing
(http://people.apache.org/~garyh/mvn/): Error transferring file: Connection timed out
	at org.sonatype.aether.impl.internal.DefaultArtifactResolver.resolve(DefaultArtifactResolver.java:541)
	at org.sonatype.aether.impl.internal.DefaultArtifactResolver.resolveArtifacts(DefaultArtifactResolver.java:220)
	at org.sonatype.aether.impl.internal.DefaultArtifactResolver.resolveArtifact(DefaultArtifactResolver.java:197)
	at org.apache.maven.repository.internal.DefaultArtifactDescriptorReader.loadPom(DefaultArtifactDescriptorReader.java:267)
	... 28 more
Caused by: org.sonatype.aether.transfer.ArtifactTransferException: Could not transfer artifact
org.apache.hadoop:hadoop-core:pom:0.20.205.1-7070-20111103.180708-1 from/to ghelmling.testing
(http://people.apache.org/~garyh/mvn/): Error transferring file: Connection timed out
	at org.sonatype.aether.connector.wagon.WagonRepositoryConnector$4.wrap(WagonRepositoryConnector.java:949)
	at org.sonatype.aether.connector.wagon.WagonRepositoryConnector$4.wrap(WagonRepositoryConnector.java:940)
	at org.sonatype.aether.connector.wagon.WagonRepositoryConnector$GetTask.flush(WagonRepositoryConnector.java:695)
	at org.sonatype.aether.connector.wagon.WagonRepositoryConnector$GetTask.flush(WagonRepositoryConnector.java:689)
	at org.sonatype.aether.connector.wagon.WagonRepositoryConnector.get(WagonRepositoryConnector.java:445)
	at org.sonatype.aether.impl.internal.DefaultArtifactResolver.resolve(DefaultArtifactResolver.java:460)
	... 31 more
Caused by: org.apache.maven.wagon.TransferFailedException: Error transferring file: Connection
timed out
	at org.apache.maven.wagon.providers.http.LightweightHttpWagon.fillInputData(LightweightHttpWagon.java:143)
	at org.apache.maven.wagon.StreamWagon.getInputStream(StreamWagon.java:116)
	at org.apache.maven.wagon.StreamWagon.getIfNewer(StreamWagon.java:88)
	at org.apache.maven.wagon.StreamWagon.get(StreamWagon.java:61)
	at org.sonatype.aether.connector.wagon.WagonRepositoryConnector$GetTask.run(WagonRepositoryConnector.java:608)
	at org.sonatype.aether.util.concurrency.RunnableErrorForwarder$1.run(RunnableErrorForwarder.java:64)
	at java.util.concurrent.ThreadPoolExecutor$Worker.runTask(ThreadPoolExecutor.java:886)
	at java.util.concurrent.ThreadPoolExecutor$Worker.run(ThreadPoolExecutor.java:908)
	at java.lang.Thread.run(Thread.java:662)
Caused by: java.net.ConnectException: Connection timed out
	at java.net.PlainSocketImpl.socketConnect(Native Method)
	at java.net.PlainSocketImpl.doConnect(PlainSocketImpl.java:351)
	at java.net.PlainSocketImpl.connectToAddress(PlainSocketImpl.java:213)
	at java.net.PlainSocketImpl.connect(PlainSocketImpl.java:200)
	at java.net.SocksSocketImpl.connect(SocksSocketImpl.java:366)
	at java.net.Socket.connect(Socket.java:529)
	at java.net.Socket.connect(Socket.java:478)
	at sun.net.NetworkClient.doConnect(NetworkClient.java:163)
	at sun.net.www.http.HttpClient.openServer(HttpClient.java:395)
	at sun.net.www.http.HttpClient.openServer(HttpClient.java:530)
	at sun.net.www.http.HttpClient.<init>(HttpClient.java:234)
	at sun.net.www.http.HttpClient.New(HttpClient.java:307)
	at sun.net.www.http.HttpClient.New(HttpClient.java:324)
	at sun.net.www.protocol.http.HttpURLConnection.getNewHttpClient(HttpURLConnection.java:970)
	at sun.net.www.protocol.http.HttpURLConnection.plainConnect(HttpURLConnection.java:911)
	at sun.net.www.protocol.http.HttpURLConnection.connect(HttpURLConnection.java:836)
	at sun.net.www.protocol.http.HttpURLConnection.getInputStream(HttpURLConnection.java:1172)
	at java.net.HttpURLConnection.getResponseCode(HttpURLConnection.java:379)
	at org.apache.maven.wagon.providers.http.LightweightHttpWagon.fillInputData(LightweightHttpWagon.java:115)
	... 8 more
[ERROR] 
[ERROR] 
[ERROR] For more information about the errors and possible solutions, please read the following
articles:
[ERROR] [Help 1] http://cwiki.apache.org/confluence/display/MAVEN/DependencyResolutionException
Build step 'Invoke top-level Maven targets' marked build as failure
[locks-and-latches] Releasing all the locks
[locks-and-latches] All the locks released
Archiving artifacts
Recording test results
Updating HBASE-2418


Mime
View raw message