hbase-dev mailing list archives

Site index · List index
Message view « Date » · « Thread »
Top « Date » · « Thread »
From Andrew Purtell <apurt...@apache.org>
Subject Re: [jira] [Commented] (HBASE-2418) add support for ZooKeeper authentication
Date Sat, 19 Nov 2011 18:39:57 GMT
After updating I see this on vanilla trunk:

-------------------------------------------------------
 T E S T S
-------------------------------------------------------
Running org.apache.hadoop.hbase.client.TestAdmin
Tests run: 35, Failures: 1, Errors: 0, Skipped: 0, Time elapsed: 553.275 sec <<<
FAILURE!
testDeleteEditUnknownColumnFamilyAndOrTable(org.apache.hadoop.hbase.client.TestAdmin)  Time
elapsed: 1.495 sec  <<< FAILURE!
java.lang.AssertionError
    at org.junit.Assert.fail(Assert.java:92)
    at org.junit.Assert.assertTrue(Assert.java:43)
    at org.junit.Assert.assertTrue(Assert.java:54)
    at org.apache.hadoop.hbase.client.TestAdmin.testDeleteEditUnknownColumnFamilyAndOrTable(TestAdmin.java:165)
    at sun.reflect.NativeMethodAccessorImpl.invoke0(Native Method)
    at sun.reflect.NativeMethodAccessorImpl.invoke(NativeMethodAccessorImpl.java:39)
    at sun.reflect.DelegatingMethodAccessorImpl.invoke(DelegatingMethodAccessorImpl.java:25)
    at java.lang.reflect.Method.invoke(Method.java:597)
    at org.junit.runners.model.FrameworkMethod$1.runReflectiveCall(FrameworkMethod.java:45)
    at org.junit.internal.runners.model.ReflectiveCallable.run(ReflectiveCallable.java:15)
    at org.junit.runners.model.FrameworkMethod.invokeExplosively(FrameworkMethod.java:42)
    at org.junit.internal.runners.statements.InvokeMethod.evaluate(InvokeMethod.java:20)
    at org.junit.internal.runners.statements.RunBefores.evaluate(RunBefores.java:28)
    at org.junit.runners.ParentRunner.runLeaf(ParentRunner.java:263)
    at org.junit.runners.BlockJUnit4ClassRunner.runChild(BlockJUnit4ClassRunner.java:68)
    at org.junit.runners.BlockJUnit4ClassRunner.runChild(BlockJUnit4ClassRunner.java:47)
    at org.junit.runners.ParentRunner$3.run(ParentRunner.java:231)
    at org.junit.runners.ParentRunner$1.schedule(ParentRunner.java:60)
    at org.junit.runners.ParentRunner.runChildren(ParentRunner.java:229)
    at org.junit.runners.ParentRunner.access$000(ParentRunner.java:50)
    at org.junit.runners.ParentRunner$2.evaluate(ParentRunner.java:222)
    at org.junit.internal.runners.statements.RunBefores.evaluate(RunBefores.java:28)
    at org.junit.internal.runners.statements.RunAfters.evaluate(RunAfters.java:30)
    at org.junit.runners.ParentRunner.run(ParentRunner.java:300)
    at org.apache.maven.surefire.junit4.JUnit4TestSet.execute(JUnit4TestSet.java:53)
    at org.apache.maven.surefire.junit4.JUnit4Provider.executeTestSet(JUnit4Provider.java:123)
    at org.apache.maven.surefire.junit4.JUnit4Provider.invoke(JUnit4Provider.java:104)
    at sun.reflect.NativeMethodAccessorImpl.invoke0(Native Method)
    at sun.reflect.NativeMethodAccessorImpl.invoke(NativeMethodAccessorImpl.java:39)
    at sun.reflect.DelegatingMethodAccessorImpl.invoke(DelegatingMethodAccessorImpl.java:25)
    at java.lang.reflect.Method.invoke(Method.java:597)
    at org.apache.maven.surefire.util.ReflectionUtils.invokeMethodWithArray(ReflectionUtils.java:164)
    at org.apache.maven.surefire.booter.ProviderFactory$ProviderProxy.invoke(ProviderFactory.java:110)
    at org.apache.maven.surefire.booter.SurefireStarter.invokeProvider(SurefireStarter.java:175)
    at org.apache.maven.surefire.booter.SurefireStarter.runSuitesInProcessWhenForked(SurefireStarter.java:81)
    at org.apache.maven.surefire.booter.ForkedBooter.main(ForkedBooter.java:68)


Results :

Failed tests:   testDeleteEditUnknownColumnFamilyAndOrTable(org.apache.hadoop.hbase.client.TestAdmin)

Tests run: 35, Failures: 1, Errors: 0, Skipped: 0
    - Andy

Mime
View raw message