hbase-dev mailing list archives

Site index · List index
Message view « Date » · « Thread »
Top « Date » · « Thread »
From Apache Jenkins Server <jenk...@builds.apache.org>
Subject Build failed in Jenkins: HBase-0.92-security #8
Date Wed, 23 Nov 2011 11:50:46 GMT
See <https://builds.apache.org/job/HBase-0.92-security/8/changes>

Changes:

[stack] HBASE-4851 hadoop maven dependency needs to be an optional one

[stack] HBASE-4854 it seems that CLASSPATH elements coming from Hadoop change HBase behaviour

------------------------------------------
[...truncated 6795 lines...]
Running org.apache.hadoop.hbase.rest.TestTransform
Tests run: 1, Failures: 0, Errors: 0, Skipped: 0, Time elapsed: 21.568 sec
Forking command line: /bin/sh -c cd <https://builds.apache.org/job/HBase-0.92-security/ws/trunk>
&& /home/jenkins/tools/java/jdk1.6.0_27-32/jre/bin/java -enableassertions -Xmx1400m
-jar <https://builds.apache.org/job/HBase-0.92-security/ws/trunk/target/surefire/surefirebooter8177478762065152455.jar>
<https://builds.apache.org/job/HBase-0.92-security/ws/trunk/target/surefire/surefire6978354916803374851tmp>
<https://builds.apache.org/job/HBase-0.92-security/ws/trunk/target/surefire/surefire2563033340292276686tmp>
Running org.apache.hadoop.hbase.rest.TestTableResource
Tests run: 8, Failures: 0, Errors: 0, Skipped: 0, Time elapsed: 29.68 sec
Forking command line: /bin/sh -c cd <https://builds.apache.org/job/HBase-0.92-security/ws/trunk>
&& /home/jenkins/tools/java/jdk1.6.0_27-32/jre/bin/java -enableassertions -Xmx1400m
-jar <https://builds.apache.org/job/HBase-0.92-security/ws/trunk/target/surefire/surefirebooter2862746597922949999.jar>
<https://builds.apache.org/job/HBase-0.92-security/ws/trunk/target/surefire/surefire5693701477558250277tmp>
<https://builds.apache.org/job/HBase-0.92-security/ws/trunk/target/surefire/surefire7954993471920488141tmp>
Running org.apache.hadoop.hbase.rest.TestStatusResource
Tests run: 2, Failures: 0, Errors: 0, Skipped: 0, Time elapsed: 18.629 sec
Forking command line: /bin/sh -c cd <https://builds.apache.org/job/HBase-0.92-security/ws/trunk>
&& /home/jenkins/tools/java/jdk1.6.0_27-32/jre/bin/java -enableassertions -Xmx1400m
-jar <https://builds.apache.org/job/HBase-0.92-security/ws/trunk/target/surefire/surefirebooter8970965710726263268.jar>
<https://builds.apache.org/job/HBase-0.92-security/ws/trunk/target/surefire/surefire4802411566411917121tmp>
<https://builds.apache.org/job/HBase-0.92-security/ws/trunk/target/surefire/surefire3078445342494091541tmp>
Running org.apache.hadoop.hbase.rest.TestSchemaResource
Tests run: 2, Failures: 0, Errors: 0, Skipped: 0, Time elapsed: 24.518 sec
Forking command line: /bin/sh -c cd <https://builds.apache.org/job/HBase-0.92-security/ws/trunk>
&& /home/jenkins/tools/java/jdk1.6.0_27-32/jre/bin/java -enableassertions -Xmx1400m
-jar <https://builds.apache.org/job/HBase-0.92-security/ws/trunk/target/surefire/surefirebooter7239395365308360067.jar>
<https://builds.apache.org/job/HBase-0.92-security/ws/trunk/target/surefire/surefire2216156621097711774tmp>
<https://builds.apache.org/job/HBase-0.92-security/ws/trunk/target/surefire/surefire4061073476331540860tmp>
Running org.apache.hadoop.hbase.thrift.TestThriftServer
Tests run: 1, Failures: 0, Errors: 0, Skipped: 0, Time elapsed: 25.242 sec
Forking command line: /bin/sh -c cd <https://builds.apache.org/job/HBase-0.92-security/ws/trunk>
&& /home/jenkins/tools/java/jdk1.6.0_27-32/jre/bin/java -enableassertions -Xmx1400m
-jar <https://builds.apache.org/job/HBase-0.92-security/ws/trunk/target/surefire/surefirebooter213709046751825270.jar>
<https://builds.apache.org/job/HBase-0.92-security/ws/trunk/target/surefire/surefire1209431045352342245tmp>
<https://builds.apache.org/job/HBase-0.92-security/ws/trunk/target/surefire/surefire9202547693260191844tmp>
Running org.apache.hadoop.hbase.io.TestHeapSize
Tests run: 2, Failures: 0, Errors: 0, Skipped: 0, Time elapsed: 0.157 sec
Forking command line: /bin/sh -c cd <https://builds.apache.org/job/HBase-0.92-security/ws/trunk>
&& /home/jenkins/tools/java/jdk1.6.0_27-32/jre/bin/java -enableassertions -Xmx1400m
-jar <https://builds.apache.org/job/HBase-0.92-security/ws/trunk/target/surefire/surefirebooter5491093127567705977.jar>
<https://builds.apache.org/job/HBase-0.92-security/ws/trunk/target/surefire/surefire984956645289442844tmp>
<https://builds.apache.org/job/HBase-0.92-security/ws/trunk/target/surefire/surefire7577999649529416547tmp>
Running org.apache.hadoop.hbase.io.hfile.TestHFileSeek
Tests run: 1, Failures: 0, Errors: 0, Skipped: 0, Time elapsed: 5.723 sec
Forking command line: /bin/sh -c cd <https://builds.apache.org/job/HBase-0.92-security/ws/trunk>
&& /home/jenkins/tools/java/jdk1.6.0_27-32/jre/bin/java -enableassertions -Xmx1400m
-jar <https://builds.apache.org/job/HBase-0.92-security/ws/trunk/target/surefire/surefirebooter1901098527971009990.jar>
<https://builds.apache.org/job/HBase-0.92-security/ws/trunk/target/surefire/surefire8101962236140223768tmp>
<https://builds.apache.org/job/HBase-0.92-security/ws/trunk/target/surefire/surefire7282864988314840005tmp>
Running org.apache.hadoop.hbase.io.hfile.slab.TestSlab
Tests run: 1, Failures: 0, Errors: 0, Skipped: 0, Time elapsed: 0.145 sec
Forking command line: /bin/sh -c cd <https://builds.apache.org/job/HBase-0.92-security/ws/trunk>
&& /home/jenkins/tools/java/jdk1.6.0_27-32/jre/bin/java -enableassertions -Xmx1400m
-jar <https://builds.apache.org/job/HBase-0.92-security/ws/trunk/target/surefire/surefirebooter5893877901624450577.jar>
<https://builds.apache.org/job/HBase-0.92-security/ws/trunk/target/surefire/surefire5373382226417019699tmp>
<https://builds.apache.org/job/HBase-0.92-security/ws/trunk/target/surefire/surefire7131692606163165881tmp>
Running org.apache.hadoop.hbase.io.hfile.slab.TestSlabCache
Tests run: 7, Failures: 0, Errors: 0, Skipped: 0, Time elapsed: 19.141 sec
Forking command line: /bin/sh -c cd <https://builds.apache.org/job/HBase-0.92-security/ws/trunk>
&& /home/jenkins/tools/java/jdk1.6.0_27-32/jre/bin/java -enableassertions -Xmx1400m
-jar <https://builds.apache.org/job/HBase-0.92-security/ws/trunk/target/surefire/surefirebooter4331680088532809868.jar>
<https://builds.apache.org/job/HBase-0.92-security/ws/trunk/target/surefire/surefire1093578724769697267tmp>
<https://builds.apache.org/job/HBase-0.92-security/ws/trunk/target/surefire/surefire7926452496954432273tmp>
Running org.apache.hadoop.hbase.io.hfile.slab.TestSingleSizeCache
Tests run: 5, Failures: 0, Errors: 0, Skipped: 0, Time elapsed: 24.291 sec
Forking command line: /bin/sh -c cd <https://builds.apache.org/job/HBase-0.92-security/ws/trunk>
&& /home/jenkins/tools/java/jdk1.6.0_27-32/jre/bin/java -enableassertions -Xmx1400m
-jar <https://builds.apache.org/job/HBase-0.92-security/ws/trunk/target/surefire/surefirebooter755700796513997495.jar>
<https://builds.apache.org/job/HBase-0.92-security/ws/trunk/target/surefire/surefire5344946740791960912tmp>
<https://builds.apache.org/job/HBase-0.92-security/ws/trunk/target/surefire/surefire9076363404418112484tmp>
Running org.apache.hadoop.hbase.io.hfile.TestCachedBlockQueue
Tests run: 2, Failures: 0, Errors: 0, Skipped: 0, Time elapsed: 0.103 sec
Forking command line: /bin/sh -c cd <https://builds.apache.org/job/HBase-0.92-security/ws/trunk>
&& /home/jenkins/tools/java/jdk1.6.0_27-32/jre/bin/java -enableassertions -Xmx1400m
-jar <https://builds.apache.org/job/HBase-0.92-security/ws/trunk/target/surefire/surefirebooter7143415595325974640.jar>
<https://builds.apache.org/job/HBase-0.92-security/ws/trunk/target/surefire/surefire7068622155386683932tmp>
<https://builds.apache.org/job/HBase-0.92-security/ws/trunk/target/surefire/surefire422986638884480483tmp>
Running org.apache.hadoop.hbase.io.hfile.TestHFileBlockIndex
Tests run: 10, Failures: 0, Errors: 0, Skipped: 0, Time elapsed: 9.914 sec
Forking command line: /bin/sh -c cd <https://builds.apache.org/job/HBase-0.92-security/ws/trunk>
&& /home/jenkins/tools/java/jdk1.6.0_27-32/jre/bin/java -enableassertions -Xmx1400m
-jar <https://builds.apache.org/job/HBase-0.92-security/ws/trunk/target/surefire/surefirebooter6617983987020293583.jar>
<https://builds.apache.org/job/HBase-0.92-security/ws/trunk/target/surefire/surefire4625316675831543634tmp>
<https://builds.apache.org/job/HBase-0.92-security/ws/trunk/target/surefire/surefire5623426315925189579tmp>
Running org.apache.hadoop.hbase.io.hfile.TestLruBlockCache
Tests run: 7, Failures: 0, Errors: 0, Skipped: 0, Time elapsed: 0.343 sec
Forking command line: /bin/sh -c cd <https://builds.apache.org/job/HBase-0.92-security/ws/trunk>
&& /home/jenkins/tools/java/jdk1.6.0_27-32/jre/bin/java -enableassertions -Xmx1400m
-jar <https://builds.apache.org/job/HBase-0.92-security/ws/trunk/target/surefire/surefirebooter1895235844365537897.jar>
<https://builds.apache.org/job/HBase-0.92-security/ws/trunk/target/surefire/surefire1120664293783431284tmp>
<https://builds.apache.org/job/HBase-0.92-security/ws/trunk/target/surefire/surefire8101660513935746303tmp>
Running org.apache.hadoop.hbase.io.hfile.TestHFilePerformance
Tests run: 1, Failures: 0, Errors: 0, Skipped: 0, Time elapsed: 5.805 sec
Forking command line: /bin/sh -c cd <https://builds.apache.org/job/HBase-0.92-security/ws/trunk>
&& /home/jenkins/tools/java/jdk1.6.0_27-32/jre/bin/java -enableassertions -Xmx1400m
-jar <https://builds.apache.org/job/HBase-0.92-security/ws/trunk/target/surefire/surefirebooter2723510074029247737.jar>
<https://builds.apache.org/job/HBase-0.92-security/ws/trunk/target/surefire/surefire3790778836204579919tmp>
<https://builds.apache.org/job/HBase-0.92-security/ws/trunk/target/surefire/surefire4853050785524787436tmp>
Running org.apache.hadoop.hbase.io.hfile.TestFixedFileTrailer
Tests run: 2, Failures: 0, Errors: 0, Skipped: 0, Time elapsed: 0.563 sec
Forking command line: /bin/sh -c cd <https://builds.apache.org/job/HBase-0.92-security/ws/trunk>
&& /home/jenkins/tools/java/jdk1.6.0_27-32/jre/bin/java -enableassertions -Xmx1400m
-jar <https://builds.apache.org/job/HBase-0.92-security/ws/trunk/target/surefire/surefirebooter229692233264319600.jar>
<https://builds.apache.org/job/HBase-0.92-security/ws/trunk/target/surefire/surefire5512551146654713796tmp>
<https://builds.apache.org/job/HBase-0.92-security/ws/trunk/target/surefire/surefire1837483087765328572tmp>
Running org.apache.hadoop.hbase.io.hfile.TestHFileWriterV2
Tests run: 1, Failures: 0, Errors: 0, Skipped: 0, Time elapsed: 0.95 sec
Forking command line: /bin/sh -c cd <https://builds.apache.org/job/HBase-0.92-security/ws/trunk>
&& /home/jenkins/tools/java/jdk1.6.0_27-32/jre/bin/java -enableassertions -Xmx1400m
-jar <https://builds.apache.org/job/HBase-0.92-security/ws/trunk/target/surefire/surefirebooter1061603337229682378.jar>
<https://builds.apache.org/job/HBase-0.92-security/ws/trunk/target/surefire/surefire8354540409249778600tmp>
<https://builds.apache.org/job/HBase-0.92-security/ws/trunk/target/surefire/surefire8562709626665795064tmp>
Running org.apache.hadoop.hbase.io.hfile.TestBlockCacheColumnFamilySummary
Tests run: 4, Failures: 0, Errors: 0, Skipped: 0, Time elapsed: 0.057 sec
Forking command line: /bin/sh -c cd <https://builds.apache.org/job/HBase-0.92-security/ws/trunk>
&& /home/jenkins/tools/java/jdk1.6.0_27-32/jre/bin/java -enableassertions -Xmx1400m
-jar <https://builds.apache.org/job/HBase-0.92-security/ws/trunk/target/surefire/surefirebooter2199559466435363417.jar>
<https://builds.apache.org/job/HBase-0.92-security/ws/trunk/target/surefire/surefire360435608482276468tmp>
<https://builds.apache.org/job/HBase-0.92-security/ws/trunk/target/surefire/surefire1149431695533592752tmp>
Running org.apache.hadoop.hbase.io.hfile.TestHFileReaderV1
Tests run: 1, Failures: 0, Errors: 0, Skipped: 0, Time elapsed: 0.573 sec
Forking command line: /bin/sh -c cd <https://builds.apache.org/job/HBase-0.92-security/ws/trunk>
&& /home/jenkins/tools/java/jdk1.6.0_27-32/jre/bin/java -enableassertions -Xmx1400m
-jar <https://builds.apache.org/job/HBase-0.92-security/ws/trunk/target/surefire/surefirebooter8779965037287724739.jar>
<https://builds.apache.org/job/HBase-0.92-security/ws/trunk/target/surefire/surefire385511710442994131tmp>
<https://builds.apache.org/job/HBase-0.92-security/ws/trunk/target/surefire/surefire303634214324632709tmp>
Running org.apache.hadoop.hbase.io.hfile.TestHFile
Tests run: 6, Failures: 0, Errors: 0, Skipped: 0, Time elapsed: 0.858 sec
Forking command line: /bin/sh -c cd <https://builds.apache.org/job/HBase-0.92-security/ws/trunk>
&& /home/jenkins/tools/java/jdk1.6.0_27-32/jre/bin/java -enableassertions -Xmx1400m
-jar <https://builds.apache.org/job/HBase-0.92-security/ws/trunk/target/surefire/surefirebooter108190805280424598.jar>
<https://builds.apache.org/job/HBase-0.92-security/ws/trunk/target/surefire/surefire3389700527993229973tmp>
<https://builds.apache.org/job/HBase-0.92-security/ws/trunk/target/surefire/surefire1751330956620610784tmp>
Running org.apache.hadoop.hbase.io.hfile.TestReseekTo
Tests run: 1, Failures: 0, Errors: 0, Skipped: 0, Time elapsed: 0.644 sec
Forking command line: /bin/sh -c cd <https://builds.apache.org/job/HBase-0.92-security/ws/trunk>
&& /home/jenkins/tools/java/jdk1.6.0_27-32/jre/bin/java -enableassertions -Xmx1400m
-jar <https://builds.apache.org/job/HBase-0.92-security/ws/trunk/target/surefire/surefirebooter8320856040874486322.jar>
<https://builds.apache.org/job/HBase-0.92-security/ws/trunk/target/surefire/surefire2340324545755592232tmp>
<https://builds.apache.org/job/HBase-0.92-security/ws/trunk/target/surefire/surefire1811721259643995825tmp>
Running org.apache.hadoop.hbase.io.hfile.TestHFileBlock
Tests run: 7, Failures: 0, Errors: 0, Skipped: 0, Time elapsed: 25.311 sec
Forking command line: /bin/sh -c cd <https://builds.apache.org/job/HBase-0.92-security/ws/trunk>
&& /home/jenkins/tools/java/jdk1.6.0_27-32/jre/bin/java -enableassertions -Xmx1400m
-jar <https://builds.apache.org/job/HBase-0.92-security/ws/trunk/target/surefire/surefirebooter2925486751203217250.jar>
<https://builds.apache.org/job/HBase-0.92-security/ws/trunk/target/surefire/surefire5779893588768342317tmp>
<https://builds.apache.org/job/HBase-0.92-security/ws/trunk/target/surefire/surefire6537304106524965433tmp>
Running org.apache.hadoop.hbase.io.hfile.TestSeekTo
Tests run: 3, Failures: 0, Errors: 0, Skipped: 0, Time elapsed: 0.655 sec
Forking command line: /bin/sh -c cd <https://builds.apache.org/job/HBase-0.92-security/ws/trunk>
&& /home/jenkins/tools/java/jdk1.6.0_27-32/jre/bin/java -enableassertions -Xmx1400m
-jar <https://builds.apache.org/job/HBase-0.92-security/ws/trunk/target/surefire/surefirebooter4028658053812847527.jar>
<https://builds.apache.org/job/HBase-0.92-security/ws/trunk/target/surefire/surefire2865130420191391810tmp>
<https://builds.apache.org/job/HBase-0.92-security/ws/trunk/target/surefire/surefire4440575910115699257tmp>
Running org.apache.hadoop.hbase.io.hfile.TestCacheOnWrite
Tests run: 6, Failures: 0, Errors: 0, Skipped: 0, Time elapsed: 7.565 sec
Forking command line: /bin/sh -c cd <https://builds.apache.org/job/HBase-0.92-security/ws/trunk>
&& /home/jenkins/tools/java/jdk1.6.0_27-32/jre/bin/java -enableassertions -Xmx1400m
-jar <https://builds.apache.org/job/HBase-0.92-security/ws/trunk/target/surefire/surefirebooter5577651241437320651.jar>
<https://builds.apache.org/job/HBase-0.92-security/ws/trunk/target/surefire/surefire468132795488402981tmp>
<https://builds.apache.org/job/HBase-0.92-security/ws/trunk/target/surefire/surefire6840975948410513692tmp>
Running org.apache.hadoop.hbase.io.TestHbaseObjectWritable
Tests run: 4, Failures: 0, Errors: 0, Skipped: 0, Time elapsed: 0.46 sec
Forking command line: /bin/sh -c cd <https://builds.apache.org/job/HBase-0.92-security/ws/trunk>
&& /home/jenkins/tools/java/jdk1.6.0_27-32/jre/bin/java -enableassertions -Xmx1400m
-jar <https://builds.apache.org/job/HBase-0.92-security/ws/trunk/target/surefire/surefirebooter6732795188297720815.jar>
<https://builds.apache.org/job/HBase-0.92-security/ws/trunk/target/surefire/surefire1789634743741794023tmp>
<https://builds.apache.org/job/HBase-0.92-security/ws/trunk/target/surefire/surefire3720927661443885727tmp>
Running org.apache.hadoop.hbase.io.TestImmutableBytesWritable
Tests run: 3, Failures: 0, Errors: 0, Skipped: 0, Time elapsed: 0.11 sec
Forking command line: /bin/sh -c cd <https://builds.apache.org/job/HBase-0.92-security/ws/trunk>
&& /home/jenkins/tools/java/jdk1.6.0_27-32/jre/bin/java -enableassertions -Xmx1400m
-jar <https://builds.apache.org/job/HBase-0.92-security/ws/trunk/target/surefire/surefirebooter825055203965175326.jar>
<https://builds.apache.org/job/HBase-0.92-security/ws/trunk/target/surefire/surefire5111833799481710129tmp>
<https://builds.apache.org/job/HBase-0.92-security/ws/trunk/target/surefire/surefire7625216669914748872tmp>
Running org.apache.hadoop.hbase.io.TestHalfStoreFileReader
Tests run: 1, Failures: 0, Errors: 0, Skipped: 0, Time elapsed: 0.69 sec
Forking command line: /bin/sh -c cd <https://builds.apache.org/job/HBase-0.92-security/ws/trunk>
&& /home/jenkins/tools/java/jdk1.6.0_27-32/jre/bin/java -enableassertions -Xmx1400m
-jar <https://builds.apache.org/job/HBase-0.92-security/ws/trunk/target/surefire/surefirebooter4148769267502296857.jar>
<https://builds.apache.org/job/HBase-0.92-security/ws/trunk/target/surefire/surefire1735434429092778017tmp>
<https://builds.apache.org/job/HBase-0.92-security/ws/trunk/target/surefire/surefire6250991594168609929tmp>
Running org.apache.hadoop.hbase.migration.TestMigrationFrom090To092
Tests run: 1, Failures: 0, Errors: 0, Skipped: 0, Time elapsed: 0.27 sec
Forking command line: /bin/sh -c cd <https://builds.apache.org/job/HBase-0.92-security/ws/trunk>
&& /home/jenkins/tools/java/jdk1.6.0_27-32/jre/bin/java -enableassertions -Xmx1400m
-jar <https://builds.apache.org/job/HBase-0.92-security/ws/trunk/target/surefire/surefirebooter637631603747936660.jar>
<https://builds.apache.org/job/HBase-0.92-security/ws/trunk/target/surefire/surefire1344733309859295361tmp>
<https://builds.apache.org/job/HBase-0.92-security/ws/trunk/target/surefire/surefire8540491916209179656tmp>
Running org.apache.hadoop.hbase.TestFSTableDescriptorForceCreation
Tests run: 3, Failures: 0, Errors: 0, Skipped: 0, Time elapsed: 0.55 sec
Forking command line: /bin/sh -c cd <https://builds.apache.org/job/HBase-0.92-security/ws/trunk>
&& /home/jenkins/tools/java/jdk1.6.0_27-32/jre/bin/java -enableassertions -Xmx1400m
-jar <https://builds.apache.org/job/HBase-0.92-security/ws/trunk/target/surefire/surefirebooter8244312202263385439.jar>
<https://builds.apache.org/job/HBase-0.92-security/ws/trunk/target/surefire/surefire8551832043133494112tmp>
<https://builds.apache.org/job/HBase-0.92-security/ws/trunk/target/surefire/surefire9056641110060082999tmp>
Running org.apache.hadoop.hbase.avro.TestAvroUtil
Tests run: 1, Failures: 0, Errors: 0, Skipped: 0, Time elapsed: 0.631 sec
Forking command line: /bin/sh -c cd <https://builds.apache.org/job/HBase-0.92-security/ws/trunk>
&& /home/jenkins/tools/java/jdk1.6.0_27-32/jre/bin/java -enableassertions -Xmx1400m
-jar <https://builds.apache.org/job/HBase-0.92-security/ws/trunk/target/surefire/surefirebooter3642458058241854225.jar>
<https://builds.apache.org/job/HBase-0.92-security/ws/trunk/target/surefire/surefire7011328155930379338tmp>
<https://builds.apache.org/job/HBase-0.92-security/ws/trunk/target/surefire/surefire8450434905735285606tmp>
Running org.apache.hadoop.hbase.avro.TestAvroServer
Tests run: 3, Failures: 0, Errors: 0, Skipped: 0, Time elapsed: 34.022 sec
Forking command line: /bin/sh -c cd <https://builds.apache.org/job/HBase-0.92-security/ws/trunk>
&& /home/jenkins/tools/java/jdk1.6.0_27-32/jre/bin/java -enableassertions -Xmx1400m
-jar <https://builds.apache.org/job/HBase-0.92-security/ws/trunk/target/surefire/surefirebooter8510833789063095462.jar>
<https://builds.apache.org/job/HBase-0.92-security/ws/trunk/target/surefire/surefire789124500716895897tmp>
<https://builds.apache.org/job/HBase-0.92-security/ws/trunk/target/surefire/surefire7645309899204327316tmp>
Running org.apache.hadoop.hbase.TestKeyValue
Tests run: 11, Failures: 0, Errors: 0, Skipped: 0, Time elapsed: 0.129 sec
Forking command line: /bin/sh -c cd <https://builds.apache.org/job/HBase-0.92-security/ws/trunk>
&& /home/jenkins/tools/java/jdk1.6.0_27-32/jre/bin/java -enableassertions -Xmx1400m
-jar <https://builds.apache.org/job/HBase-0.92-security/ws/trunk/target/surefire/surefirebooter8235475060555673077.jar>
<https://builds.apache.org/job/HBase-0.92-security/ws/trunk/target/surefire/surefire2995514135082614906tmp>
<https://builds.apache.org/job/HBase-0.92-security/ws/trunk/target/surefire/surefire1813900984455546795tmp>
Running org.apache.hadoop.hbase.replication.TestMultiSlaveReplication
Tests run: 1, Failures: 0, Errors: 0, Skipped: 0, Time elapsed: 66.323 sec
Forking command line: /bin/sh -c cd <https://builds.apache.org/job/HBase-0.92-security/ws/trunk>
&& /home/jenkins/tools/java/jdk1.6.0_27-32/jre/bin/java -enableassertions -Xmx1400m
-jar <https://builds.apache.org/job/HBase-0.92-security/ws/trunk/target/surefire/surefirebooter158557700743222245.jar>
<https://builds.apache.org/job/HBase-0.92-security/ws/trunk/target/surefire/surefire392614233533987397tmp>
<https://builds.apache.org/job/HBase-0.92-security/ws/trunk/target/surefire/surefire3747876784014768117tmp>
Running org.apache.hadoop.hbase.replication.regionserver.TestReplicationSourceManager
Tests run: 1, Failures: 0, Errors: 0, Skipped: 0, Time elapsed: 0.991 sec
Forking command line: /bin/sh -c cd <https://builds.apache.org/job/HBase-0.92-security/ws/trunk>
&& /home/jenkins/tools/java/jdk1.6.0_27-32/jre/bin/java -enableassertions -Xmx1400m
-jar <https://builds.apache.org/job/HBase-0.92-security/ws/trunk/target/surefire/surefirebooter2951587548720819458.jar>
<https://builds.apache.org/job/HBase-0.92-security/ws/trunk/target/surefire/surefire5688563895112666670tmp>
<https://builds.apache.org/job/HBase-0.92-security/ws/trunk/target/surefire/surefire2268767631933633107tmp>
Running org.apache.hadoop.hbase.replication.regionserver.TestReplicationSink
Tests run: 5, Failures: 0, Errors: 0, Skipped: 0, Time elapsed: 22.288 sec
Forking command line: /bin/sh -c cd <https://builds.apache.org/job/HBase-0.92-security/ws/trunk>
&& /home/jenkins/tools/java/jdk1.6.0_27-32/jre/bin/java -enableassertions -Xmx1400m
-jar <https://builds.apache.org/job/HBase-0.92-security/ws/trunk/target/surefire/surefirebooter3978593762926405573.jar>
<https://builds.apache.org/job/HBase-0.92-security/ws/trunk/target/surefire/surefire8055521281243704790tmp>
<https://builds.apache.org/job/HBase-0.92-security/ws/trunk/target/surefire/surefire1874415746934913040tmp>
Running org.apache.hadoop.hbase.replication.TestMasterReplication
Tests run: 2, Failures: 0, Errors: 0, Skipped: 0, Time elapsed: 104.031 sec
Forking command line: /bin/sh -c cd <https://builds.apache.org/job/HBase-0.92-security/ws/trunk>
&& /home/jenkins/tools/java/jdk1.6.0_27-32/jre/bin/java -enableassertions -Xmx1400m
-jar <https://builds.apache.org/job/HBase-0.92-security/ws/trunk/target/surefire/surefirebooter5529997473326689114.jar>
<https://builds.apache.org/job/HBase-0.92-security/ws/trunk/target/surefire/surefire653850384107574067tmp>
<https://builds.apache.org/job/HBase-0.92-security/ws/trunk/target/surefire/surefire4021960344392270097tmp>
Running org.apache.hadoop.hbase.replication.TestReplicationSource
Tests run: 1, Failures: 0, Errors: 0, Skipped: 0, Time elapsed: 2.698 sec
Forking command line: /bin/sh -c cd <https://builds.apache.org/job/HBase-0.92-security/ws/trunk>
&& /home/jenkins/tools/java/jdk1.6.0_27-32/jre/bin/java -enableassertions -Xmx1400m
-jar <https://builds.apache.org/job/HBase-0.92-security/ws/trunk/target/surefire/surefirebooter1563114326820826364.jar>
<https://builds.apache.org/job/HBase-0.92-security/ws/trunk/target/surefire/surefire8666538061441583204tmp>
<https://builds.apache.org/job/HBase-0.92-security/ws/trunk/target/surefire/surefire1865739023346242774tmp>
Running org.apache.hadoop.hbase.replication.TestReplicationPeer
Tests run: 1, Failures: 0, Errors: 0, Skipped: 0, Time elapsed: 25.556 sec
Forking command line: /bin/sh -c cd <https://builds.apache.org/job/HBase-0.92-security/ws/trunk>
&& /home/jenkins/tools/java/jdk1.6.0_27-32/jre/bin/java -enableassertions -Xmx1400m
-jar <https://builds.apache.org/job/HBase-0.92-security/ws/trunk/target/surefire/surefirebooter3753388712453363475.jar>
<https://builds.apache.org/job/HBase-0.92-security/ws/trunk/target/surefire/surefire7397924097330837672tmp>
<https://builds.apache.org/job/HBase-0.92-security/ws/trunk/target/surefire/surefire3249598329219968538tmp>
Running org.apache.hadoop.hbase.replication.TestReplication
Tests run: 7, Failures: 0, Errors: 0, Skipped: 0, Time elapsed: 131.228 sec
Forking command line: /bin/sh -c cd <https://builds.apache.org/job/HBase-0.92-security/ws/trunk>
&& /home/jenkins/tools/java/jdk1.6.0_27-32/jre/bin/java -enableassertions -Xmx1400m
-jar <https://builds.apache.org/job/HBase-0.92-security/ws/trunk/target/surefire/surefirebooter5838980109744205792.jar>
<https://builds.apache.org/job/HBase-0.92-security/ws/trunk/target/surefire/surefire7113939612421843053tmp>
<https://builds.apache.org/job/HBase-0.92-security/ws/trunk/target/surefire/surefire2740864076011330808tmp>
Running org.apache.hadoop.hbase.ipc.TestDelayedRpc
Tests run: 4, Failures: 0, Errors: 0, Skipped: 0, Time elapsed: 2.28 sec
Forking command line: /bin/sh -c cd <https://builds.apache.org/job/HBase-0.92-security/ws/trunk>
&& /home/jenkins/tools/java/jdk1.6.0_27-32/jre/bin/java -enableassertions -Xmx1400m
-jar <https://builds.apache.org/job/HBase-0.92-security/ws/trunk/target/surefire/surefirebooter7435188685945900491.jar>
<https://builds.apache.org/job/HBase-0.92-security/ws/trunk/target/surefire/surefire4615746957444875520tmp>
<https://builds.apache.org/job/HBase-0.92-security/ws/trunk/target/surefire/surefire3904653425269367937tmp>
Running org.apache.hadoop.hbase.TestCompare
Tests run: 1, Failures: 0, Errors: 0, Skipped: 0, Time elapsed: 0.233 sec
Forking command line: /bin/sh -c cd <https://builds.apache.org/job/HBase-0.92-security/ws/trunk>
&& /home/jenkins/tools/java/jdk1.6.0_27-32/jre/bin/java -enableassertions -Xmx1400m
-jar <https://builds.apache.org/job/HBase-0.92-security/ws/trunk/target/surefire/surefirebooter8607611221217711489.jar>
<https://builds.apache.org/job/HBase-0.92-security/ws/trunk/target/surefire/surefire992817902352149568tmp>
<https://builds.apache.org/job/HBase-0.92-security/ws/trunk/target/surefire/surefire1169851042151140828tmp>
Running org.apache.hadoop.hbase.TestZooKeeper
Tests run: 7, Failures: 0, Errors: 0, Skipped: 0, Time elapsed: 88.34 sec
Forking command line: /bin/sh -c cd <https://builds.apache.org/job/HBase-0.92-security/ws/trunk>
&& /home/jenkins/tools/java/jdk1.6.0_27-32/jre/bin/java -enableassertions -Xmx1400m
-jar <https://builds.apache.org/job/HBase-0.92-security/ws/trunk/target/surefire/surefirebooter4695240411761695885.jar>
<https://builds.apache.org/job/HBase-0.92-security/ws/trunk/target/surefire/surefire1644436794822237877tmp>
<https://builds.apache.org/job/HBase-0.92-security/ws/trunk/target/surefire/surefire4583425304441868102tmp>
Running org.apache.hadoop.hbase.TestHBaseTestingUtility
Tests run: 7, Failures: 0, Errors: 0, Skipped: 0, Time elapsed: 109.651 sec

Results :

Failed tests:   testcomputeHDFSBlocksDistribution(org.apache.hadoop.hbase.util.TestFSUtils)

Tests in error: 
  testMasterFailoverWithMockedRIT(org.apache.hadoop.hbase.master.TestMasterFailover): KeeperErrorCode
= ConnectionLoss for /hbase/unassigned
  testBasicRollingRestart(org.apache.hadoop.hbase.master.TestRollingRestart): Failed construction
of Master: class org.apache.hadoop.hbase.master.HMasterKeeperErrorCode = ConnectionLoss for
/hbase

Tests run: 1093, Failures: 1, Errors: 2, Skipped: 10

[INFO] ------------------------------------------------------------------------
[INFO] BUILD FAILURE
[INFO] ------------------------------------------------------------------------
[INFO] Total time: 1:49:41.807s
[INFO] Finished at: Wed Nov 23 11:49:28 UTC 2011
[INFO] Final Memory: 98M/2059M
[INFO] ------------------------------------------------------------------------
[ERROR] Failed to execute goal org.apache.maven.plugins:maven-surefire-plugin:2.10:test (default-test)
on project hbase: There are test failures.
[ERROR] 
[ERROR] Please refer to <https://builds.apache.org/job/HBase-0.92-security/ws/trunk/target/surefire-reports>
for the individual test results.
[ERROR] -> [Help 1]
org.apache.maven.lifecycle.LifecycleExecutionException: Failed to execute goal org.apache.maven.plugins:maven-surefire-plugin:2.10:test
(default-test) on project hbase: There are test failures.

Please refer to <https://builds.apache.org/job/HBase-0.92-security/ws/trunk/target/surefire-reports>
for the individual test results.
	at org.apache.maven.lifecycle.internal.MojoExecutor.execute(MojoExecutor.java:213)
	at org.apache.maven.lifecycle.internal.MojoExecutor.execute(MojoExecutor.java:153)
	at org.apache.maven.lifecycle.internal.MojoExecutor.execute(MojoExecutor.java:145)
	at org.apache.maven.lifecycle.internal.MojoExecutor.executeForkedExecutions(MojoExecutor.java:365)
	at org.apache.maven.lifecycle.internal.MojoExecutor.execute(MojoExecutor.java:199)
	at org.apache.maven.lifecycle.internal.MojoExecutor.execute(MojoExecutor.java:153)
	at org.apache.maven.lifecycle.internal.MojoExecutor.execute(MojoExecutor.java:145)
	at org.apache.maven.lifecycle.internal.LifecycleModuleBuilder.buildProject(LifecycleModuleBuilder.java:84)
	at org.apache.maven.lifecycle.internal.LifecycleModuleBuilder.buildProject(LifecycleModuleBuilder.java:59)
	at org.apache.maven.lifecycle.internal.LifecycleStarter.singleThreadedBuild(LifecycleStarter.java:183)
	at org.apache.maven.lifecycle.internal.LifecycleStarter.execute(LifecycleStarter.java:161)
	at org.apache.maven.DefaultMaven.doExecute(DefaultMaven.java:319)
	at org.apache.maven.DefaultMaven.execute(DefaultMaven.java:156)
	at org.apache.maven.cli.MavenCli.execute(MavenCli.java:537)
	at org.apache.maven.cli.MavenCli.doMain(MavenCli.java:196)
	at org.apache.maven.cli.MavenCli.main(MavenCli.java:141)
	at sun.reflect.NativeMethodAccessorImpl.invoke0(Native Method)
	at sun.reflect.NativeMethodAccessorImpl.invoke(NativeMethodAccessorImpl.java:39)
	at sun.reflect.DelegatingMethodAccessorImpl.invoke(DelegatingMethodAccessorImpl.java:25)
	at java.lang.reflect.Method.invoke(Method.java:597)
	at org.codehaus.plexus.classworlds.launcher.Launcher.launchEnhanced(Launcher.java:290)
	at org.codehaus.plexus.classworlds.launcher.Launcher.launch(Launcher.java:230)
	at org.codehaus.plexus.classworlds.launcher.Launcher.mainWithExitCode(Launcher.java:409)
	at org.codehaus.plexus.classworlds.launcher.Launcher.main(Launcher.java:352)
Caused by: org.apache.maven.plugin.MojoFailureException: There are test failures.

Please refer to <https://builds.apache.org/job/HBase-0.92-security/ws/trunk/target/surefire-reports>
for the individual test results.
	at org.apache.maven.plugin.surefire.SurefireHelper.reportExecution(SurefireHelper.java:87)
	at org.apache.maven.plugin.surefire.SurefirePlugin.writeSummary(SurefirePlugin.java:641)
	at org.apache.maven.plugin.surefire.SurefirePlugin.handleSummary(SurefirePlugin.java:615)
	at org.apache.maven.plugin.surefire.AbstractSurefireMojo.executeAfterPreconditionsChecked(AbstractSurefireMojo.java:137)
	at org.apache.maven.plugin.surefire.AbstractSurefireMojo.execute(AbstractSurefireMojo.java:98)
	at org.apache.maven.plugin.DefaultBuildPluginManager.executeMojo(DefaultBuildPluginManager.java:101)
	at org.apache.maven.lifecycle.internal.MojoExecutor.execute(MojoExecutor.java:209)
	... 23 more
[ERROR] 
[ERROR] 
[ERROR] For more information about the errors and possible solutions, please read the following
articles:
[ERROR] [Help 1] http://cwiki.apache.org/confluence/display/MAVEN/MojoFailureException
Build step 'Invoke top-level Maven targets' marked build as failure
[locks-and-latches] Releasing all the locks
[locks-and-latches] All the locks released
Archiving artifacts
Recording test results
ERROR: Failed to archive test reports
hudson.util.IOException2: remote file operation failed: <https://builds.apache.org/job/HBase-0.92-security/ws/>
at hudson.remoting.Channel@c05f6e2:ubuntu4
	at hudson.FilePath.act(FilePath.java:754)
	at hudson.FilePath.act(FilePath.java:740)
	at hudson.tasks.junit.JUnitParser.parse(JUnitParser.java:83)
	at hudson.tasks.junit.JUnitResultArchiver.parse(JUnitResultArchiver.java:122)
	at hudson.tasks.junit.JUnitResultArchiver.perform(JUnitResultArchiver.java:134)
	at hudson.tasks.BuildStepMonitor$1.perform(BuildStepMonitor.java:19)
	at hudson.model.AbstractBuild$AbstractRunner.perform(AbstractBuild.java:693)
	at hudson.model.AbstractBuild$AbstractRunner.performAllBuildSteps(AbstractBuild.java:668)
	at hudson.model.AbstractBuild$AbstractRunner.performAllBuildSteps(AbstractBuild.java:646)
	at hudson.model.Build$RunnerImpl.post2(Build.java:162)
	at hudson.model.AbstractBuild$AbstractRunner.post(AbstractBuild.java:615)
	at hudson.model.Run.run(Run.java:1401)
	at hudson.model.FreeStyleBuild.run(FreeStyleBuild.java:46)
	at hudson.model.ResourceController.execute(ResourceController.java:88)
	at hudson.model.Executor.run(Executor.java:230)
Caused by: java.io.IOException: Remote call on ubuntu4 failed
	at hudson.remoting.Channel.call(Channel.java:690)
	at hudson.FilePath.act(FilePath.java:747)
	... 14 more
Caused by: java.lang.OutOfMemoryError: Java heap space
	at java.util.Arrays.copyOf(Arrays.java:2894)
	at java.lang.AbstractStringBuilder.expandCapacity(AbstractStringBuilder.java:117)
	at java.lang.AbstractStringBuilder.append(AbstractStringBuilder.java:532)
	at java.lang.StringBuffer.append(StringBuffer.java:323)
	at java.io.StringWriter.write(StringWriter.java:94)
	at org.apache.commons.io.IOUtils.copyLarge(IOUtils.java:1129)
	at org.apache.commons.io.IOUtils.copy(IOUtils.java:1104)
	at org.apache.commons.io.IOUtils.copy(IOUtils.java:1050)
	at org.apache.commons.io.IOUtils.copy(IOUtils.java:1075)
	at org.apache.commons.io.IOUtils.toString(IOUtils.java:382)
	at org.apache.commons.io.FileUtils.readFileToString(FileUtils.java:1103)
	at org.apache.commons.io.FileUtils.readFileToString(FileUtils.java:1120)
	at hudson.tasks.junit.SuiteResult.<init>(SuiteResult.java:195)
	at hudson.tasks.junit.SuiteResult.parseSuite(SuiteResult.java:130)
	at hudson.tasks.junit.SuiteResult.parse(SuiteResult.java:115)
	at hudson.tasks.junit.TestResult.parse(TestResult.java:208)
	at hudson.tasks.junit.TestResult.parse(TestResult.java:163)
	at hudson.tasks.junit.TestResult.parse(TestResult.java:140)
	at hudson.tasks.junit.TestResult.<init>(TestResult.java:116)
	at hudson.tasks.junit.JUnitParser$ParseResultCallable.invoke(JUnitParser.java:114)
	at hudson.tasks.junit.JUnitParser$ParseResultCallable.invoke(JUnitParser.java:87)
	at hudson.FilePath$FileCallableWrapper.call(FilePath.java:1995)
	at hudson.remoting.UserRequest.perform(UserRequest.java:118)
	at hudson.remoting.UserRequest.perform(UserRequest.java:48)
	at hudson.remoting.Request$2.run(Request.java:287)
	at java.util.concurrent.Executors$RunnableAdapter.call(Executors.java:471)
	at java.util.concurrent.FutureTask$Sync.innerRun(FutureTask.java:334)
	at java.util.concurrent.FutureTask.run(FutureTask.java:166)
	at java.util.concurrent.ThreadPoolExecutor.runWorker(ThreadPoolExecutor.java:1110)
	at java.util.concurrent.ThreadPoolExecutor$Worker.run(ThreadPoolExecutor.java:603)
	at java.lang.Thread.run(Thread.java:636)
Updating HBASE-4851
Updating HBASE-4854


Mime
View raw message