hbase-dev mailing list archives

Site index · List index
Message view « Date » · « Thread »
Top « Date » · « Thread »
From Apache Jenkins Server <jenk...@builds.apache.org>
Subject Build failed in Jenkins: HBase-0.92 #161
Date Tue, 22 Nov 2011 23:51:08 GMT
See <https://builds.apache.org/job/HBase-0.92/161/changes>

Changes:

[stack] HBASE-4849 TestCatalogTracker can fail if an existing zookeeper running

[stack] HBASE-4849 TestCatalogTracker can fail if an existing zookeeper running

[stack] HBASE-4848 TestScanner failing because hostname can't be null

------------------------------------------
[...truncated 6572 lines...]
Running org.apache.hadoop.hbase.regionserver.TestExplicitColumnTracker
Tests run: 4, Failures: 0, Errors: 0, Skipped: 0, Time elapsed: 0.895 sec
Forking command line: /bin/sh -c cd <https://builds.apache.org/job/HBase-0.92/ws/trunk>
&& /home/hudson/tools/java/jdk1.6.0_27-32/jre/bin/java -enableassertions -Xmx1400m
-jar <https://builds.apache.org/job/HBase-0.92/ws/trunk/target/surefire/surefirebooter4133447124759521135.jar>
<https://builds.apache.org/job/HBase-0.92/ws/trunk/target/surefire/surefire4658792230527178449tmp>
<https://builds.apache.org/job/HBase-0.92/ws/trunk/target/surefire/surefire4618479839133677250tmp>
Running org.apache.hadoop.hbase.regionserver.TestHRegionServerBulkLoad
Tests run: 1, Failures: 0, Errors: 0, Skipped: 0, Time elapsed: 71.233 sec
Forking command line: /bin/sh -c cd <https://builds.apache.org/job/HBase-0.92/ws/trunk>
&& /home/hudson/tools/java/jdk1.6.0_27-32/jre/bin/java -enableassertions -Xmx1400m
-jar <https://builds.apache.org/job/HBase-0.92/ws/trunk/target/surefire/surefirebooter3451153154321747744.jar>
<https://builds.apache.org/job/HBase-0.92/ws/trunk/target/surefire/surefire8294424715748706957tmp>
<https://builds.apache.org/job/HBase-0.92/ws/trunk/target/surefire/surefire5120958612398407309tmp>
Running org.apache.hadoop.hbase.regionserver.TestMemStoreLAB
Tests run: 3, Failures: 0, Errors: 0, Skipped: 0, Time elapsed: 1.288 sec
Forking command line: /bin/sh -c cd <https://builds.apache.org/job/HBase-0.92/ws/trunk>
&& /home/hudson/tools/java/jdk1.6.0_27-32/jre/bin/java -enableassertions -Xmx1400m
-jar <https://builds.apache.org/job/HBase-0.92/ws/trunk/target/surefire/surefirebooter3580383081372741862.jar>
<https://builds.apache.org/job/HBase-0.92/ws/trunk/target/surefire/surefire7953482470269700500tmp>
<https://builds.apache.org/job/HBase-0.92/ws/trunk/target/surefire/surefire695568989624598557tmp>
Running org.apache.hadoop.hbase.regionserver.TestSplitLogWorker
Tests run: 5, Failures: 0, Errors: 0, Skipped: 0, Time elapsed: 2.468 sec
Forking command line: /bin/sh -c cd <https://builds.apache.org/job/HBase-0.92/ws/trunk>
&& /home/hudson/tools/java/jdk1.6.0_27-32/jre/bin/java -enableassertions -Xmx1400m
-jar <https://builds.apache.org/job/HBase-0.92/ws/trunk/target/surefire/surefirebooter6241915681265049492.jar>
<https://builds.apache.org/job/HBase-0.92/ws/trunk/target/surefire/surefire4861495049464409302tmp>
<https://builds.apache.org/job/HBase-0.92/ws/trunk/target/surefire/surefire9049531466995592868tmp>
Running org.apache.hadoop.hbase.regionserver.TestMultiColumnScanner
Tests run: 6, Failures: 0, Errors: 0, Skipped: 0, Time elapsed: 18.098 sec
Forking command line: /bin/sh -c cd <https://builds.apache.org/job/HBase-0.92/ws/trunk>
&& /home/hudson/tools/java/jdk1.6.0_27-32/jre/bin/java -enableassertions -Xmx1400m
-jar <https://builds.apache.org/job/HBase-0.92/ws/trunk/target/surefire/surefirebooter933098534249473991.jar>
<https://builds.apache.org/job/HBase-0.92/ws/trunk/target/surefire/surefire2351239284384135965tmp>
<https://builds.apache.org/job/HBase-0.92/ws/trunk/target/surefire/surefire4599353663826609755tmp>
Running org.apache.hadoop.hbase.regionserver.TestSplitTransaction
Tests run: 6, Failures: 0, Errors: 0, Skipped: 0, Time elapsed: 3.756 sec
Forking command line: /bin/sh -c cd <https://builds.apache.org/job/HBase-0.92/ws/trunk>
&& /home/hudson/tools/java/jdk1.6.0_27-32/jre/bin/java -enableassertions -Xmx1400m
-jar <https://builds.apache.org/job/HBase-0.92/ws/trunk/target/surefire/surefirebooter6264551359831991919.jar>
<https://builds.apache.org/job/HBase-0.92/ws/trunk/target/surefire/surefire4238540914045562850tmp>
<https://builds.apache.org/job/HBase-0.92/ws/trunk/target/surefire/surefire8234062778597837595tmp>
Running org.apache.hadoop.hbase.regionserver.TestCompoundBloomFilter
Tests run: 3, Failures: 0, Errors: 0, Skipped: 0, Time elapsed: 21.802 sec
Forking command line: /bin/sh -c cd <https://builds.apache.org/job/HBase-0.92/ws/trunk>
&& /home/hudson/tools/java/jdk1.6.0_27-32/jre/bin/java -enableassertions -Xmx1400m
-jar <https://builds.apache.org/job/HBase-0.92/ws/trunk/target/surefire/surefirebooter6947126596402399218.jar>
<https://builds.apache.org/job/HBase-0.92/ws/trunk/target/surefire/surefire5658518405273200713tmp>
<https://builds.apache.org/job/HBase-0.92/ws/trunk/target/surefire/surefire4244623732777493896tmp>
Running org.apache.hadoop.hbase.regionserver.TestEndToEndSplitTransaction
Tests run: 1, Failures: 0, Errors: 0, Skipped: 0, Time elapsed: 47.013 sec
Forking command line: /bin/sh -c cd <https://builds.apache.org/job/HBase-0.92/ws/trunk>
&& /home/hudson/tools/java/jdk1.6.0_27-32/jre/bin/java -enableassertions -Xmx1400m
-jar <https://builds.apache.org/job/HBase-0.92/ws/trunk/target/surefire/surefirebooter682915809871384348.jar>
<https://builds.apache.org/job/HBase-0.92/ws/trunk/target/surefire/surefire6539434711330432097tmp>
<https://builds.apache.org/job/HBase-0.92/ws/trunk/target/surefire/surefire1532569011440780626tmp>
Running org.apache.hadoop.hbase.regionserver.TestWideScanner
Tests run: 1, Failures: 0, Errors: 0, Skipped: 0, Time elapsed: 1.867 sec
Forking command line: /bin/sh -c cd <https://builds.apache.org/job/HBase-0.92/ws/trunk>
&& /home/hudson/tools/java/jdk1.6.0_27-32/jre/bin/java -enableassertions -Xmx1400m
-jar <https://builds.apache.org/job/HBase-0.92/ws/trunk/target/surefire/surefirebooter5408567961352516528.jar>
<https://builds.apache.org/job/HBase-0.92/ws/trunk/target/surefire/surefire3748744226461042951tmp>
<https://builds.apache.org/job/HBase-0.92/ws/trunk/target/surefire/surefire2431199264170432772tmp>
Running org.apache.hadoop.hbase.regionserver.TestHRegion
Tests run: 57, Failures: 0, Errors: 0, Skipped: 0, Time elapsed: 27.594 sec
Forking command line: /bin/sh -c cd <https://builds.apache.org/job/HBase-0.92/ws/trunk>
&& /home/hudson/tools/java/jdk1.6.0_27-32/jre/bin/java -enableassertions -Xmx1400m
-jar <https://builds.apache.org/job/HBase-0.92/ws/trunk/target/surefire/surefirebooter2357770893026821642.jar>
<https://builds.apache.org/job/HBase-0.92/ws/trunk/target/surefire/surefire4919190233425021291tmp>
<https://builds.apache.org/job/HBase-0.92/ws/trunk/target/surefire/surefire7137484905526819329tmp>
Running org.apache.hadoop.hbase.regionserver.TestMinVersions
Tests run: 6, Failures: 0, Errors: 0, Skipped: 0, Time elapsed: 1.433 sec
Forking command line: /bin/sh -c cd <https://builds.apache.org/job/HBase-0.92/ws/trunk>
&& /home/hudson/tools/java/jdk1.6.0_27-32/jre/bin/java -enableassertions -Xmx1400m
-jar <https://builds.apache.org/job/HBase-0.92/ws/trunk/target/surefire/surefirebooter7050509067863368194.jar>
<https://builds.apache.org/job/HBase-0.92/ws/trunk/target/surefire/surefire8863740881976319675tmp>
<https://builds.apache.org/job/HBase-0.92/ws/trunk/target/surefire/surefire5494739067859741078tmp>
Running org.apache.hadoop.hbase.client.TestGet
Tests run: 2, Failures: 0, Errors: 0, Skipped: 0, Time elapsed: 0.137 sec
Forking command line: /bin/sh -c cd <https://builds.apache.org/job/HBase-0.92/ws/trunk>
&& /home/hudson/tools/java/jdk1.6.0_27-32/jre/bin/java -enableassertions -Xmx1400m
-jar <https://builds.apache.org/job/HBase-0.92/ws/trunk/target/surefire/surefirebooter6260714628531060984.jar>
<https://builds.apache.org/job/HBase-0.92/ws/trunk/target/surefire/surefire5730375769101681096tmp>
<https://builds.apache.org/job/HBase-0.92/ws/trunk/target/surefire/surefire3153010333792532872tmp>
Running org.apache.hadoop.hbase.client.TestAttributes
Tests run: 3, Failures: 0, Errors: 0, Skipped: 0, Time elapsed: 0.139 sec
Forking command line: /bin/sh -c cd <https://builds.apache.org/job/HBase-0.92/ws/trunk>
&& /home/hudson/tools/java/jdk1.6.0_27-32/jre/bin/java -enableassertions -Xmx1400m
-jar <https://builds.apache.org/job/HBase-0.92/ws/trunk/target/surefire/surefirebooter7421272694387032529.jar>
<https://builds.apache.org/job/HBase-0.92/ws/trunk/target/surefire/surefire675054609695067328tmp>
<https://builds.apache.org/job/HBase-0.92/ws/trunk/target/surefire/surefire4762703850685275053tmp>
Running org.apache.hadoop.hbase.client.TestResult
Tests run: 3, Failures: 0, Errors: 0, Skipped: 0, Time elapsed: 0.143 sec
Forking command line: /bin/sh -c cd <https://builds.apache.org/job/HBase-0.92/ws/trunk>
&& /home/hudson/tools/java/jdk1.6.0_27-32/jre/bin/java -enableassertions -Xmx1400m
-jar <https://builds.apache.org/job/HBase-0.92/ws/trunk/target/surefire/surefirebooter4445811217517034984.jar>
<https://builds.apache.org/job/HBase-0.92/ws/trunk/target/surefire/surefire3226999894104091444tmp>
<https://builds.apache.org/job/HBase-0.92/ws/trunk/target/surefire/surefire5043685732691572556tmp>
Running org.apache.hadoop.hbase.client.replication.TestReplicationAdmin
Tests run: 1, Failures: 0, Errors: 0, Skipped: 0, Time elapsed: 0.985 sec
Forking command line: /bin/sh -c cd <https://builds.apache.org/job/HBase-0.92/ws/trunk>
&& /home/hudson/tools/java/jdk1.6.0_27-32/jre/bin/java -enableassertions -Xmx1400m
-jar <https://builds.apache.org/job/HBase-0.92/ws/trunk/target/surefire/surefirebooter2530275373643778012.jar>
<https://builds.apache.org/job/HBase-0.92/ws/trunk/target/surefire/surefire8272362273968008444tmp>
<https://builds.apache.org/job/HBase-0.92/ws/trunk/target/surefire/surefire3278308062138448280tmp>
Running org.apache.hadoop.hbase.client.TestTimestampsFilter
Tests run: 3, Failures: 0, Errors: 0, Skipped: 0, Time elapsed: 32.847 sec
Forking command line: /bin/sh -c cd <https://builds.apache.org/job/HBase-0.92/ws/trunk>
&& /home/hudson/tools/java/jdk1.6.0_27-32/jre/bin/java -enableassertions -Xmx1400m
-jar <https://builds.apache.org/job/HBase-0.92/ws/trunk/target/surefire/surefirebooter565720997325585452.jar>
<https://builds.apache.org/job/HBase-0.92/ws/trunk/target/surefire/surefire3033099337649984038tmp>
<https://builds.apache.org/job/HBase-0.92/ws/trunk/target/surefire/surefire4017114483369859727tmp>
Running org.apache.hadoop.hbase.client.TestMultipleTimestamps
Tests run: 8, Failures: 0, Errors: 0, Skipped: 0, Time elapsed: 85.951 sec
Forking command line: /bin/sh -c cd <https://builds.apache.org/job/HBase-0.92/ws/trunk>
&& /home/hudson/tools/java/jdk1.6.0_27-32/jre/bin/java -enableassertions -Xmx1400m
-jar <https://builds.apache.org/job/HBase-0.92/ws/trunk/target/surefire/surefirebooter339277089322373856.jar>
<https://builds.apache.org/job/HBase-0.92/ws/trunk/target/surefire/surefire5432951465267962912tmp>
<https://builds.apache.org/job/HBase-0.92/ws/trunk/target/surefire/surefire4523592417807952657tmp>
Running org.apache.hadoop.hbase.client.TestFromClientSide
Tests run: 46, Failures: 0, Errors: 0, Skipped: 3, Time elapsed: 193.103 sec
Forking command line: /bin/sh -c cd <https://builds.apache.org/job/HBase-0.92/ws/trunk>
&& /home/hudson/tools/java/jdk1.6.0_27-32/jre/bin/java -enableassertions -Xmx1400m
-jar <https://builds.apache.org/job/HBase-0.92/ws/trunk/target/surefire/surefirebooter8612850130590623515.jar>
<https://builds.apache.org/job/HBase-0.92/ws/trunk/target/surefire/surefire2343132608761018596tmp>
<https://builds.apache.org/job/HBase-0.92/ws/trunk/target/surefire/surefire1512417008831997835tmp>
Running org.apache.hadoop.hbase.client.TestHCM
Tests run: 5, Failures: 0, Errors: 0, Skipped: 0, Time elapsed: 32.305 sec
Forking command line: /bin/sh -c cd <https://builds.apache.org/job/HBase-0.92/ws/trunk>
&& /home/hudson/tools/java/jdk1.6.0_27-32/jre/bin/java -enableassertions -Xmx1400m
-jar <https://builds.apache.org/job/HBase-0.92/ws/trunk/target/surefire/surefirebooter3267605520468355733.jar>
<https://builds.apache.org/job/HBase-0.92/ws/trunk/target/surefire/surefire719333484966724785tmp>
<https://builds.apache.org/job/HBase-0.92/ws/trunk/target/surefire/surefire3482899515876264534tmp>
Running org.apache.hadoop.hbase.client.TestHTablePool
Tests run: 18, Failures: 0, Errors: 0, Skipped: 0, Time elapsed: 29.845 sec
Forking command line: /bin/sh -c cd <https://builds.apache.org/job/HBase-0.92/ws/trunk>
&& /home/hudson/tools/java/jdk1.6.0_27-32/jre/bin/java -enableassertions -Xmx1400m
-jar <https://builds.apache.org/job/HBase-0.92/ws/trunk/target/surefire/surefirebooter861603049049860128.jar>
<https://builds.apache.org/job/HBase-0.92/ws/trunk/target/surefire/surefire3759776512868877066tmp>
<https://builds.apache.org/job/HBase-0.92/ws/trunk/target/surefire/surefire4832664461725668986tmp>
Running org.apache.hadoop.hbase.client.TestHTableUtil
Tests run: 2, Failures: 0, Errors: 0, Skipped: 0, Time elapsed: 28.365 sec
Forking command line: /bin/sh -c cd <https://builds.apache.org/job/HBase-0.92/ws/trunk>
&& /home/hudson/tools/java/jdk1.6.0_27-32/jre/bin/java -enableassertions -Xmx1400m
-jar <https://builds.apache.org/job/HBase-0.92/ws/trunk/target/surefire/surefirebooter7687067564629452894.jar>
<https://builds.apache.org/job/HBase-0.92/ws/trunk/target/surefire/surefire7495398886263193127tmp>
<https://builds.apache.org/job/HBase-0.92/ws/trunk/target/surefire/surefire6486477752917908762tmp>
Running org.apache.hadoop.hbase.client.TestScan
Tests run: 2, Failures: 0, Errors: 0, Skipped: 0, Time elapsed: 0.14 sec
Forking command line: /bin/sh -c cd <https://builds.apache.org/job/HBase-0.92/ws/trunk>
&& /home/hudson/tools/java/jdk1.6.0_27-32/jre/bin/java -enableassertions -Xmx1400m
-jar <https://builds.apache.org/job/HBase-0.92/ws/trunk/target/surefire/surefirebooter2708016699183365323.jar>
<https://builds.apache.org/job/HBase-0.92/ws/trunk/target/surefire/surefire6895176169156165978tmp>
<https://builds.apache.org/job/HBase-0.92/ws/trunk/target/surefire/surefire1580623366298229183tmp>
Running org.apache.hadoop.hbase.client.TestAdmin
Tests run: 34, Failures: 0, Errors: 1, Skipped: 0, Time elapsed: 500.714 sec <<<
FAILURE!
Forking command line: /bin/sh -c cd <https://builds.apache.org/job/HBase-0.92/ws/trunk>
&& /home/hudson/tools/java/jdk1.6.0_27-32/jre/bin/java -enableassertions -Xmx1400m
-jar <https://builds.apache.org/job/HBase-0.92/ws/trunk/target/surefire/surefirebooter7939129996781386184.jar>
<https://builds.apache.org/job/HBase-0.92/ws/trunk/target/surefire/surefire309564362745949183tmp>
<https://builds.apache.org/job/HBase-0.92/ws/trunk/target/surefire/surefire6722624935147337528tmp>
Running org.apache.hadoop.hbase.client.TestMetaScanner
Tests run: 1, Failures: 0, Errors: 0, Skipped: 0, Time elapsed: 21.268 sec
Forking command line: /bin/sh -c cd <https://builds.apache.org/job/HBase-0.92/ws/trunk>
&& /home/hudson/tools/java/jdk1.6.0_27-32/jre/bin/java -enableassertions -Xmx1400m
-jar <https://builds.apache.org/job/HBase-0.92/ws/trunk/target/surefire/surefirebooter978143335595142564.jar>
<https://builds.apache.org/job/HBase-0.92/ws/trunk/target/surefire/surefire5156988243840671298tmp>
<https://builds.apache.org/job/HBase-0.92/ws/trunk/target/surefire/surefire6290173856467644764tmp>
Running org.apache.hadoop.hbase.client.TestShell
Tests run: 1, Failures: 0, Errors: 0, Skipped: 0, Time elapsed: 108.918 sec
Forking command line: /bin/sh -c cd <https://builds.apache.org/job/HBase-0.92/ws/trunk>
&& /home/hudson/tools/java/jdk1.6.0_27-32/jre/bin/java -enableassertions -Xmx1400m
-jar <https://builds.apache.org/job/HBase-0.92/ws/trunk/target/surefire/surefirebooter4200362508825668308.jar>
<https://builds.apache.org/job/HBase-0.92/ws/trunk/target/surefire/surefire8689103674442564089tmp>
<https://builds.apache.org/job/HBase-0.92/ws/trunk/target/surefire/surefire5133865600894093015tmp>
Running org.apache.hadoop.hbase.client.TestScannerTimeout
Tests run: 4, Failures: 0, Errors: 0, Skipped: 0, Time elapsed: 73.465 sec
Forking command line: /bin/sh -c cd <https://builds.apache.org/job/HBase-0.92/ws/trunk>
&& /home/hudson/tools/java/jdk1.6.0_27-32/jre/bin/java -enableassertions -Xmx1400m
-jar <https://builds.apache.org/job/HBase-0.92/ws/trunk/target/surefire/surefirebooter926494769023750766.jar>
<https://builds.apache.org/job/HBase-0.92/ws/trunk/target/surefire/surefire7611955947630505915tmp>
<https://builds.apache.org/job/HBase-0.92/ws/trunk/target/surefire/surefire8697069216939685888tmp>
Running org.apache.hadoop.hbase.client.TestMetaMigrationRemovingHTD
Tests run: 3, Failures: 0, Errors: 0, Skipped: 0, Time elapsed: 30.268 sec
Forking command line: /bin/sh -c cd <https://builds.apache.org/job/HBase-0.92/ws/trunk>
&& /home/hudson/tools/java/jdk1.6.0_27-32/jre/bin/java -enableassertions -Xmx1400m
-jar <https://builds.apache.org/job/HBase-0.92/ws/trunk/target/surefire/surefirebooter2178090015755022105.jar>
<https://builds.apache.org/job/HBase-0.92/ws/trunk/target/surefire/surefire5223193000414573474tmp>
<https://builds.apache.org/job/HBase-0.92/ws/trunk/target/surefire/surefire8267854279562517744tmp>
Running org.apache.hadoop.hbase.client.TestOperation
Tests run: 1, Failures: 0, Errors: 0, Skipped: 0, Time elapsed: 0.567 sec
Forking command line: /bin/sh -c cd <https://builds.apache.org/job/HBase-0.92/ws/trunk>
&& /home/hudson/tools/java/jdk1.6.0_27-32/jre/bin/java -enableassertions -Xmx1400m
-jar <https://builds.apache.org/job/HBase-0.92/ws/trunk/target/surefire/surefirebooter1401075503457820648.jar>
<https://builds.apache.org/job/HBase-0.92/ws/trunk/target/surefire/surefire2518736524737649225tmp>
<https://builds.apache.org/job/HBase-0.92/ws/trunk/target/surefire/surefire752697655772029508tmp>
Running org.apache.hadoop.hbase.client.TestMultiParallel
Tests run: 10, Failures: 0, Errors: 0, Skipped: 0, Time elapsed: 58.559 sec
Forking command line: /bin/sh -c cd <https://builds.apache.org/job/HBase-0.92/ws/trunk>
&& /home/hudson/tools/java/jdk1.6.0_27-32/jre/bin/java -enableassertions -Xmx1400m
-jar <https://builds.apache.org/job/HBase-0.92/ws/trunk/target/surefire/surefirebooter8534584087505312480.jar>
<https://builds.apache.org/job/HBase-0.92/ws/trunk/target/surefire/surefire1502219964775164258tmp>
<https://builds.apache.org/job/HBase-0.92/ws/trunk/target/surefire/surefire6914005619238948235tmp>
Running org.apache.hadoop.hbase.TestMultiVersions
Tests run: 3, Failures: 0, Errors: 0, Skipped: 0, Time elapsed: 37.692 sec
Forking command line: /bin/sh -c cd <https://builds.apache.org/job/HBase-0.92/ws/trunk>
&& /home/hudson/tools/java/jdk1.6.0_27-32/jre/bin/java -enableassertions -Xmx1400m
-jar <https://builds.apache.org/job/HBase-0.92/ws/trunk/target/surefire/surefirebooter7579517481396622955.jar>
<https://builds.apache.org/job/HBase-0.92/ws/trunk/target/surefire/surefire4594733554023535191tmp>
<https://builds.apache.org/job/HBase-0.92/ws/trunk/target/surefire/surefire1286288644847171378tmp>
Running org.apache.hadoop.hbase.thrift.TestThriftServer
Tests run: 1, Failures: 0, Errors: 0, Skipped: 0, Time elapsed: 32.09 sec
Forking command line: /bin/sh -c cd <https://builds.apache.org/job/HBase-0.92/ws/trunk>
&& /home/hudson/tools/java/jdk1.6.0_27-32/jre/bin/java -enableassertions -Xmx1400m
-jar <https://builds.apache.org/job/HBase-0.92/ws/trunk/target/surefire/surefirebooter1011445898399409893.jar>
<https://builds.apache.org/job/HBase-0.92/ws/trunk/target/surefire/surefire6443219469729954569tmp>
<https://builds.apache.org/job/HBase-0.92/ws/trunk/target/surefire/surefire2605347815129302661tmp>
Running org.apache.hadoop.hbase.master.TestRollingRestart
Tests run: 1, Failures: 0, Errors: 0, Skipped: 0, Time elapsed: 96.946 sec
Forking command line: /bin/sh -c cd <https://builds.apache.org/job/HBase-0.92/ws/trunk>
&& /home/hudson/tools/java/jdk1.6.0_27-32/jre/bin/java -enableassertions -Xmx1400m
-jar <https://builds.apache.org/job/HBase-0.92/ws/trunk/target/surefire/surefirebooter2368111216931308278.jar>
<https://builds.apache.org/job/HBase-0.92/ws/trunk/target/surefire/surefire2841598889012622516tmp>
<https://builds.apache.org/job/HBase-0.92/ws/trunk/target/surefire/surefire4150553867673195384tmp>
Running org.apache.hadoop.hbase.master.TestActiveMasterManager
Tests run: 2, Failures: 0, Errors: 0, Skipped: 0, Time elapsed: 1.225 sec
Forking command line: /bin/sh -c cd <https://builds.apache.org/job/HBase-0.92/ws/trunk>
&& /home/hudson/tools/java/jdk1.6.0_27-32/jre/bin/java -enableassertions -Xmx1400m
-jar <https://builds.apache.org/job/HBase-0.92/ws/trunk/target/surefire/surefirebooter4085143283642068019.jar>
<https://builds.apache.org/job/HBase-0.92/ws/trunk/target/surefire/surefire5590761725421201592tmp>
<https://builds.apache.org/job/HBase-0.92/ws/trunk/target/surefire/surefire336560809633513679tmp>
Running org.apache.hadoop.hbase.master.TestDeadServer
Tests run: 1, Failures: 0, Errors: 0, Skipped: 0, Time elapsed: 0.135 sec
Forking command line: /bin/sh -c cd <https://builds.apache.org/job/HBase-0.92/ws/trunk>
&& /home/hudson/tools/java/jdk1.6.0_27-32/jre/bin/java -enableassertions -Xmx1400m
-jar <https://builds.apache.org/job/HBase-0.92/ws/trunk/target/surefire/surefirebooter3091316048130524517.jar>
<https://builds.apache.org/job/HBase-0.92/ws/trunk/target/surefire/surefire1934548257538836960tmp>
<https://builds.apache.org/job/HBase-0.92/ws/trunk/target/surefire/surefire4020242754527600131tmp>
Running org.apache.hadoop.hbase.master.TestLogsCleaner
Tests run: 1, Failures: 0, Errors: 0, Skipped: 0, Time elapsed: 3.592 sec
Forking command line: /bin/sh -c cd <https://builds.apache.org/job/HBase-0.92/ws/trunk>
&& /home/hudson/tools/java/jdk1.6.0_27-32/jre/bin/java -enableassertions -Xmx1400m
-jar <https://builds.apache.org/job/HBase-0.92/ws/trunk/target/surefire/surefirebooter1975194902998723903.jar>
<https://builds.apache.org/job/HBase-0.92/ws/trunk/target/surefire/surefire321742714110780374tmp>
<https://builds.apache.org/job/HBase-0.92/ws/trunk/target/surefire/surefire1250744407467967496tmp>
Running org.apache.hadoop.hbase.master.TestZKBasedOpenCloseRegion
Tests run: 3, Failures: 0, Errors: 0, Skipped: 0, Time elapsed: 30.935 sec
Forking command line: /bin/sh -c cd <https://builds.apache.org/job/HBase-0.92/ws/trunk>
&& /home/hudson/tools/java/jdk1.6.0_27-32/jre/bin/java -enableassertions -Xmx1400m
-jar <https://builds.apache.org/job/HBase-0.92/ws/trunk/target/surefire/surefirebooter5381212224513204515.jar>
<https://builds.apache.org/job/HBase-0.92/ws/trunk/target/surefire/surefire5503164371930959362tmp>
<https://builds.apache.org/job/HBase-0.92/ws/trunk/target/surefire/surefire808222177816711313tmp>
Running org.apache.hadoop.hbase.master.TestMaster
Tests run: 1, Failures: 0, Errors: 0, Skipped: 0, Time elapsed: 23.782 sec
Forking command line: /bin/sh -c cd <https://builds.apache.org/job/HBase-0.92/ws/trunk>
&& /home/hudson/tools/java/jdk1.6.0_27-32/jre/bin/java -enableassertions -Xmx1400m
-jar <https://builds.apache.org/job/HBase-0.92/ws/trunk/target/surefire/surefirebooter3602017462049376808.jar>
<https://builds.apache.org/job/HBase-0.92/ws/trunk/target/surefire/surefire301478024770777241tmp>
<https://builds.apache.org/job/HBase-0.92/ws/trunk/target/surefire/surefire7194330077012146953tmp>
Running org.apache.hadoop.hbase.master.TestMasterTransitions
Tests run: 3, Failures: 0, Errors: 0, Skipped: 3, Time elapsed: 32.566 sec
Forking command line: /bin/sh -c cd <https://builds.apache.org/job/HBase-0.92/ws/trunk>
&& /home/hudson/tools/java/jdk1.6.0_27-32/jre/bin/java -enableassertions -Xmx1400m
-jar <https://builds.apache.org/job/HBase-0.92/ws/trunk/target/surefire/surefirebooter7414751145324038333.jar>
<https://builds.apache.org/job/HBase-0.92/ws/trunk/target/surefire/surefire7753383950478562712tmp>
<https://builds.apache.org/job/HBase-0.92/ws/trunk/target/surefire/surefire7240870957560672273tmp>
Running org.apache.hadoop.hbase.master.TestOpenedRegionHandler
Tests run: 2, Failures: 0, Errors: 0, Skipped: 0, Time elapsed: 21.202 sec
Forking command line: /bin/sh -c cd <https://builds.apache.org/job/HBase-0.92/ws/trunk>
&& /home/hudson/tools/java/jdk1.6.0_27-32/jre/bin/java -enableassertions -Xmx1400m
-jar <https://builds.apache.org/job/HBase-0.92/ws/trunk/target/surefire/surefirebooter5587190109471121485.jar>
<https://builds.apache.org/job/HBase-0.92/ws/trunk/target/surefire/surefire8526487812704392925tmp>
<https://builds.apache.org/job/HBase-0.92/ws/trunk/target/surefire/surefire6144513745469832605tmp>
Running org.apache.hadoop.hbase.master.TestClockSkewDetection
Tests run: 1, Failures: 0, Errors: 0, Skipped: 0, Time elapsed: 0.261 sec
Forking command line: /bin/sh -c cd <https://builds.apache.org/job/HBase-0.92/ws/trunk>
&& /home/hudson/tools/java/jdk1.6.0_27-32/jre/bin/java -enableassertions -Xmx1400m
-jar <https://builds.apache.org/job/HBase-0.92/ws/trunk/target/surefire/surefirebooter2933911062220510780.jar>
<https://builds.apache.org/job/HBase-0.92/ws/trunk/target/surefire/surefire5176800836914222208tmp>
<https://builds.apache.org/job/HBase-0.92/ws/trunk/target/surefire/surefire5705869260346176331tmp>
Running org.apache.hadoop.hbase.master.TestCatalogJanitor
Tests run: 3, Failures: 0, Errors: 0, Skipped: 0, Time elapsed: 4.189 sec
Forking command line: /bin/sh -c cd <https://builds.apache.org/job/HBase-0.92/ws/trunk>
&& /home/hudson/tools/java/jdk1.6.0_27-32/jre/bin/java -enableassertions -Xmx1400m
-jar <https://builds.apache.org/job/HBase-0.92/ws/trunk/target/surefire/surefirebooter5514637667785964675.jar>
<https://builds.apache.org/job/HBase-0.92/ws/trunk/target/surefire/surefire3089987824768309087tmp>
<https://builds.apache.org/job/HBase-0.92/ws/trunk/target/surefire/surefire4815965292957038523tmp>
Running org.apache.hadoop.hbase.master.TestSplitLogManager
Tests run: 10, Failures: 1, Errors: 0, Skipped: 0, Time elapsed: 14.09 sec <<< FAILURE!
Forking command line: /bin/sh -c cd <https://builds.apache.org/job/HBase-0.92/ws/trunk>
&& /home/hudson/tools/java/jdk1.6.0_27-32/jre/bin/java -enableassertions -Xmx1400m
-jar <https://builds.apache.org/job/HBase-0.92/ws/trunk/target/surefire/surefirebooter8102734056906411391.jar>
<https://builds.apache.org/job/HBase-0.92/ws/trunk/target/surefire/surefire644722564670721019tmp>
<https://builds.apache.org/job/HBase-0.92/ws/trunk/target/surefire/surefire5099892987261331756tmp>
Running org.apache.hadoop.hbase.master.TestMasterRestartAfterDisablingTable
Tests run: 1, Failures: 0, Errors: 0, Skipped: 0, Time elapsed: 32.619 sec
Forking command line: /bin/sh -c cd <https://builds.apache.org/job/HBase-0.92/ws/trunk>
&& /home/hudson/tools/java/jdk1.6.0_27-32/jre/bin/java -enableassertions -Xmx1400m
-jar <https://builds.apache.org/job/HBase-0.92/ws/trunk/target/surefire/surefirebooter8664787752100410080.jar>
<https://builds.apache.org/job/HBase-0.92/ws/trunk/target/surefire/surefire8957517019696217242tmp>
<https://builds.apache.org/job/HBase-0.92/ws/trunk/target/surefire/surefire5306586913340322617tmp>
Running org.apache.hadoop.hbase.master.TestDistributedLogSplitting
Tests run: 4, Failures: 0, Errors: 0, Skipped: 0, Time elapsed: 188.259 sec
Forking command line: /bin/sh -c cd <https://builds.apache.org/job/HBase-0.92/ws/trunk>
&& /home/hudson/tools/java/jdk1.6.0_27-32/jre/bin/java -enableassertions -Xmx1400m
-jar <https://builds.apache.org/job/HBase-0.92/ws/trunk/target/surefire/surefirebooter7318294340251157281.jar>
<https://builds.apache.org/job/HBase-0.92/ws/trunk/target/surefire/surefire3332068039621494579tmp>
<https://builds.apache.org/job/HBase-0.92/ws/trunk/target/surefire/surefire3100821121953307438tmp>
Running org.apache.hadoop.hbase.master.TestDefaultLoadBalancer
Tests run: 4, Failures: 0, Errors: 0, Skipped: 0, Time elapsed: 1.474 sec
Forking command line: /bin/sh -c cd <https://builds.apache.org/job/HBase-0.92/ws/trunk>
&& /home/hudson/tools/java/jdk1.6.0_27-32/jre/bin/java -enableassertions -Xmx1400m
-jar <https://builds.apache.org/job/HBase-0.92/ws/trunk/target/surefire/surefirebooter4817486173858461629.jar>
<https://builds.apache.org/job/HBase-0.92/ws/trunk/target/surefire/surefire2603934321373477171tmp>
<https://builds.apache.org/job/HBase-0.92/ws/trunk/target/surefire/surefire956067791881185191tmp>
Running org.apache.hadoop.hbase.master.TestMasterStatusServlet
Tests run: 5, Failures: 0, Errors: 0, Skipped: 0, Time elapsed: 0.999 sec
Forking command line: /bin/sh -c cd <https://builds.apache.org/job/HBase-0.92/ws/trunk>
&& /home/hudson/tools/java/jdk1.6.0_27-32/jre/bin/java -enableassertions -Xmx1400m
-jar <https://builds.apache.org/job/HBase-0.92/ws/trunk/target/surefire/surefirebooter1950463164743017212.jar>
<https://builds.apache.org/job/HBase-0.92/ws/trunk/target/surefire/surefire8623676046331601130tmp>
<https://builds.apache.org/job/HBase-0.92/ws/trunk/target/surefire/surefire2081866400911362041tmp>
Running org.apache.hadoop.hbase.master.TestHMasterRPCException
Tests run: 1, Failures: 0, Errors: 0, Skipped: 0, Time elapsed: 1.286 sec
Forking command line: /bin/sh -c cd <https://builds.apache.org/job/HBase-0.92/ws/trunk>
&& /home/hudson/tools/java/jdk1.6.0_27-32/jre/bin/java -enableassertions -Xmx1400m
-jar <https://builds.apache.org/job/HBase-0.92/ws/trunk/target/surefire/surefirebooter1771833402621659851.jar>
<https://builds.apache.org/job/HBase-0.92/ws/trunk/target/surefire/surefire7432018399642833213tmp>
<https://builds.apache.org/job/HBase-0.92/ws/trunk/target/surefire/surefire6775288320369738459tmp>
Running org.apache.hadoop.hbase.master.TestMasterFailover
Tests run: 4, Failures: 0, Errors: 0, Skipped: 0, Time elapsed: 93.045 sec
Forking command line: /bin/sh -c cd <https://builds.apache.org/job/HBase-0.92/ws/trunk>
&& /home/hudson/tools/java/jdk1.6.0_27-32/jre/bin/java -enableassertions -Xmx1400m
-jar <https://builds.apache.org/job/HBase-0.92/ws/trunk/target/surefire/surefirebooter8312134909900766557.jar>
<https://builds.apache.org/job/HBase-0.92/ws/trunk/target/surefire/surefire3024103463628019534tmp>
<https://builds.apache.org/job/HBase-0.92/ws/trunk/target/surefire/surefire3834174115703676709tmp>
Running org.apache.hadoop.hbase.master.TestRestartCluster
Tests run: 2, Failures: 0, Errors: 0, Skipped: 0, Time elapsed: 47.093 sec
Forking command line: /bin/sh -c cd <https://builds.apache.org/job/HBase-0.92/ws/trunk>
&& /home/hudson/tools/java/jdk1.6.0_27-32/jre/bin/java -enableassertions -Xmx1400m
-jar <https://builds.apache.org/job/HBase-0.92/ws/trunk/target/surefire/surefirebooter2354751332813460393.jar>
<https://builds.apache.org/job/HBase-0.92/ws/trunk/target/surefire/surefire3161853397090515806tmp>
<https://builds.apache.org/job/HBase-0.92/ws/trunk/target/surefire/surefire2836707098795221108tmp>
Running org.apache.hadoop.hbase.migration.TestMigrationFrom090To092
Tests run: 1, Failures: 0, Errors: 0, Skipped: 0, Time elapsed: 0.272 sec
Forking command line: /bin/sh -c cd <https://builds.apache.org/job/HBase-0.92/ws/trunk>
&& /home/hudson/tools/java/jdk1.6.0_27-32/jre/bin/java -enableassertions -Xmx1400m
-jar <https://builds.apache.org/job/HBase-0.92/ws/trunk/target/surefire/surefirebooter3563802539829545322.jar>
<https://builds.apache.org/job/HBase-0.92/ws/trunk/target/surefire/surefire1331625290760562999tmp>
<https://builds.apache.org/job/HBase-0.92/ws/trunk/target/surefire/surefire1919023185316580872tmp>
Running org.apache.hadoop.hbase.TestRegionRebalancing
Tests run: 1, Failures: 0, Errors: 0, Skipped: 0, Time elapsed: 48.429 sec
Forking command line: /bin/sh -c cd <https://builds.apache.org/job/HBase-0.92/ws/trunk>
&& /home/hudson/tools/java/jdk1.6.0_27-32/jre/bin/java -enableassertions -Xmx1400m
-jar <https://builds.apache.org/job/HBase-0.92/ws/trunk/target/surefire/surefirebooter8775876274496462815.jar>
<https://builds.apache.org/job/HBase-0.92/ws/trunk/target/surefire/surefire1676965579275535834tmp>
<https://builds.apache.org/job/HBase-0.92/ws/trunk/target/surefire/surefire1934861355309331408tmp>
Running org.apache.hadoop.hbase.avro.TestAvroUtil
Tests run: 1, Failures: 0, Errors: 0, Skipped: 0, Time elapsed: 0.672 sec
Forking command line: /bin/sh -c cd <https://builds.apache.org/job/HBase-0.92/ws/trunk>
&& /home/hudson/tools/java/jdk1.6.0_27-32/jre/bin/java -enableassertions -Xmx1400m
-jar <https://builds.apache.org/job/HBase-0.92/ws/trunk/target/surefire/surefirebooter8685070350429214714.jar>
<https://builds.apache.org/job/HBase-0.92/ws/trunk/target/surefire/surefire6835925223496799356tmp>
<https://builds.apache.org/job/HBase-0.92/ws/trunk/target/surefire/surefire9170751092272001899tmp>
Running org.apache.hadoop.hbase.avro.TestAvroServer
Tests run: 3, Failures: 0, Errors: 0, Skipped: 0, Time elapsed: 34.768 sec
Forking command line: /bin/sh -c cd <https://builds.apache.org/job/HBase-0.92/ws/trunk>
&& /home/hudson/tools/java/jdk1.6.0_27-32/jre/bin/java -enableassertions -Xmx1400m
-jar <https://builds.apache.org/job/HBase-0.92/ws/trunk/target/surefire/surefirebooter5308127925366686692.jar>
<https://builds.apache.org/job/HBase-0.92/ws/trunk/target/surefire/surefire4430580750984669812tmp>
<https://builds.apache.org/job/HBase-0.92/ws/trunk/target/surefire/surefire3503179785282106377tmp>
Running org.apache.hadoop.hbase.TestAcidGuarantees
Tests run: 3, Failures: 0, Errors: 0, Skipped: 3, Time elapsed: 0.062 sec
Forking command line: /bin/sh -c cd <https://builds.apache.org/job/HBase-0.92/ws/trunk>
&& /home/hudson/tools/java/jdk1.6.0_27-32/jre/bin/java -enableassertions -Xmx1400m
-jar <https://builds.apache.org/job/HBase-0.92/ws/trunk/target/surefire/surefirebooter3391128511202365204.jar>
<https://builds.apache.org/job/HBase-0.92/ws/trunk/target/surefire/surefire6352621224696583285tmp>
<https://builds.apache.org/job/HBase-0.92/ws/trunk/target/surefire/surefire6480472096655576308tmp>
Running org.apache.hadoop.hbase.TestHRegionLocation
Tests run: 3, Failures: 0, Errors: 0, Skipped: 0, Time elapsed: 0.141 sec
Forking command line: /bin/sh -c cd <https://builds.apache.org/job/HBase-0.92/ws/trunk>
&& /home/hudson/tools/java/jdk1.6.0_27-32/jre/bin/java -enableassertions -Xmx1400m
-jar <https://builds.apache.org/job/HBase-0.92/ws/trunk/target/surefire/surefirebooter3068042660121208414.jar>
<https://builds.apache.org/job/HBase-0.92/ws/trunk/target/surefire/surefire7807180878786531525tmp>
<https://builds.apache.org/job/HBase-0.92/ws/trunk/target/surefire/surefire7958165852134119711tmp>
Running org.apache.hadoop.hbase.TestZooKeeper
Tests run: 7, Failures: 0, Errors: 0, Skipped: 0, Time elapsed: 85.62 sec
Forking command line: /bin/sh -c cd <https://builds.apache.org/job/HBase-0.92/ws/trunk>
&& /home/hudson/tools/java/jdk1.6.0_27-32/jre/bin/java -enableassertions -Xmx1400m
-jar <https://builds.apache.org/job/HBase-0.92/ws/trunk/target/surefire/surefirebooter8971446957279011771.jar>
<https://builds.apache.org/job/HBase-0.92/ws/trunk/target/surefire/surefire472651872833634563tmp>
<https://builds.apache.org/job/HBase-0.92/ws/trunk/target/surefire/surefire8448122251902908110tmp>
Running org.apache.hadoop.hbase.TestCompare
Tests run: 1, Failures: 0, Errors: 0, Skipped: 0, Time elapsed: 0.251 sec
Forking command line: /bin/sh -c cd <https://builds.apache.org/job/HBase-0.92/ws/trunk>
&& /home/hudson/tools/java/jdk1.6.0_27-32/jre/bin/java -enableassertions -Xmx1400m
-jar <https://builds.apache.org/job/HBase-0.92/ws/trunk/target/surefire/surefirebooter8582073071813822169.jar>
<https://builds.apache.org/job/HBase-0.92/ws/trunk/target/surefire/surefire4321730271227771757tmp>
<https://builds.apache.org/job/HBase-0.92/ws/trunk/target/surefire/surefire2733369486134356170tmp>
Running org.apache.hadoop.hbase.ipc.TestDelayedRpc
Tests run: 4, Failures: 0, Errors: 0, Skipped: 0, Time elapsed: 3.05 sec
Forking command line: /bin/sh -c cd <https://builds.apache.org/job/HBase-0.92/ws/trunk>
&& /home/hudson/tools/java/jdk1.6.0_27-32/jre/bin/java -enableassertions -Xmx1400m
-jar <https://builds.apache.org/job/HBase-0.92/ws/trunk/target/surefire/surefirebooter4754216533642338429.jar>
<https://builds.apache.org/job/HBase-0.92/ws/trunk/target/surefire/surefire7174139916266034502tmp>
<https://builds.apache.org/job/HBase-0.92/ws/trunk/target/surefire/surefire82376913134571487tmp>
Running org.apache.hadoop.hbase.TestFSTableDescriptorForceCreation
Tests run: 3, Failures: 0, Errors: 0, Skipped: 0, Time elapsed: 0.53 sec
Forking command line: /bin/sh -c cd <https://builds.apache.org/job/HBase-0.92/ws/trunk>
&& /home/hudson/tools/java/jdk1.6.0_27-32/jre/bin/java -enableassertions -Xmx1400m
-jar <https://builds.apache.org/job/HBase-0.92/ws/trunk/target/surefire/surefirebooter6151495103537811202.jar>
<https://builds.apache.org/job/HBase-0.92/ws/trunk/target/surefire/surefire3189524232071869753tmp>
<https://builds.apache.org/job/HBase-0.92/ws/trunk/target/surefire/surefire5904571190745069180tmp>
Running org.apache.hadoop.hbase.TestInfoServers
Tests run: 2, Failures: 0, Errors: 0, Skipped: 0, Time elapsed: 28.519 sec

Results :

Failed tests:   testMultipleResubmits(org.apache.hadoop.hbase.master.TestSplitLogManager)

Tests in error: 
  testHundredsOfTable(org.apache.hadoop.hbase.client.TestAdmin): Call to vesta.apache.org/67.195.138.9:45334
failed on socket timeout exception: java.net.SocketTimeoutException: 1500 millis timeout while
waiting for channel to be ready for read. ch : java.nio.channels.SocketChannel[connected local=/67.195.138.9:48569
remote=vesta.apache.org/67.195.138.9:45334]

Tests run: 1065, Failures: 1, Errors: 1, Skipped: 10

[INFO] ------------------------------------------------------------------------
[INFO] BUILD FAILURE
[INFO] ------------------------------------------------------------------------
[INFO] Total time: 1:53:14.664s
[INFO] Finished at: Tue Nov 22 23:50:37 UTC 2011
[INFO] Final Memory: 18M/604M
[INFO] ------------------------------------------------------------------------
[ERROR] Failed to execute goal org.apache.maven.plugins:maven-surefire-plugin:2.10:test (default-test)
on project hbase: There are test failures.
[ERROR] 
[ERROR] Please refer to <https://builds.apache.org/job/HBase-0.92/ws/trunk/target/surefire-reports>
for the individual test results.
[ERROR] -> [Help 1]
org.apache.maven.lifecycle.LifecycleExecutionException: Failed to execute goal org.apache.maven.plugins:maven-surefire-plugin:2.10:test
(default-test) on project hbase: There are test failures.

Please refer to <https://builds.apache.org/job/HBase-0.92/ws/trunk/target/surefire-reports>
for the individual test results.
	at org.apache.maven.lifecycle.internal.MojoExecutor.execute(MojoExecutor.java:213)
	at org.apache.maven.lifecycle.internal.MojoExecutor.execute(MojoExecutor.java:153)
	at org.apache.maven.lifecycle.internal.MojoExecutor.execute(MojoExecutor.java:145)
	at org.apache.maven.lifecycle.internal.MojoExecutor.executeForkedExecutions(MojoExecutor.java:365)
	at org.apache.maven.lifecycle.internal.MojoExecutor.execute(MojoExecutor.java:199)
	at org.apache.maven.lifecycle.internal.MojoExecutor.execute(MojoExecutor.java:153)
	at org.apache.maven.lifecycle.internal.MojoExecutor.execute(MojoExecutor.java:145)
	at org.apache.maven.lifecycle.internal.LifecycleModuleBuilder.buildProject(LifecycleModuleBuilder.java:84)
	at org.apache.maven.lifecycle.internal.LifecycleModuleBuilder.buildProject(LifecycleModuleBuilder.java:59)
	at org.apache.maven.lifecycle.internal.LifecycleStarter.singleThreadedBuild(LifecycleStarter.java:183)
	at org.apache.maven.lifecycle.internal.LifecycleStarter.execute(LifecycleStarter.java:161)
	at org.apache.maven.DefaultMaven.doExecute(DefaultMaven.java:319)
	at org.apache.maven.DefaultMaven.execute(DefaultMaven.java:156)
	at org.apache.maven.cli.MavenCli.execute(MavenCli.java:537)
	at org.apache.maven.cli.MavenCli.doMain(MavenCli.java:196)
	at org.apache.maven.cli.MavenCli.main(MavenCli.java:141)
	at sun.reflect.NativeMethodAccessorImpl.invoke0(Native Method)
	at sun.reflect.NativeMethodAccessorImpl.invoke(NativeMethodAccessorImpl.java:39)
	at sun.reflect.DelegatingMethodAccessorImpl.invoke(DelegatingMethodAccessorImpl.java:25)
	at java.lang.reflect.Method.invoke(Method.java:597)
	at org.codehaus.plexus.classworlds.launcher.Launcher.launchEnhanced(Launcher.java:290)
	at org.codehaus.plexus.classworlds.launcher.Launcher.launch(Launcher.java:230)
	at org.codehaus.plexus.classworlds.launcher.Launcher.mainWithExitCode(Launcher.java:409)
	at org.codehaus.plexus.classworlds.launcher.Launcher.main(Launcher.java:352)
Caused by: org.apache.maven.plugin.MojoFailureException: There are test failures.

Please refer to <https://builds.apache.org/job/HBase-0.92/ws/trunk/target/surefire-reports>
for the individual test results.
	at org.apache.maven.plugin.surefire.SurefireHelper.reportExecution(SurefireHelper.java:87)
	at org.apache.maven.plugin.surefire.SurefirePlugin.writeSummary(SurefirePlugin.java:641)
	at org.apache.maven.plugin.surefire.SurefirePlugin.handleSummary(SurefirePlugin.java:615)
	at org.apache.maven.plugin.surefire.AbstractSurefireMojo.executeAfterPreconditionsChecked(AbstractSurefireMojo.java:137)
	at org.apache.maven.plugin.surefire.AbstractSurefireMojo.execute(AbstractSurefireMojo.java:98)
	at org.apache.maven.plugin.DefaultBuildPluginManager.executeMojo(DefaultBuildPluginManager.java:101)
	at org.apache.maven.lifecycle.internal.MojoExecutor.execute(MojoExecutor.java:209)
	... 23 more
[ERROR] 
[ERROR] 
[ERROR] For more information about the errors and possible solutions, please read the following
articles:
[ERROR] [Help 1] http://cwiki.apache.org/confluence/display/MAVEN/MojoFailureException
Build step 'Invoke top-level Maven targets' marked build as failure
[locks-and-latches] Releasing all the locks
[locks-and-latches] All the locks released
Archiving artifacts
Recording test results
Updating HBASE-4849
Updating HBASE-4848


Mime
View raw message