hbase-dev mailing list archives

Site index · List index
Message view « Date » · « Thread »
Top « Date » · « Thread »
From Apache Jenkins Server <jenk...@builds.apache.org>
Subject Build failed in Jenkins: HBase-0.92-security #17
Date Sat, 26 Nov 2011 09:09:34 GMT
See <https://builds.apache.org/job/HBase-0.92-security/17/>

------------------------------------------
[...truncated 6722 lines...]
Forking command line: /bin/sh -c cd /x1/jenkins/jenkins-slave/workspace/HBase-0.92-security/trunk
&& /x1/jenkins/tools/java/jdk1.6.0_27-32/jre/bin/java -enableassertions -Xmx1400m
-jar /x1/jenkins/jenkins-slave/workspace/HBase-0.92-security/trunk/target/surefire/surefirebooter5488496637160499051.jar
/x1/jenkins/jenkins-slave/workspace/HBase-0.92-security/trunk/target/surefire/surefire2504645750948296275tmp
/x1/jenkins/jenkins-slave/workspace/HBase-0.92-security/trunk/target/surefire/surefire2493084844223194231tmp
Running org.apache.hadoop.hbase.rest.TestScannersWithFilters
Tests run: 10, Failures: 0, Errors: 0, Skipped: 0, Time elapsed: 25.184 sec
Forking command line: /bin/sh -c cd /x1/jenkins/jenkins-slave/workspace/HBase-0.92-security/trunk
&& /x1/jenkins/tools/java/jdk1.6.0_27-32/jre/bin/java -enableassertions -Xmx1400m
-jar /x1/jenkins/jenkins-slave/workspace/HBase-0.92-security/trunk/target/surefire/surefirebooter2831684253577063025.jar
/x1/jenkins/jenkins-slave/workspace/HBase-0.92-security/trunk/target/surefire/surefire8899529083517426582tmp
/x1/jenkins/jenkins-slave/workspace/HBase-0.92-security/trunk/target/surefire/surefire518178202486728498tmp
Running org.apache.hadoop.hbase.metrics.TestMetricsMBeanBase
Tests run: 2, Failures: 0, Errors: 0, Skipped: 0, Time elapsed: 1.101 sec
Forking command line: /bin/sh -c cd /x1/jenkins/jenkins-slave/workspace/HBase-0.92-security/trunk
&& /x1/jenkins/tools/java/jdk1.6.0_27-32/jre/bin/java -enableassertions -Xmx1400m
-jar /x1/jenkins/jenkins-slave/workspace/HBase-0.92-security/trunk/target/surefire/surefirebooter5233348772732755394.jar
/x1/jenkins/jenkins-slave/workspace/HBase-0.92-security/trunk/target/surefire/surefire4473670465111062003tmp
/x1/jenkins/jenkins-slave/workspace/HBase-0.92-security/trunk/target/surefire/surefire5340240713281960173tmp
Running org.apache.hadoop.hbase.io.hfile.TestHFileWriterV2
Tests run: 1, Failures: 0, Errors: 0, Skipped: 0, Time elapsed: 0.726 sec
Forking command line: /bin/sh -c cd /x1/jenkins/jenkins-slave/workspace/HBase-0.92-security/trunk
&& /x1/jenkins/tools/java/jdk1.6.0_27-32/jre/bin/java -enableassertions -Xmx1400m
-jar /x1/jenkins/jenkins-slave/workspace/HBase-0.92-security/trunk/target/surefire/surefirebooter6351374055460991999.jar
/x1/jenkins/jenkins-slave/workspace/HBase-0.92-security/trunk/target/surefire/surefire4116659504851682236tmp
/x1/jenkins/jenkins-slave/workspace/HBase-0.92-security/trunk/target/surefire/surefire5314912066036270402tmp
Running org.apache.hadoop.hbase.io.hfile.TestHFile
Tests run: 6, Failures: 0, Errors: 0, Skipped: 0, Time elapsed: 0.646 sec
Forking command line: /bin/sh -c cd /x1/jenkins/jenkins-slave/workspace/HBase-0.92-security/trunk
&& /x1/jenkins/tools/java/jdk1.6.0_27-32/jre/bin/java -enableassertions -Xmx1400m
-jar /x1/jenkins/jenkins-slave/workspace/HBase-0.92-security/trunk/target/surefire/surefirebooter6038842323796985500.jar
/x1/jenkins/jenkins-slave/workspace/HBase-0.92-security/trunk/target/surefire/surefire3116223901034498739tmp
/x1/jenkins/jenkins-slave/workspace/HBase-0.92-security/trunk/target/surefire/surefire8966461418665091763tmp
Running org.apache.hadoop.hbase.io.hfile.TestHFileBlockIndex
Tests run: 10, Failures: 0, Errors: 0, Skipped: 0, Time elapsed: 6.834 sec
Forking command line: /bin/sh -c cd /x1/jenkins/jenkins-slave/workspace/HBase-0.92-security/trunk
&& /x1/jenkins/tools/java/jdk1.6.0_27-32/jre/bin/java -enableassertions -Xmx1400m
-jar /x1/jenkins/jenkins-slave/workspace/HBase-0.92-security/trunk/target/surefire/surefirebooter2188390218932776005.jar
/x1/jenkins/jenkins-slave/workspace/HBase-0.92-security/trunk/target/surefire/surefire2339847102274032340tmp
/x1/jenkins/jenkins-slave/workspace/HBase-0.92-security/trunk/target/surefire/surefire1256225932563717434tmp
Running org.apache.hadoop.hbase.io.hfile.TestHFileSeek
Tests run: 1, Failures: 0, Errors: 0, Skipped: 0, Time elapsed: 4.002 sec
Forking command line: /bin/sh -c cd /x1/jenkins/jenkins-slave/workspace/HBase-0.92-security/trunk
&& /x1/jenkins/tools/java/jdk1.6.0_27-32/jre/bin/java -enableassertions -Xmx1400m
-jar /x1/jenkins/jenkins-slave/workspace/HBase-0.92-security/trunk/target/surefire/surefirebooter1678775197313088094.jar
/x1/jenkins/jenkins-slave/workspace/HBase-0.92-security/trunk/target/surefire/surefire1878769135632792898tmp
/x1/jenkins/jenkins-slave/workspace/HBase-0.92-security/trunk/target/surefire/surefire3298415241514071515tmp
Running org.apache.hadoop.hbase.io.hfile.TestLruBlockCache
Tests run: 7, Failures: 0, Errors: 0, Skipped: 0, Time elapsed: 0.322 sec
Forking command line: /bin/sh -c cd /x1/jenkins/jenkins-slave/workspace/HBase-0.92-security/trunk
&& /x1/jenkins/tools/java/jdk1.6.0_27-32/jre/bin/java -enableassertions -Xmx1400m
-jar /x1/jenkins/jenkins-slave/workspace/HBase-0.92-security/trunk/target/surefire/surefirebooter7626544578849216601.jar
/x1/jenkins/jenkins-slave/workspace/HBase-0.92-security/trunk/target/surefire/surefire6576109496961419890tmp
/x1/jenkins/jenkins-slave/workspace/HBase-0.92-security/trunk/target/surefire/surefire7861211487620957339tmp
Running org.apache.hadoop.hbase.io.hfile.TestFixedFileTrailer
Tests run: 2, Failures: 0, Errors: 0, Skipped: 0, Time elapsed: 0.431 sec
Forking command line: /bin/sh -c cd /x1/jenkins/jenkins-slave/workspace/HBase-0.92-security/trunk
&& /x1/jenkins/tools/java/jdk1.6.0_27-32/jre/bin/java -enableassertions -Xmx1400m
-jar /x1/jenkins/jenkins-slave/workspace/HBase-0.92-security/trunk/target/surefire/surefirebooter6093572632085661022.jar
/x1/jenkins/jenkins-slave/workspace/HBase-0.92-security/trunk/target/surefire/surefire6035486973966980772tmp
/x1/jenkins/jenkins-slave/workspace/HBase-0.92-security/trunk/target/surefire/surefire5575759006546813791tmp
Running org.apache.hadoop.hbase.io.hfile.TestCachedBlockQueue
Tests run: 2, Failures: 0, Errors: 0, Skipped: 0, Time elapsed: 0.088 sec
Forking command line: /bin/sh -c cd /x1/jenkins/jenkins-slave/workspace/HBase-0.92-security/trunk
&& /x1/jenkins/tools/java/jdk1.6.0_27-32/jre/bin/java -enableassertions -Xmx1400m
-jar /x1/jenkins/jenkins-slave/workspace/HBase-0.92-security/trunk/target/surefire/surefirebooter2423825237209539142.jar
/x1/jenkins/jenkins-slave/workspace/HBase-0.92-security/trunk/target/surefire/surefire6229288271599487412tmp
/x1/jenkins/jenkins-slave/workspace/HBase-0.92-security/trunk/target/surefire/surefire172880692845458662tmp
Running org.apache.hadoop.hbase.io.hfile.TestHFilePerformance
Tests run: 1, Failures: 0, Errors: 0, Skipped: 0, Time elapsed: 4.014 sec
Forking command line: /bin/sh -c cd /x1/jenkins/jenkins-slave/workspace/HBase-0.92-security/trunk
&& /x1/jenkins/tools/java/jdk1.6.0_27-32/jre/bin/java -enableassertions -Xmx1400m
-jar /x1/jenkins/jenkins-slave/workspace/HBase-0.92-security/trunk/target/surefire/surefirebooter2475802272922286567.jar
/x1/jenkins/jenkins-slave/workspace/HBase-0.92-security/trunk/target/surefire/surefire4826291743491935547tmp
/x1/jenkins/jenkins-slave/workspace/HBase-0.92-security/trunk/target/surefire/surefire4129689098342241187tmp
Running org.apache.hadoop.hbase.io.hfile.TestCacheOnWrite
Tests run: 6, Failures: 0, Errors: 0, Skipped: 0, Time elapsed: 5.22 sec
Forking command line: /bin/sh -c cd /x1/jenkins/jenkins-slave/workspace/HBase-0.92-security/trunk
&& /x1/jenkins/tools/java/jdk1.6.0_27-32/jre/bin/java -enableassertions -Xmx1400m
-jar /x1/jenkins/jenkins-slave/workspace/HBase-0.92-security/trunk/target/surefire/surefirebooter6808665427701444732.jar
/x1/jenkins/jenkins-slave/workspace/HBase-0.92-security/trunk/target/surefire/surefire6464127774899325545tmp
/x1/jenkins/jenkins-slave/workspace/HBase-0.92-security/trunk/target/surefire/surefire4482202036298940103tmp
Running org.apache.hadoop.hbase.io.hfile.TestReseekTo
Tests run: 1, Failures: 0, Errors: 0, Skipped: 0, Time elapsed: 0.495 sec
Forking command line: /bin/sh -c cd /x1/jenkins/jenkins-slave/workspace/HBase-0.92-security/trunk
&& /x1/jenkins/tools/java/jdk1.6.0_27-32/jre/bin/java -enableassertions -Xmx1400m
-jar /x1/jenkins/jenkins-slave/workspace/HBase-0.92-security/trunk/target/surefire/surefirebooter237910666579249056.jar
/x1/jenkins/jenkins-slave/workspace/HBase-0.92-security/trunk/target/surefire/surefire8652254805437029096tmp
/x1/jenkins/jenkins-slave/workspace/HBase-0.92-security/trunk/target/surefire/surefire3790793728177695799tmp
Running org.apache.hadoop.hbase.io.hfile.TestSeekTo
Tests run: 3, Failures: 0, Errors: 0, Skipped: 0, Time elapsed: 0.528 sec
Forking command line: /bin/sh -c cd /x1/jenkins/jenkins-slave/workspace/HBase-0.92-security/trunk
&& /x1/jenkins/tools/java/jdk1.6.0_27-32/jre/bin/java -enableassertions -Xmx1400m
-jar /x1/jenkins/jenkins-slave/workspace/HBase-0.92-security/trunk/target/surefire/surefirebooter466537017179209515.jar
/x1/jenkins/jenkins-slave/workspace/HBase-0.92-security/trunk/target/surefire/surefire17445233913557894tmp
/x1/jenkins/jenkins-slave/workspace/HBase-0.92-security/trunk/target/surefire/surefire6512219622137633486tmp
Running org.apache.hadoop.hbase.io.hfile.TestBlockCacheColumnFamilySummary
Tests run: 4, Failures: 0, Errors: 0, Skipped: 0, Time elapsed: 0.048 sec
Forking command line: /bin/sh -c cd /x1/jenkins/jenkins-slave/workspace/HBase-0.92-security/trunk
&& /x1/jenkins/tools/java/jdk1.6.0_27-32/jre/bin/java -enableassertions -Xmx1400m
-jar /x1/jenkins/jenkins-slave/workspace/HBase-0.92-security/trunk/target/surefire/surefirebooter975785716451215110.jar
/x1/jenkins/jenkins-slave/workspace/HBase-0.92-security/trunk/target/surefire/surefire2967420620527730265tmp
/x1/jenkins/jenkins-slave/workspace/HBase-0.92-security/trunk/target/surefire/surefire7918150924021924562tmp
Running org.apache.hadoop.hbase.io.hfile.TestHFileBlock
Tests run: 7, Failures: 0, Errors: 0, Skipped: 0, Time elapsed: 24.023 sec
Forking command line: /bin/sh -c cd /x1/jenkins/jenkins-slave/workspace/HBase-0.92-security/trunk
&& /x1/jenkins/tools/java/jdk1.6.0_27-32/jre/bin/java -enableassertions -Xmx1400m
-jar /x1/jenkins/jenkins-slave/workspace/HBase-0.92-security/trunk/target/surefire/surefirebooter3389605531235330243.jar
/x1/jenkins/jenkins-slave/workspace/HBase-0.92-security/trunk/target/surefire/surefire3277863612178857008tmp
/x1/jenkins/jenkins-slave/workspace/HBase-0.92-security/trunk/target/surefire/surefire7821024959211302888tmp
Running org.apache.hadoop.hbase.io.hfile.slab.TestSlabCache
Tests run: 7, Failures: 0, Errors: 0, Skipped: 0, Time elapsed: 15.47 sec
Forking command line: /bin/sh -c cd /x1/jenkins/jenkins-slave/workspace/HBase-0.92-security/trunk
&& /x1/jenkins/tools/java/jdk1.6.0_27-32/jre/bin/java -enableassertions -Xmx1400m
-jar /x1/jenkins/jenkins-slave/workspace/HBase-0.92-security/trunk/target/surefire/surefirebooter6588622015186588686.jar
/x1/jenkins/jenkins-slave/workspace/HBase-0.92-security/trunk/target/surefire/surefire5051065596949144627tmp
/x1/jenkins/jenkins-slave/workspace/HBase-0.92-security/trunk/target/surefire/surefire1164651996502538842tmp
Running org.apache.hadoop.hbase.io.hfile.slab.TestSingleSizeCache
Tests run: 5, Failures: 0, Errors: 0, Skipped: 0, Time elapsed: 19.951 sec
Forking command line: /bin/sh -c cd /x1/jenkins/jenkins-slave/workspace/HBase-0.92-security/trunk
&& /x1/jenkins/tools/java/jdk1.6.0_27-32/jre/bin/java -enableassertions -Xmx1400m
-jar /x1/jenkins/jenkins-slave/workspace/HBase-0.92-security/trunk/target/surefire/surefirebooter4769992054632905292.jar
/x1/jenkins/jenkins-slave/workspace/HBase-0.92-security/trunk/target/surefire/surefire7098601972228996650tmp
/x1/jenkins/jenkins-slave/workspace/HBase-0.92-security/trunk/target/surefire/surefire819293951375925148tmp
Running org.apache.hadoop.hbase.io.hfile.slab.TestSlab
Tests run: 1, Failures: 0, Errors: 0, Skipped: 0, Time elapsed: 0.118 sec
Forking command line: /bin/sh -c cd /x1/jenkins/jenkins-slave/workspace/HBase-0.92-security/trunk
&& /x1/jenkins/tools/java/jdk1.6.0_27-32/jre/bin/java -enableassertions -Xmx1400m
-jar /x1/jenkins/jenkins-slave/workspace/HBase-0.92-security/trunk/target/surefire/surefirebooter7499291009443080142.jar
/x1/jenkins/jenkins-slave/workspace/HBase-0.92-security/trunk/target/surefire/surefire1036469283364817637tmp
/x1/jenkins/jenkins-slave/workspace/HBase-0.92-security/trunk/target/surefire/surefire3245223616577905306tmp
Running org.apache.hadoop.hbase.io.hfile.TestHFileReaderV1
Tests run: 1, Failures: 0, Errors: 0, Skipped: 0, Time elapsed: 0.446 sec
Forking command line: /bin/sh -c cd /x1/jenkins/jenkins-slave/workspace/HBase-0.92-security/trunk
&& /x1/jenkins/tools/java/jdk1.6.0_27-32/jre/bin/java -enableassertions -Xmx1400m
-jar /x1/jenkins/jenkins-slave/workspace/HBase-0.92-security/trunk/target/surefire/surefirebooter6530074368211209984.jar
/x1/jenkins/jenkins-slave/workspace/HBase-0.92-security/trunk/target/surefire/surefire6149403911081515594tmp
/x1/jenkins/jenkins-slave/workspace/HBase-0.92-security/trunk/target/surefire/surefire2704348761654631815tmp
Running org.apache.hadoop.hbase.io.TestHalfStoreFileReader
Tests run: 1, Failures: 0, Errors: 0, Skipped: 0, Time elapsed: 0.518 sec
Forking command line: /bin/sh -c cd /x1/jenkins/jenkins-slave/workspace/HBase-0.92-security/trunk
&& /x1/jenkins/tools/java/jdk1.6.0_27-32/jre/bin/java -enableassertions -Xmx1400m
-jar /x1/jenkins/jenkins-slave/workspace/HBase-0.92-security/trunk/target/surefire/surefirebooter1123780551154243696.jar
/x1/jenkins/jenkins-slave/workspace/HBase-0.92-security/trunk/target/surefire/surefire4074479752683397139tmp
/x1/jenkins/jenkins-slave/workspace/HBase-0.92-security/trunk/target/surefire/surefire2778946530551816860tmp
Running org.apache.hadoop.hbase.io.TestHbaseObjectWritable
Tests run: 4, Failures: 0, Errors: 0, Skipped: 0, Time elapsed: 0.371 sec
Forking command line: /bin/sh -c cd /x1/jenkins/jenkins-slave/workspace/HBase-0.92-security/trunk
&& /x1/jenkins/tools/java/jdk1.6.0_27-32/jre/bin/java -enableassertions -Xmx1400m
-jar /x1/jenkins/jenkins-slave/workspace/HBase-0.92-security/trunk/target/surefire/surefirebooter7074182592635237308.jar
/x1/jenkins/jenkins-slave/workspace/HBase-0.92-security/trunk/target/surefire/surefire26636824116482125tmp
/x1/jenkins/jenkins-slave/workspace/HBase-0.92-security/trunk/target/surefire/surefire8323977592046133657tmp
Running org.apache.hadoop.hbase.io.TestImmutableBytesWritable
Tests run: 3, Failures: 0, Errors: 0, Skipped: 0, Time elapsed: 0.102 sec
Forking command line: /bin/sh -c cd /x1/jenkins/jenkins-slave/workspace/HBase-0.92-security/trunk
&& /x1/jenkins/tools/java/jdk1.6.0_27-32/jre/bin/java -enableassertions -Xmx1400m
-jar /x1/jenkins/jenkins-slave/workspace/HBase-0.92-security/trunk/target/surefire/surefirebooter3400683186464916265.jar
/x1/jenkins/jenkins-slave/workspace/HBase-0.92-security/trunk/target/surefire/surefire7809517795363880942tmp
/x1/jenkins/jenkins-slave/workspace/HBase-0.92-security/trunk/target/surefire/surefire2390293447957376648tmp
Running org.apache.hadoop.hbase.io.TestHeapSize
Tests run: 2, Failures: 0, Errors: 0, Skipped: 0, Time elapsed: 0.13 sec
Forking command line: /bin/sh -c cd /x1/jenkins/jenkins-slave/workspace/HBase-0.92-security/trunk
&& /x1/jenkins/tools/java/jdk1.6.0_27-32/jre/bin/java -enableassertions -Xmx1400m
-jar /x1/jenkins/jenkins-slave/workspace/HBase-0.92-security/trunk/target/surefire/surefirebooter5975093743466328836.jar
/x1/jenkins/jenkins-slave/workspace/HBase-0.92-security/trunk/target/surefire/surefire4437694017854266403tmp
/x1/jenkins/jenkins-slave/workspace/HBase-0.92-security/trunk/target/surefire/surefire2888941062378961353tmp
Running org.apache.hadoop.hbase.TestRegionRebalancing
Tests run: 1, Failures: 0, Errors: 0, Skipped: 0, Time elapsed: 49.066 sec
Forking command line: /bin/sh -c cd /x1/jenkins/jenkins-slave/workspace/HBase-0.92-security/trunk
&& /x1/jenkins/tools/java/jdk1.6.0_27-32/jre/bin/java -enableassertions -Xmx1400m
-jar /x1/jenkins/jenkins-slave/workspace/HBase-0.92-security/trunk/target/surefire/surefirebooter7081248809917982920.jar
/x1/jenkins/jenkins-slave/workspace/HBase-0.92-security/trunk/target/surefire/surefire654703278165835298tmp
/x1/jenkins/jenkins-slave/workspace/HBase-0.92-security/trunk/target/surefire/surefire4922828797058425015tmp
Running org.apache.hadoop.hbase.mapred.TestTableInputFormat
Tests run: 6, Failures: 0, Errors: 0, Skipped: 0, Time elapsed: 29.476 sec
Forking command line: /bin/sh -c cd /x1/jenkins/jenkins-slave/workspace/HBase-0.92-security/trunk
&& /x1/jenkins/tools/java/jdk1.6.0_27-32/jre/bin/java -enableassertions -Xmx1400m
-jar /x1/jenkins/jenkins-slave/workspace/HBase-0.92-security/trunk/target/surefire/surefirebooter7015752830585868742.jar
/x1/jenkins/jenkins-slave/workspace/HBase-0.92-security/trunk/target/surefire/surefire5289871248245456716tmp
/x1/jenkins/jenkins-slave/workspace/HBase-0.92-security/trunk/target/surefire/surefire2311176189554796331tmp
Running org.apache.hadoop.hbase.mapred.TestTableMapReduce
Tests run: 1, Failures: 0, Errors: 0, Skipped: 0, Time elapsed: 68.401 sec
Forking command line: /bin/sh -c cd /x1/jenkins/jenkins-slave/workspace/HBase-0.92-security/trunk
&& /x1/jenkins/tools/java/jdk1.6.0_27-32/jre/bin/java -enableassertions -Xmx1400m
-jar /x1/jenkins/jenkins-slave/workspace/HBase-0.92-security/trunk/target/surefire/surefirebooter5398991032655249131.jar
/x1/jenkins/jenkins-slave/workspace/HBase-0.92-security/trunk/target/surefire/surefire8942853252980406123tmp
/x1/jenkins/jenkins-slave/workspace/HBase-0.92-security/trunk/target/surefire/surefire4644048903833542755tmp
Running org.apache.hadoop.hbase.replication.regionserver.TestReplicationSink
Tests run: 5, Failures: 0, Errors: 0, Skipped: 0, Time elapsed: 35.836 sec
Forking command line: /bin/sh -c cd /x1/jenkins/jenkins-slave/workspace/HBase-0.92-security/trunk
&& /x1/jenkins/tools/java/jdk1.6.0_27-32/jre/bin/java -enableassertions -Xmx1400m
-jar /x1/jenkins/jenkins-slave/workspace/HBase-0.92-security/trunk/target/surefire/surefirebooter153421842106942050.jar
/x1/jenkins/jenkins-slave/workspace/HBase-0.92-security/trunk/target/surefire/surefire5280027207582026978tmp
/x1/jenkins/jenkins-slave/workspace/HBase-0.92-security/trunk/target/surefire/surefire6537424859370276016tmp
Running org.apache.hadoop.hbase.replication.regionserver.TestReplicationSourceManager
Tests run: 1, Failures: 0, Errors: 0, Skipped: 0, Time elapsed: 0.797 sec
Forking command line: /bin/sh -c cd /x1/jenkins/jenkins-slave/workspace/HBase-0.92-security/trunk
&& /x1/jenkins/tools/java/jdk1.6.0_27-32/jre/bin/java -enableassertions -Xmx1400m
-jar /x1/jenkins/jenkins-slave/workspace/HBase-0.92-security/trunk/target/surefire/surefirebooter6675567320470507899.jar
/x1/jenkins/jenkins-slave/workspace/HBase-0.92-security/trunk/target/surefire/surefire4160512437936283518tmp
/x1/jenkins/jenkins-slave/workspace/HBase-0.92-security/trunk/target/surefire/surefire4279903562521680717tmp
Running org.apache.hadoop.hbase.replication.TestReplicationSource
Tests run: 1, Failures: 0, Errors: 0, Skipped: 0, Time elapsed: 2.253 sec
Forking command line: /bin/sh -c cd /x1/jenkins/jenkins-slave/workspace/HBase-0.92-security/trunk
&& /x1/jenkins/tools/java/jdk1.6.0_27-32/jre/bin/java -enableassertions -Xmx1400m
-jar /x1/jenkins/jenkins-slave/workspace/HBase-0.92-security/trunk/target/surefire/surefirebooter3183198531309784071.jar
/x1/jenkins/jenkins-slave/workspace/HBase-0.92-security/trunk/target/surefire/surefire5107918907297981523tmp
/x1/jenkins/jenkins-slave/workspace/HBase-0.92-security/trunk/target/surefire/surefire4742624495806786324tmp
Running org.apache.hadoop.hbase.replication.TestReplication
Tests run: 7, Failures: 0, Errors: 0, Skipped: 0, Time elapsed: 134.026 sec
Forking command line: /bin/sh -c cd /x1/jenkins/jenkins-slave/workspace/HBase-0.92-security/trunk
&& /x1/jenkins/tools/java/jdk1.6.0_27-32/jre/bin/java -enableassertions -Xmx1400m
-jar /x1/jenkins/jenkins-slave/workspace/HBase-0.92-security/trunk/target/surefire/surefirebooter685982289038097989.jar
/x1/jenkins/jenkins-slave/workspace/HBase-0.92-security/trunk/target/surefire/surefire9072910462106993320tmp
/x1/jenkins/jenkins-slave/workspace/HBase-0.92-security/trunk/target/surefire/surefire1091498998492302849tmp
Running org.apache.hadoop.hbase.replication.TestReplicationPeer
Tests run: 1, Failures: 0, Errors: 0, Skipped: 0, Time elapsed: 25.418 sec
Forking command line: /bin/sh -c cd /x1/jenkins/jenkins-slave/workspace/HBase-0.92-security/trunk
&& /x1/jenkins/tools/java/jdk1.6.0_27-32/jre/bin/java -enableassertions -Xmx1400m
-jar /x1/jenkins/jenkins-slave/workspace/HBase-0.92-security/trunk/target/surefire/surefirebooter1026199921401919521.jar
/x1/jenkins/jenkins-slave/workspace/HBase-0.92-security/trunk/target/surefire/surefire7753072287151611152tmp
/x1/jenkins/jenkins-slave/workspace/HBase-0.92-security/trunk/target/surefire/surefire4882136051062938590tmp
Running org.apache.hadoop.hbase.replication.TestMultiSlaveReplication
Tests run: 1, Failures: 0, Errors: 0, Skipped: 0, Time elapsed: 62.478 sec
Forking command line: /bin/sh -c cd /x1/jenkins/jenkins-slave/workspace/HBase-0.92-security/trunk
&& /x1/jenkins/tools/java/jdk1.6.0_27-32/jre/bin/java -enableassertions -Xmx1400m
-jar /x1/jenkins/jenkins-slave/workspace/HBase-0.92-security/trunk/target/surefire/surefirebooter5229724203610905452.jar
/x1/jenkins/jenkins-slave/workspace/HBase-0.92-security/trunk/target/surefire/surefire6701660717317581357tmp
/x1/jenkins/jenkins-slave/workspace/HBase-0.92-security/trunk/target/surefire/surefire3922121258221584492tmp
Running org.apache.hadoop.hbase.replication.TestMasterReplication
Tests run: 2, Failures: 0, Errors: 0, Skipped: 0, Time elapsed: 111.234 sec
Forking command line: /bin/sh -c cd /x1/jenkins/jenkins-slave/workspace/HBase-0.92-security/trunk
&& /x1/jenkins/tools/java/jdk1.6.0_27-32/jre/bin/java -enableassertions -Xmx1400m
-jar /x1/jenkins/jenkins-slave/workspace/HBase-0.92-security/trunk/target/surefire/surefirebooter5884390082074901672.jar
/x1/jenkins/jenkins-slave/workspace/HBase-0.92-security/trunk/target/surefire/surefire4324702666604933084tmp
/x1/jenkins/jenkins-slave/workspace/HBase-0.92-security/trunk/target/surefire/surefire3565774574703349406tmp
Running org.apache.hadoop.hbase.util.TestHBaseFsckComparator
Tests run: 7, Failures: 0, Errors: 0, Skipped: 0, Time elapsed: 0.135 sec
Forking command line: /bin/sh -c cd /x1/jenkins/jenkins-slave/workspace/HBase-0.92-security/trunk
&& /x1/jenkins/tools/java/jdk1.6.0_27-32/jre/bin/java -enableassertions -Xmx1400m
-jar /x1/jenkins/jenkins-slave/workspace/HBase-0.92-security/trunk/target/surefire/surefirebooter2085605525921521556.jar
/x1/jenkins/jenkins-slave/workspace/HBase-0.92-security/trunk/target/surefire/surefire1862366739535372904tmp
/x1/jenkins/jenkins-slave/workspace/HBase-0.92-security/trunk/target/surefire/surefire4003049641164718373tmp
Running org.apache.hadoop.hbase.util.TestMergeTool
Tests run: 1, Failures: 0, Errors: 0, Skipped: 0, Time elapsed: 245.56 sec
Forking command line: /bin/sh -c cd /x1/jenkins/jenkins-slave/workspace/HBase-0.92-security/trunk
&& /x1/jenkins/tools/java/jdk1.6.0_27-32/jre/bin/java -enableassertions -Xmx1400m
-jar /x1/jenkins/jenkins-slave/workspace/HBase-0.92-security/trunk/target/surefire/surefirebooter1434718325867978639.jar
/x1/jenkins/jenkins-slave/workspace/HBase-0.92-security/trunk/target/surefire/surefire8175351214313361144tmp
/x1/jenkins/jenkins-slave/workspace/HBase-0.92-security/trunk/target/surefire/surefire5400199350863014184tmp
Running org.apache.hadoop.hbase.util.TestFSTableDescriptors
Tests run: 10, Failures: 0, Errors: 0, Skipped: 0, Time elapsed: 0.649 sec
Forking command line: /bin/sh -c cd /x1/jenkins/jenkins-slave/workspace/HBase-0.92-security/trunk
&& /x1/jenkins/tools/java/jdk1.6.0_27-32/jre/bin/java -enableassertions -Xmx1400m
-jar /x1/jenkins/jenkins-slave/workspace/HBase-0.92-security/trunk/target/surefire/surefirebooter4778530180028093079.jar
/x1/jenkins/jenkins-slave/workspace/HBase-0.92-security/trunk/target/surefire/surefire8897253369239141202tmp
/x1/jenkins/jenkins-slave/workspace/HBase-0.92-security/trunk/target/surefire/surefire2739908465627375698tmp
Running org.apache.hadoop.hbase.util.TestIdLock
Tests run: 1, Failures: 0, Errors: 0, Skipped: 0, Time elapsed: 15.167 sec
Forking command line: /bin/sh -c cd /x1/jenkins/jenkins-slave/workspace/HBase-0.92-security/trunk
&& /x1/jenkins/tools/java/jdk1.6.0_27-32/jre/bin/java -enableassertions -Xmx1400m
-jar /x1/jenkins/jenkins-slave/workspace/HBase-0.92-security/trunk/target/surefire/surefirebooter7714779555057453065.jar
/x1/jenkins/jenkins-slave/workspace/HBase-0.92-security/trunk/target/surefire/surefire2473396676820921546tmp
/x1/jenkins/jenkins-slave/workspace/HBase-0.92-security/trunk/target/surefire/surefire6092680551856432265tmp
Running org.apache.hadoop.hbase.util.TestCompressionTest
Tests run: 1, Failures: 0, Errors: 0, Skipped: 0, Time elapsed: 0.289 sec
Forking command line: /bin/sh -c cd /x1/jenkins/jenkins-slave/workspace/HBase-0.92-security/trunk
&& /x1/jenkins/tools/java/jdk1.6.0_27-32/jre/bin/java -enableassertions -Xmx1400m
-jar /x1/jenkins/jenkins-slave/workspace/HBase-0.92-security/trunk/target/surefire/surefirebooter450670388548724468.jar
/x1/jenkins/jenkins-slave/workspace/HBase-0.92-security/trunk/target/surefire/surefire2136508840437209754tmp
/x1/jenkins/jenkins-slave/workspace/HBase-0.92-security/trunk/target/surefire/surefire8478503305935143373tmp
Running org.apache.hadoop.hbase.util.TestBytes
Tests run: 13, Failures: 0, Errors: 0, Skipped: 0, Time elapsed: 0.091 sec
Forking command line: /bin/sh -c cd /x1/jenkins/jenkins-slave/workspace/HBase-0.92-security/trunk
&& /x1/jenkins/tools/java/jdk1.6.0_27-32/jre/bin/java -enableassertions -Xmx1400m
-jar /x1/jenkins/jenkins-slave/workspace/HBase-0.92-security/trunk/target/surefire/surefirebooter990301534509385397.jar
/x1/jenkins/jenkins-slave/workspace/HBase-0.92-security/trunk/target/surefire/surefire6694953345481642182tmp
/x1/jenkins/jenkins-slave/workspace/HBase-0.92-security/trunk/target/surefire/surefire3103340326105361252tmp
Running org.apache.hadoop.hbase.util.TestSortedCopyOnWriteSet
Tests run: 2, Failures: 0, Errors: 0, Skipped: 0, Time elapsed: 0.067 sec
Forking command line: /bin/sh -c cd /x1/jenkins/jenkins-slave/workspace/HBase-0.92-security/trunk
&& /x1/jenkins/tools/java/jdk1.6.0_27-32/jre/bin/java -enableassertions -Xmx1400m
-jar /x1/jenkins/jenkins-slave/workspace/HBase-0.92-security/trunk/target/surefire/surefirebooter452393830878550194.jar
/x1/jenkins/jenkins-slave/workspace/HBase-0.92-security/trunk/target/surefire/surefire2757588974785238951tmp
/x1/jenkins/jenkins-slave/workspace/HBase-0.92-security/trunk/target/surefire/surefire718717529954203069tmp
Running org.apache.hadoop.hbase.util.TestEnvironmentEdgeManager
Tests run: 2, Failures: 0, Errors: 0, Skipped: 0, Time elapsed: 0.165 sec
Forking command line: /bin/sh -c cd /x1/jenkins/jenkins-slave/workspace/HBase-0.92-security/trunk
&& /x1/jenkins/tools/java/jdk1.6.0_27-32/jre/bin/java -enableassertions -Xmx1400m
-jar /x1/jenkins/jenkins-slave/workspace/HBase-0.92-security/trunk/target/surefire/surefirebooter499717062445110305.jar
/x1/jenkins/jenkins-slave/workspace/HBase-0.92-security/trunk/target/surefire/surefire3380768339765128910tmp
/x1/jenkins/jenkins-slave/workspace/HBase-0.92-security/trunk/target/surefire/surefire4078887373505549914tmp
Running org.apache.hadoop.hbase.util.TestKeying
Tests run: 1, Failures: 0, Errors: 0, Skipped: 0, Time elapsed: 0.023 sec
Forking command line: /bin/sh -c cd /x1/jenkins/jenkins-slave/workspace/HBase-0.92-security/trunk
&& /x1/jenkins/tools/java/jdk1.6.0_27-32/jre/bin/java -enableassertions -Xmx1400m
-jar /x1/jenkins/jenkins-slave/workspace/HBase-0.92-security/trunk/target/surefire/surefirebooter4844401225840393027.jar
/x1/jenkins/jenkins-slave/workspace/HBase-0.92-security/trunk/target/surefire/surefire4816325705346777064tmp
/x1/jenkins/jenkins-slave/workspace/HBase-0.92-security/trunk/target/surefire/surefire2998845970205115052tmp
Running org.apache.hadoop.hbase.util.TestByteBloomFilter
Tests run: 5, Failures: 0, Errors: 0, Skipped: 0, Time elapsed: 0.859 sec
Forking command line: /bin/sh -c cd /x1/jenkins/jenkins-slave/workspace/HBase-0.92-security/trunk
&& /x1/jenkins/tools/java/jdk1.6.0_27-32/jre/bin/java -enableassertions -Xmx1400m
-jar /x1/jenkins/jenkins-slave/workspace/HBase-0.92-security/trunk/target/surefire/surefirebooter3941835439687298312.jar
/x1/jenkins/jenkins-slave/workspace/HBase-0.92-security/trunk/target/surefire/surefire4751729035084347248tmp
/x1/jenkins/jenkins-slave/workspace/HBase-0.92-security/trunk/target/surefire/surefire3150755874212943669tmp
Running org.apache.hadoop.hbase.util.TestRootPath
Tests run: 1, Failures: 0, Errors: 0, Skipped: 0, Time elapsed: 0.085 sec
Forking command line: /bin/sh -c cd /x1/jenkins/jenkins-slave/workspace/HBase-0.92-security/trunk
&& /x1/jenkins/tools/java/jdk1.6.0_27-32/jre/bin/java -enableassertions -Xmx1400m
-jar /x1/jenkins/jenkins-slave/workspace/HBase-0.92-security/trunk/target/surefire/surefirebooter5431422694519215037.jar
/x1/jenkins/jenkins-slave/workspace/HBase-0.92-security/trunk/target/surefire/surefire8308575017633677539tmp
/x1/jenkins/jenkins-slave/workspace/HBase-0.92-security/trunk/target/surefire/surefire912715943750062784tmp
Running org.apache.hadoop.hbase.util.TestMergeTable
Tests run: 1, Failures: 0, Errors: 0, Skipped: 0, Time elapsed: 30.907 sec
Forking command line: /bin/sh -c cd /x1/jenkins/jenkins-slave/workspace/HBase-0.92-security/trunk
&& /x1/jenkins/tools/java/jdk1.6.0_27-32/jre/bin/java -enableassertions -Xmx1400m
-jar /x1/jenkins/jenkins-slave/workspace/HBase-0.92-security/trunk/target/surefire/surefirebooter3104175242144973963.jar
/x1/jenkins/jenkins-slave/workspace/HBase-0.92-security/trunk/target/surefire/surefire4996227707471464285tmp
/x1/jenkins/jenkins-slave/workspace/HBase-0.92-security/trunk/target/surefire/surefire5616019156535643174tmp
Running org.apache.hadoop.hbase.util.TestHBaseFsck
Tests run: 6, Failures: 0, Errors: 0, Skipped: 0, Time elapsed: 45.032 sec
Forking command line: /bin/sh -c cd /x1/jenkins/jenkins-slave/workspace/HBase-0.92-security/trunk
&& /x1/jenkins/tools/java/jdk1.6.0_27-32/jre/bin/java -enableassertions -Xmx1400m
-jar /x1/jenkins/jenkins-slave/workspace/HBase-0.92-security/trunk/target/surefire/surefirebooter264696874814238470.jar
/x1/jenkins/jenkins-slave/workspace/HBase-0.92-security/trunk/target/surefire/surefire7688466437810026269tmp
/x1/jenkins/jenkins-slave/workspace/HBase-0.92-security/trunk/target/surefire/surefire9205813833933669613tmp
Running org.apache.hadoop.hbase.util.TestFSUtils
Tests run: 2, Failures: 0, Errors: 0, Skipped: 0, Time elapsed: 19.637 sec
Forking command line: /bin/sh -c cd /x1/jenkins/jenkins-slave/workspace/HBase-0.92-security/trunk
&& /x1/jenkins/tools/java/jdk1.6.0_27-32/jre/bin/java -enableassertions -Xmx1400m
-jar /x1/jenkins/jenkins-slave/workspace/HBase-0.92-security/trunk/target/surefire/surefirebooter4784309988607154468.jar
/x1/jenkins/jenkins-slave/workspace/HBase-0.92-security/trunk/target/surefire/surefire5990099136786003915tmp
/x1/jenkins/jenkins-slave/workspace/HBase-0.92-security/trunk/target/surefire/surefire1212781598035950610tmp
Running org.apache.hadoop.hbase.util.TestPoolMap
Tests run: 9, Failures: 0, Errors: 0, Skipped: 0, Time elapsed: 0.035 sec
Forking command line: /bin/sh -c cd /x1/jenkins/jenkins-slave/workspace/HBase-0.92-security/trunk
&& /x1/jenkins/tools/java/jdk1.6.0_27-32/jre/bin/java -enableassertions -Xmx1400m
-jar /x1/jenkins/jenkins-slave/workspace/HBase-0.92-security/trunk/target/surefire/surefirebooter2644446473233836173.jar
/x1/jenkins/jenkins-slave/workspace/HBase-0.92-security/trunk/target/surefire/surefire3812375683162695547tmp
/x1/jenkins/jenkins-slave/workspace/HBase-0.92-security/trunk/target/surefire/surefire6733364789535713864tmp
Running org.apache.hadoop.hbase.util.TestBase64
Tests run: 1, Failures: 0, Errors: 0, Skipped: 0, Time elapsed: 0.08 sec
Forking command line: /bin/sh -c cd /x1/jenkins/jenkins-slave/workspace/HBase-0.92-security/trunk
&& /x1/jenkins/tools/java/jdk1.6.0_27-32/jre/bin/java -enableassertions -Xmx1400m
-jar /x1/jenkins/jenkins-slave/workspace/HBase-0.92-security/trunk/target/surefire/surefirebooter6021711966435761904.jar
/x1/jenkins/jenkins-slave/workspace/HBase-0.92-security/trunk/target/surefire/surefire4383482235076803622tmp
/x1/jenkins/jenkins-slave/workspace/HBase-0.92-security/trunk/target/surefire/surefire6768417951620067580tmp
Running org.apache.hadoop.hbase.util.hbck.TestOfflineMetaRebuildBase
Tests run: 1, Failures: 0, Errors: 0, Skipped: 0, Time elapsed: 37.042 sec
Forking command line: /bin/sh -c cd /x1/jenkins/jenkins-slave/workspace/HBase-0.92-security/trunk
&& /x1/jenkins/tools/java/jdk1.6.0_27-32/jre/bin/java -enableassertions -Xmx1400m
-jar /x1/jenkins/jenkins-slave/workspace/HBase-0.92-security/trunk/target/surefire/surefirebooter57994178298474705.jar
/x1/jenkins/jenkins-slave/workspace/HBase-0.92-security/trunk/target/surefire/surefire1408132046600315653tmp
/x1/jenkins/jenkins-slave/workspace/HBase-0.92-security/trunk/target/surefire/surefire3713650651958125460tmp
Running org.apache.hadoop.hbase.util.hbck.TestOfflineMetaRebuildOverlap
Tests run: 1, Failures: 0, Errors: 0, Skipped: 0, Time elapsed: 34.228 sec
Forking command line: /bin/sh -c cd /x1/jenkins/jenkins-slave/workspace/HBase-0.92-security/trunk
&& /x1/jenkins/tools/java/jdk1.6.0_27-32/jre/bin/java -enableassertions -Xmx1400m
-jar /x1/jenkins/jenkins-slave/workspace/HBase-0.92-security/trunk/target/surefire/surefirebooter2693228115831659398.jar
/x1/jenkins/jenkins-slave/workspace/HBase-0.92-security/trunk/target/surefire/surefire6123801609166888197tmp
/x1/jenkins/jenkins-slave/workspace/HBase-0.92-security/trunk/target/surefire/surefire1744739525055718122tmp
Running org.apache.hadoop.hbase.util.hbck.TestOfflineMetaRebuildHole
Tests run: 1, Failures: 0, Errors: 0, Skipped: 0, Time elapsed: 34.51 sec
Forking command line: /bin/sh -c cd /x1/jenkins/jenkins-slave/workspace/HBase-0.92-security/trunk
&& /x1/jenkins/tools/java/jdk1.6.0_27-32/jre/bin/java -enableassertions -Xmx1400m
-jar /x1/jenkins/jenkins-slave/workspace/HBase-0.92-security/trunk/target/surefire/surefirebooter7920539309460607374.jar
/x1/jenkins/jenkins-slave/workspace/HBase-0.92-security/trunk/target/surefire/surefire3225755750881317359tmp
/x1/jenkins/jenkins-slave/workspace/HBase-0.92-security/trunk/target/surefire/surefire4091632293577614378tmp
Running org.apache.hadoop.hbase.util.TestDefaultEnvironmentEdge
Tests run: 1, Failures: 0, Errors: 0, Skipped: 0, Time elapsed: 0.045 sec
Forking command line: /bin/sh -c cd /x1/jenkins/jenkins-slave/workspace/HBase-0.92-security/trunk
&& /x1/jenkins/tools/java/jdk1.6.0_27-32/jre/bin/java -enableassertions -Xmx1400m
-jar /x1/jenkins/jenkins-slave/workspace/HBase-0.92-security/trunk/target/surefire/surefirebooter8192053464731027295.jar
/x1/jenkins/jenkins-slave/workspace/HBase-0.92-security/trunk/target/surefire/surefire7315311115511853904tmp
/x1/jenkins/jenkins-slave/workspace/HBase-0.92-security/trunk/target/surefire/surefire4662337443034762276tmp
Running org.apache.hadoop.hbase.util.TestIncrementingEnvironmentEdge
Tests run: 1, Failures: 0, Errors: 0, Skipped: 0, Time elapsed: 0.045 sec
Forking command line: /bin/sh -c cd /x1/jenkins/jenkins-slave/workspace/HBase-0.92-security/trunk
&& /x1/jenkins/tools/java/jdk1.6.0_27-32/jre/bin/java -enableassertions -Xmx1400m
-jar /x1/jenkins/jenkins-slave/workspace/HBase-0.92-security/trunk/target/surefire/surefirebooter623200407287928236.jar
/x1/jenkins/jenkins-slave/workspace/HBase-0.92-security/trunk/target/surefire/surefire1776372015500482293tmp
/x1/jenkins/jenkins-slave/workspace/HBase-0.92-security/trunk/target/surefire/surefire6365168347276250436tmp
Running org.apache.hadoop.hbase.util.TestRegionSplitCalculator
Tests run: 14, Failures: 0, Errors: 0, Skipped: 0, Time elapsed: 0.151 sec
Forking command line: /bin/sh -c cd /x1/jenkins/jenkins-slave/workspace/HBase-0.92-security/trunk
&& /x1/jenkins/tools/java/jdk1.6.0_27-32/jre/bin/java -enableassertions -Xmx1400m
-jar /x1/jenkins/jenkins-slave/workspace/HBase-0.92-security/trunk/target/surefire/surefirebooter8819807721320701271.jar
/x1/jenkins/jenkins-slave/workspace/HBase-0.92-security/trunk/target/surefire/surefire1181948507397541203tmp
/x1/jenkins/jenkins-slave/workspace/HBase-0.92-security/trunk/target/surefire/surefire871181043813891875tmp
Running org.apache.hadoop.hbase.TestHRegionLocation
Tests run: 3, Failures: 0, Errors: 0, Skipped: 0, Time elapsed: 0.107 sec
Forking command line: /bin/sh -c cd /x1/jenkins/jenkins-slave/workspace/HBase-0.92-security/trunk
&& /x1/jenkins/tools/java/jdk1.6.0_27-32/jre/bin/java -enableassertions -Xmx1400m
-jar /x1/jenkins/jenkins-slave/workspace/HBase-0.92-security/trunk/target/surefire/surefirebooter1669524729451790376.jar
/x1/jenkins/jenkins-slave/workspace/HBase-0.92-security/trunk/target/surefire/surefire6077788728804143862tmp
/x1/jenkins/jenkins-slave/workspace/HBase-0.92-security/trunk/target/surefire/surefire6842210167448630645tmp
Running org.apache.hadoop.hbase.migration.TestMigrationFrom090To092
Tests run: 1, Failures: 0, Errors: 0, Skipped: 0, Time elapsed: 0.198 sec
Forking command line: /bin/sh -c cd /x1/jenkins/jenkins-slave/workspace/HBase-0.92-security/trunk
&& /x1/jenkins/tools/java/jdk1.6.0_27-32/jre/bin/java -enableassertions -Xmx1400m
-jar /x1/jenkins/jenkins-slave/workspace/HBase-0.92-security/trunk/target/surefire/surefirebooter1925580235907026281.jar
/x1/jenkins/jenkins-slave/workspace/HBase-0.92-security/trunk/target/surefire/surefire6328493217124235215tmp
/x1/jenkins/jenkins-slave/workspace/HBase-0.92-security/trunk/target/surefire/surefire4007908701120983587tmp
Running org.apache.hadoop.hbase.TestCompare
Tests run: 1, Failures: 0, Errors: 0, Skipped: 0, Time elapsed: 0.204 sec
Forking command line: /bin/sh -c cd /x1/jenkins/jenkins-slave/workspace/HBase-0.92-security/trunk
&& /x1/jenkins/tools/java/jdk1.6.0_27-32/jre/bin/java -enableassertions -Xmx1400m
-jar /x1/jenkins/jenkins-slave/workspace/HBase-0.92-security/trunk/target/surefire/surefirebooter7542221722840647941.jar
/x1/jenkins/jenkins-slave/workspace/HBase-0.92-security/trunk/target/surefire/surefire6017988797421675371tmp
/x1/jenkins/jenkins-slave/workspace/HBase-0.92-security/trunk/target/surefire/surefire7678224031591166092tmp
Running org.apache.hadoop.hbase.TestInfoServers
Tests run: 2, Failures: 0, Errors: 0, Skipped: 0, Time elapsed: 36.234 sec
Forking command line: /bin/sh -c cd /x1/jenkins/jenkins-slave/workspace/HBase-0.92-security/trunk
&& /x1/jenkins/tools/java/jdk1.6.0_27-32/jre/bin/java -enableassertions -Xmx1400m
-jar /x1/jenkins/jenkins-slave/workspace/HBase-0.92-security/trunk/target/surefire/surefirebooter6894215247117400057.jar
/x1/jenkins/jenkins-slave/workspace/HBase-0.92-security/trunk/target/surefire/surefire3617149912919104832tmp
/x1/jenkins/jenkins-slave/workspace/HBase-0.92-security/trunk/target/surefire/surefire3174447526434720470tmp
Running org.apache.hadoop.hbase.TestHServerAddress
Tests run: 6, Failures: 0, Errors: 0, Skipped: 0, Time elapsed: 0.051 sec
Forking command line: /bin/sh -c cd /x1/jenkins/jenkins-slave/workspace/HBase-0.92-security/trunk
&& /x1/jenkins/tools/java/jdk1.6.0_27-32/jre/bin/java -enableassertions -Xmx1400m
-jar /x1/jenkins/jenkins-slave/workspace/HBase-0.92-security/trunk/target/surefire/surefirebooter4084752490966751913.jar
/x1/jenkins/jenkins-slave/workspace/HBase-0.92-security/trunk/target/surefire/surefire6282575414992983989tmp
/x1/jenkins/jenkins-slave/workspace/HBase-0.92-security/trunk/target/surefire/surefire312688178140123090tmp
Running org.apache.hadoop.hbase.TestServerName
Tests run: 4, Failures: 0, Errors: 0, Skipped: 0, Time elapsed: 0.105 sec

Results :

Tests in error: 
  testSimpleMasterFailover(org.apache.hadoop.hbase.master.TestMasterFailover): test timed
out after 240000 milliseconds

Tests run: 1093, Failures: 0, Errors: 1, Skipped: 10

[INFO] ------------------------------------------------------------------------
[INFO] BUILD FAILURE
[INFO] ------------------------------------------------------------------------
[INFO] Total time: 2:01:39.996s
[INFO] Finished at: Sat Nov 26 09:09:24 UTC 2011
[INFO] Final Memory: 40M/702M
[INFO] ------------------------------------------------------------------------
[ERROR] Failed to execute goal org.apache.maven.plugins:maven-surefire-plugin:2.10:test (default-test)
on project hbase: There are test failures.
[ERROR] 
[ERROR] Please refer to /x1/jenkins/jenkins-slave/workspace/HBase-0.92-security/trunk/target/surefire-reports
for the individual test results.
[ERROR] -> [Help 1]
org.apache.maven.lifecycle.LifecycleExecutionException: Failed to execute goal org.apache.maven.plugins:maven-surefire-plugin:2.10:test
(default-test) on project hbase: There are test failures.

Please refer to /x1/jenkins/jenkins-slave/workspace/HBase-0.92-security/trunk/target/surefire-reports
for the individual test results.
	at org.apache.maven.lifecycle.internal.MojoExecutor.execute(MojoExecutor.java:213)
	at org.apache.maven.lifecycle.internal.MojoExecutor.execute(MojoExecutor.java:153)
	at org.apache.maven.lifecycle.internal.MojoExecutor.execute(MojoExecutor.java:145)
	at org.apache.maven.lifecycle.internal.MojoExecutor.executeForkedExecutions(MojoExecutor.java:365)
	at org.apache.maven.lifecycle.internal.MojoExecutor.execute(MojoExecutor.java:199)
	at org.apache.maven.lifecycle.internal.MojoExecutor.execute(MojoExecutor.java:153)
	at org.apache.maven.lifecycle.internal.MojoExecutor.execute(MojoExecutor.java:145)
	at org.apache.maven.lifecycle.internal.LifecycleModuleBuilder.buildProject(LifecycleModuleBuilder.java:84)
	at org.apache.maven.lifecycle.internal.LifecycleModuleBuilder.buildProject(LifecycleModuleBuilder.java:59)
	at org.apache.maven.lifecycle.internal.LifecycleStarter.singleThreadedBuild(LifecycleStarter.java:183)
	at org.apache.maven.lifecycle.internal.LifecycleStarter.execute(LifecycleStarter.java:161)
	at org.apache.maven.DefaultMaven.doExecute(DefaultMaven.java:319)
	at org.apache.maven.DefaultMaven.execute(DefaultMaven.java:156)
	at org.apache.maven.cli.MavenCli.execute(MavenCli.java:537)
	at org.apache.maven.cli.MavenCli.doMain(MavenCli.java:196)
	at org.apache.maven.cli.MavenCli.main(MavenCli.java:141)
	at sun.reflect.NativeMethodAccessorImpl.invoke0(Native Method)
	at sun.reflect.NativeMethodAccessorImpl.invoke(NativeMethodAccessorImpl.java:39)
	at sun.reflect.DelegatingMethodAccessorImpl.invoke(DelegatingMethodAccessorImpl.java:25)
	at java.lang.reflect.Method.invoke(Method.java:597)
	at org.codehaus.plexus.classworlds.launcher.Launcher.launchEnhanced(Launcher.java:290)
	at org.codehaus.plexus.classworlds.launcher.Launcher.launch(Launcher.java:230)
	at org.codehaus.plexus.classworlds.launcher.Launcher.mainWithExitCode(Launcher.java:409)
	at org.codehaus.plexus.classworlds.launcher.Launcher.main(Launcher.java:352)
Caused by: org.apache.maven.plugin.MojoFailureException: There are test failures.

Please refer to /x1/jenkins/jenkins-slave/workspace/HBase-0.92-security/trunk/target/surefire-reports
for the individual test results.
	at org.apache.maven.plugin.surefire.SurefireHelper.reportExecution(SurefireHelper.java:87)
	at org.apache.maven.plugin.surefire.SurefirePlugin.writeSummary(SurefirePlugin.java:641)
	at org.apache.maven.plugin.surefire.SurefirePlugin.handleSummary(SurefirePlugin.java:615)
	at org.apache.maven.plugin.surefire.AbstractSurefireMojo.executeAfterPreconditionsChecked(AbstractSurefireMojo.java:137)
	at org.apache.maven.plugin.surefire.AbstractSurefireMojo.execute(AbstractSurefireMojo.java:98)
	at org.apache.maven.plugin.DefaultBuildPluginManager.executeMojo(DefaultBuildPluginManager.java:101)
	at org.apache.maven.lifecycle.internal.MojoExecutor.execute(MojoExecutor.java:209)
	... 23 more
[ERROR] 
[ERROR] 
[ERROR] For more information about the errors and possible solutions, please read the following
articles:
[ERROR] [Help 1] http://cwiki.apache.org/confluence/display/MAVEN/MojoFailureException
Build step 'Invoke top-level Maven targets' marked build as failure
[locks-and-latches] Releasing all the locks
[locks-and-latches] All the locks released
Archiving artifacts
Recording test results


Mime
View raw message