hbase-dev mailing list archives

Site index · List index
Message view « Date » · « Thread »
Top « Date » · « Thread »
From Apache Jenkins Server <jenk...@builds.apache.org>
Subject Build failed in Jenkins: HBase-0.92 #138
Date Thu, 17 Nov 2011 04:43:21 GMT
See <https://builds.apache.org/job/HBase-0.92/138/changes>

Changes:

[tedyu] HBASE-4796  Race between SplitRegionHandlers for the same region kills the master

[stack] HBASE-4804 Minor Dyslexia in CHANGES.txt

[stack] HBASE-4801 alter_status shell prints sensible message at completion

------------------------------------------
[...truncated 6469 lines...]
Running org.apache.hadoop.hbase.regionserver.TestHRegionInfo
Tests run: 3, Failures: 0, Errors: 0, Skipped: 0, Time elapsed: 0.65 sec
Forking command line: /bin/sh -c cd <https://builds.apache.org/job/HBase-0.92/ws/trunk>
&& /home/jenkins/tools/java/jdk1.6.0_27-32/jre/bin/java -enableassertions -Xmx1400m
-jar <https://builds.apache.org/job/HBase-0.92/ws/trunk/target/surefire/surefirebooter6107947718080284368.jar>
<https://builds.apache.org/job/HBase-0.92/ws/trunk/target/surefire/surefire6768952182601248426tmp>
<https://builds.apache.org/job/HBase-0.92/ws/trunk/target/surefire/surefire777801842234503559tmp>
Running org.apache.hadoop.hbase.regionserver.TestMemStore
Tests run: 21, Failures: 0, Errors: 0, Skipped: 0, Time elapsed: 29.712 sec
Forking command line: /bin/sh -c cd <https://builds.apache.org/job/HBase-0.92/ws/trunk>
&& /home/jenkins/tools/java/jdk1.6.0_27-32/jre/bin/java -enableassertions -Xmx1400m
-jar <https://builds.apache.org/job/HBase-0.92/ws/trunk/target/surefire/surefirebooter344888004969677468.jar>
<https://builds.apache.org/job/HBase-0.92/ws/trunk/target/surefire/surefire8554806193840588727tmp>
<https://builds.apache.org/job/HBase-0.92/ws/trunk/target/surefire/surefire4142078959490887778tmp>
Running org.apache.hadoop.hbase.regionserver.TestHRegion
Tests run: 57, Failures: 0, Errors: 0, Skipped: 0, Time elapsed: 32.015 sec
Forking command line: /bin/sh -c cd <https://builds.apache.org/job/HBase-0.92/ws/trunk>
&& /home/jenkins/tools/java/jdk1.6.0_27-32/jre/bin/java -enableassertions -Xmx1400m
-jar <https://builds.apache.org/job/HBase-0.92/ws/trunk/target/surefire/surefirebooter3681331351431941529.jar>
<https://builds.apache.org/job/HBase-0.92/ws/trunk/target/surefire/surefire4823714978525277500tmp>
<https://builds.apache.org/job/HBase-0.92/ws/trunk/target/surefire/surefire3403049149420717935tmp>
Running org.apache.hadoop.hbase.regionserver.TestMasterAddressManager
Tests run: 1, Failures: 0, Errors: 0, Skipped: 0, Time elapsed: 0.528 sec
Forking command line: /bin/sh -c cd <https://builds.apache.org/job/HBase-0.92/ws/trunk>
&& /home/jenkins/tools/java/jdk1.6.0_27-32/jre/bin/java -enableassertions -Xmx1400m
-jar <https://builds.apache.org/job/HBase-0.92/ws/trunk/target/surefire/surefirebooter3135531142186448939.jar>
<https://builds.apache.org/job/HBase-0.92/ws/trunk/target/surefire/surefire2590863367929254278tmp>
<https://builds.apache.org/job/HBase-0.92/ws/trunk/target/surefire/surefire4958980115137390479tmp>
Running org.apache.hadoop.hbase.regionserver.TestCompoundBloomFilter
Tests run: 3, Failures: 0, Errors: 0, Skipped: 0, Time elapsed: 21.861 sec
Forking command line: /bin/sh -c cd <https://builds.apache.org/job/HBase-0.92/ws/trunk>
&& /home/jenkins/tools/java/jdk1.6.0_27-32/jre/bin/java -enableassertions -Xmx1400m
-jar <https://builds.apache.org/job/HBase-0.92/ws/trunk/target/surefire/surefirebooter2142419060869596837.jar>
<https://builds.apache.org/job/HBase-0.92/ws/trunk/target/surefire/surefire2732689926894822191tmp>
<https://builds.apache.org/job/HBase-0.92/ws/trunk/target/surefire/surefire3428588827557988841tmp>
Running org.apache.hadoop.hbase.regionserver.TestSplitLogWorker
Tests run: 5, Failures: 0, Errors: 0, Skipped: 0, Time elapsed: 2.059 sec
Forking command line: /bin/sh -c cd <https://builds.apache.org/job/HBase-0.92/ws/trunk>
&& /home/jenkins/tools/java/jdk1.6.0_27-32/jre/bin/java -enableassertions -Xmx1400m
-jar <https://builds.apache.org/job/HBase-0.92/ws/trunk/target/surefire/surefirebooter185838896755973099.jar>
<https://builds.apache.org/job/HBase-0.92/ws/trunk/target/surefire/surefire5926686730651524253tmp>
<https://builds.apache.org/job/HBase-0.92/ws/trunk/target/surefire/surefire4425835572018221292tmp>
Running org.apache.hadoop.hbase.regionserver.TestServerCustomProtocol
Tests run: 7, Failures: 0, Errors: 0, Skipped: 0, Time elapsed: 18.861 sec
Forking command line: /bin/sh -c cd <https://builds.apache.org/job/HBase-0.92/ws/trunk>
&& /home/jenkins/tools/java/jdk1.6.0_27-32/jre/bin/java -enableassertions -Xmx1400m
-jar <https://builds.apache.org/job/HBase-0.92/ws/trunk/target/surefire/surefirebooter7202060534151341210.jar>
<https://builds.apache.org/job/HBase-0.92/ws/trunk/target/surefire/surefire7039493983267354499tmp>
<https://builds.apache.org/job/HBase-0.92/ws/trunk/target/surefire/surefire542552819489479154tmp>
Running org.apache.hadoop.hbase.regionserver.TestScanWithBloomError
Tests run: 3, Failures: 0, Errors: 0, Skipped: 0, Time elapsed: 1.034 sec
Forking command line: /bin/sh -c cd <https://builds.apache.org/job/HBase-0.92/ws/trunk>
&& /home/jenkins/tools/java/jdk1.6.0_27-32/jre/bin/java -enableassertions -Xmx1400m
-jar <https://builds.apache.org/job/HBase-0.92/ws/trunk/target/surefire/surefirebooter1204583523814355200.jar>
<https://builds.apache.org/job/HBase-0.92/ws/trunk/target/surefire/surefire2156966257694165813tmp>
<https://builds.apache.org/job/HBase-0.92/ws/trunk/target/surefire/surefire2634590542108352076tmp>
Running org.apache.hadoop.hbase.regionserver.TestStoreFileBlockCacheSummary
Tests run: 1, Failures: 0, Errors: 0, Skipped: 0, Time elapsed: 18.504 sec
Forking command line: /bin/sh -c cd <https://builds.apache.org/job/HBase-0.92/ws/trunk>
&& /home/jenkins/tools/java/jdk1.6.0_27-32/jre/bin/java -enableassertions -Xmx1400m
-jar <https://builds.apache.org/job/HBase-0.92/ws/trunk/target/surefire/surefirebooter7587609485512749811.jar>
<https://builds.apache.org/job/HBase-0.92/ws/trunk/target/surefire/surefire5447159614889679219tmp>
<https://builds.apache.org/job/HBase-0.92/ws/trunk/target/surefire/surefire2867553860707338615tmp>
Running org.apache.hadoop.hbase.regionserver.TestStore
Tests run: 11, Failures: 0, Errors: 0, Skipped: 0, Time elapsed: 2.38 sec
Forking command line: /bin/sh -c cd <https://builds.apache.org/job/HBase-0.92/ws/trunk>
&& /home/jenkins/tools/java/jdk1.6.0_27-32/jre/bin/java -enableassertions -Xmx1400m
-jar <https://builds.apache.org/job/HBase-0.92/ws/trunk/target/surefire/surefirebooter1827874759235990746.jar>
<https://builds.apache.org/job/HBase-0.92/ws/trunk/target/surefire/surefire468005978753673500tmp>
<https://builds.apache.org/job/HBase-0.92/ws/trunk/target/surefire/surefire1593062061854694979tmp>
Running org.apache.hadoop.hbase.regionserver.TestBlocksRead
Tests run: 3, Failures: 0, Errors: 0, Skipped: 0, Time elapsed: 1.055 sec
Forking command line: /bin/sh -c cd <https://builds.apache.org/job/HBase-0.92/ws/trunk>
&& /home/jenkins/tools/java/jdk1.6.0_27-32/jre/bin/java -enableassertions -Xmx1400m
-jar <https://builds.apache.org/job/HBase-0.92/ws/trunk/target/surefire/surefirebooter402427511759968095.jar>
<https://builds.apache.org/job/HBase-0.92/ws/trunk/target/surefire/surefire1184231652121925968tmp>
<https://builds.apache.org/job/HBase-0.92/ws/trunk/target/surefire/surefire5390278178261995766tmp>
Running org.apache.hadoop.hbase.regionserver.TestFSErrorsExposed
Tests run: 3, Failures: 0, Errors: 0, Skipped: 0, Time elapsed: 30.238 sec
Forking command line: /bin/sh -c cd <https://builds.apache.org/job/HBase-0.92/ws/trunk>
&& /home/jenkins/tools/java/jdk1.6.0_27-32/jre/bin/java -enableassertions -Xmx1400m
-jar <https://builds.apache.org/job/HBase-0.92/ws/trunk/target/surefire/surefirebooter4194708315169354108.jar>
<https://builds.apache.org/job/HBase-0.92/ws/trunk/target/surefire/surefire6349990909864948034tmp>
<https://builds.apache.org/job/HBase-0.92/ws/trunk/target/surefire/surefire2923629182474500815tmp>
Running org.apache.hadoop.hbase.regionserver.handler.TestCloseRegionHandler
Tests run: 1, Failures: 0, Errors: 0, Skipped: 0, Time elapsed: 0.823 sec
Forking command line: /bin/sh -c cd <https://builds.apache.org/job/HBase-0.92/ws/trunk>
&& /home/jenkins/tools/java/jdk1.6.0_27-32/jre/bin/java -enableassertions -Xmx1400m
-jar <https://builds.apache.org/job/HBase-0.92/ws/trunk/target/surefire/surefirebooter7807906660751100441.jar>
<https://builds.apache.org/job/HBase-0.92/ws/trunk/target/surefire/surefire8775937405692220120tmp>
<https://builds.apache.org/job/HBase-0.92/ws/trunk/target/surefire/surefire6168148834664025030tmp>
Running org.apache.hadoop.hbase.regionserver.handler.TestOpenRegionHandler
Tests run: 3, Failures: 0, Errors: 0, Skipped: 0, Time elapsed: 0.943 sec
Forking command line: /bin/sh -c cd <https://builds.apache.org/job/HBase-0.92/ws/trunk>
&& /home/jenkins/tools/java/jdk1.6.0_27-32/jre/bin/java -enableassertions -Xmx1400m
-jar <https://builds.apache.org/job/HBase-0.92/ws/trunk/target/surefire/surefirebooter1609048697961083573.jar>
<https://builds.apache.org/job/HBase-0.92/ws/trunk/target/surefire/surefire8793417031832433356tmp>
<https://builds.apache.org/job/HBase-0.92/ws/trunk/target/surefire/surefire7647104253622193745tmp>
Running org.apache.hadoop.hbase.regionserver.TestScanDeleteTracker
Tests run: 6, Failures: 0, Errors: 0, Skipped: 0, Time elapsed: 0.592 sec
Forking command line: /bin/sh -c cd <https://builds.apache.org/job/HBase-0.92/ws/trunk>
&& /home/jenkins/tools/java/jdk1.6.0_27-32/jre/bin/java -enableassertions -Xmx1400m
-jar <https://builds.apache.org/job/HBase-0.92/ws/trunk/target/surefire/surefirebooter5379139602964930877.jar>
<https://builds.apache.org/job/HBase-0.92/ws/trunk/target/surefire/surefire599402923857198548tmp>
<https://builds.apache.org/job/HBase-0.92/ws/trunk/target/surefire/surefire7843810395299526938tmp>
Running org.apache.hadoop.hbase.regionserver.TestSplitTransactionOnCluster
Tests run: 4, Failures: 0, Errors: 0, Skipped: 0, Time elapsed: 53.934 sec
Forking command line: /bin/sh -c cd <https://builds.apache.org/job/HBase-0.92/ws/trunk>
&& /home/jenkins/tools/java/jdk1.6.0_27-32/jre/bin/java -enableassertions -Xmx1400m
-jar <https://builds.apache.org/job/HBase-0.92/ws/trunk/target/surefire/surefirebooter7210984798137701112.jar>
<https://builds.apache.org/job/HBase-0.92/ws/trunk/target/surefire/surefire1884848303735346387tmp>
<https://builds.apache.org/job/HBase-0.92/ws/trunk/target/surefire/surefire8271962370806437449tmp>
Running org.apache.hadoop.hbase.regionserver.TestHRegionServerBulkLoad
Tests run: 1, Failures: 0, Errors: 0, Skipped: 0, Time elapsed: 48.201 sec
Forking command line: /bin/sh -c cd <https://builds.apache.org/job/HBase-0.92/ws/trunk>
&& /home/jenkins/tools/java/jdk1.6.0_27-32/jre/bin/java -enableassertions -Xmx1400m
-jar <https://builds.apache.org/job/HBase-0.92/ws/trunk/target/surefire/surefirebooter2514523622999817309.jar>
<https://builds.apache.org/job/HBase-0.92/ws/trunk/target/surefire/surefire2545159368401630856tmp>
<https://builds.apache.org/job/HBase-0.92/ws/trunk/target/surefire/surefire2001521138634496967tmp>
Running org.apache.hadoop.hbase.regionserver.TestSplitTransaction
Tests run: 6, Failures: 0, Errors: 0, Skipped: 0, Time elapsed: 3.794 sec
Forking command line: /bin/sh -c cd <https://builds.apache.org/job/HBase-0.92/ws/trunk>
&& /home/jenkins/tools/java/jdk1.6.0_27-32/jre/bin/java -enableassertions -Xmx1400m
-jar <https://builds.apache.org/job/HBase-0.92/ws/trunk/target/surefire/surefirebooter2394498247217634003.jar>
<https://builds.apache.org/job/HBase-0.92/ws/trunk/target/surefire/surefire7589254991171255018tmp>
<https://builds.apache.org/job/HBase-0.92/ws/trunk/target/surefire/surefire8072523264125684663tmp>
Running org.apache.hadoop.hbase.regionserver.TestReadWriteConsistencyControl
Tests run: 1, Failures: 0, Errors: 0, Skipped: 0, Time elapsed: 10.106 sec
Forking command line: /bin/sh -c cd <https://builds.apache.org/job/HBase-0.92/ws/trunk>
&& /home/jenkins/tools/java/jdk1.6.0_27-32/jre/bin/java -enableassertions -Xmx1400m
-jar <https://builds.apache.org/job/HBase-0.92/ws/trunk/target/surefire/surefirebooter9363726931530700.jar>
<https://builds.apache.org/job/HBase-0.92/ws/trunk/target/surefire/surefire3327443901925680625tmp>
<https://builds.apache.org/job/HBase-0.92/ws/trunk/target/surefire/surefire1054598100098876187tmp>
Running org.apache.hadoop.hbase.regionserver.TestKeyValueHeap
Tests run: 3, Failures: 0, Errors: 0, Skipped: 0, Time elapsed: 0.495 sec
Forking command line: /bin/sh -c cd <https://builds.apache.org/job/HBase-0.92/ws/trunk>
&& /home/jenkins/tools/java/jdk1.6.0_27-32/jre/bin/java -enableassertions -Xmx1400m
-jar <https://builds.apache.org/job/HBase-0.92/ws/trunk/target/surefire/surefirebooter3602340866313559133.jar>
<https://builds.apache.org/job/HBase-0.92/ws/trunk/target/surefire/surefire8882144334520409277tmp>
<https://builds.apache.org/job/HBase-0.92/ws/trunk/target/surefire/surefire979580868952988007tmp>
Running org.apache.hadoop.hbase.regionserver.TestCompactSelection
Tests run: 1, Failures: 0, Errors: 0, Skipped: 0, Time elapsed: 0.636 sec
Forking command line: /bin/sh -c cd <https://builds.apache.org/job/HBase-0.92/ws/trunk>
&& /home/jenkins/tools/java/jdk1.6.0_27-32/jre/bin/java -enableassertions -Xmx1400m
-jar <https://builds.apache.org/job/HBase-0.92/ws/trunk/target/surefire/surefirebooter7922418605234410553.jar>
<https://builds.apache.org/job/HBase-0.92/ws/trunk/target/surefire/surefire3357888017523989889tmp>
<https://builds.apache.org/job/HBase-0.92/ws/trunk/target/surefire/surefire407640557710844910tmp>
Running org.apache.hadoop.hbase.regionserver.TestMinVersions
Tests run: 6, Failures: 0, Errors: 0, Skipped: 0, Time elapsed: 1.168 sec
Forking command line: /bin/sh -c cd <https://builds.apache.org/job/HBase-0.92/ws/trunk>
&& /home/jenkins/tools/java/jdk1.6.0_27-32/jre/bin/java -enableassertions -Xmx1400m
-jar <https://builds.apache.org/job/HBase-0.92/ws/trunk/target/surefire/surefirebooter4533846687711353528.jar>
<https://builds.apache.org/job/HBase-0.92/ws/trunk/target/surefire/surefire5320162155287366629tmp>
<https://builds.apache.org/job/HBase-0.92/ws/trunk/target/surefire/surefire4291936867826426468tmp>
Running org.apache.hadoop.hbase.regionserver.TestWideScanner
Tests run: 1, Failures: 0, Errors: 0, Skipped: 0, Time elapsed: 1.831 sec
Forking command line: /bin/sh -c cd <https://builds.apache.org/job/HBase-0.92/ws/trunk>
&& /home/jenkins/tools/java/jdk1.6.0_27-32/jre/bin/java -enableassertions -Xmx1400m
-jar <https://builds.apache.org/job/HBase-0.92/ws/trunk/target/surefire/surefirebooter8536004767100339066.jar>
<https://builds.apache.org/job/HBase-0.92/ws/trunk/target/surefire/surefire4430525012982581665tmp>
<https://builds.apache.org/job/HBase-0.92/ws/trunk/target/surefire/surefire8817543779815834952tmp>
Running org.apache.hadoop.hbase.regionserver.TestColumnSeeking
Tests run: 2, Failures: 0, Errors: 0, Skipped: 0, Time elapsed: 4.678 sec
Forking command line: /bin/sh -c cd <https://builds.apache.org/job/HBase-0.92/ws/trunk>
&& /home/jenkins/tools/java/jdk1.6.0_27-32/jre/bin/java -enableassertions -Xmx1400m
-jar <https://builds.apache.org/job/HBase-0.92/ws/trunk/target/surefire/surefirebooter4853399177560347153.jar>
<https://builds.apache.org/job/HBase-0.92/ws/trunk/target/surefire/surefire5473713961156850847tmp>
<https://builds.apache.org/job/HBase-0.92/ws/trunk/target/surefire/surefire5430673158111130501tmp>
Running org.apache.hadoop.hbase.regionserver.TestGetClosestAtOrBefore
Tests run: 3, Failures: 0, Errors: 0, Skipped: 0, Time elapsed: 1.142 sec
Forking command line: /bin/sh -c cd <https://builds.apache.org/job/HBase-0.92/ws/trunk>
&& /home/jenkins/tools/java/jdk1.6.0_27-32/jre/bin/java -enableassertions -Xmx1400m
-jar <https://builds.apache.org/job/HBase-0.92/ws/trunk/target/surefire/surefirebooter8601739845475669005.jar>
<https://builds.apache.org/job/HBase-0.92/ws/trunk/target/surefire/surefire8802655209979979235tmp>
<https://builds.apache.org/job/HBase-0.92/ws/trunk/target/surefire/surefire8759695396337286871tmp>
Running org.apache.hadoop.hbase.regionserver.TestExplicitColumnTracker
Tests run: 4, Failures: 0, Errors: 0, Skipped: 0, Time elapsed: 0.902 sec
Forking command line: /bin/sh -c cd <https://builds.apache.org/job/HBase-0.92/ws/trunk>
&& /home/jenkins/tools/java/jdk1.6.0_27-32/jre/bin/java -enableassertions -Xmx1400m
-jar <https://builds.apache.org/job/HBase-0.92/ws/trunk/target/surefire/surefirebooter7056871486156070242.jar>
<https://builds.apache.org/job/HBase-0.92/ws/trunk/target/surefire/surefire2044768657136245667tmp>
<https://builds.apache.org/job/HBase-0.92/ws/trunk/target/surefire/surefire6693324666404210020tmp>
Running org.apache.hadoop.hbase.regionserver.TestMemStoreLAB
Tests run: 3, Failures: 0, Errors: 0, Skipped: 0, Time elapsed: 1.369 sec
Forking command line: /bin/sh -c cd <https://builds.apache.org/job/HBase-0.92/ws/trunk>
&& /home/jenkins/tools/java/jdk1.6.0_27-32/jre/bin/java -enableassertions -Xmx1400m
-jar <https://builds.apache.org/job/HBase-0.92/ws/trunk/target/surefire/surefirebooter5733053011751624288.jar>
<https://builds.apache.org/job/HBase-0.92/ws/trunk/target/surefire/surefire4119836206628908581tmp>
<https://builds.apache.org/job/HBase-0.92/ws/trunk/target/surefire/surefire416464831599323449tmp>
Running org.apache.hadoop.hbase.regionserver.TestKeyValueScanFixture
Tests run: 1, Failures: 0, Errors: 0, Skipped: 0, Time elapsed: 0.116 sec
Forking command line: /bin/sh -c cd <https://builds.apache.org/job/HBase-0.92/ws/trunk>
&& /home/jenkins/tools/java/jdk1.6.0_27-32/jre/bin/java -enableassertions -Xmx1400m
-jar <https://builds.apache.org/job/HBase-0.92/ws/trunk/target/surefire/surefirebooter449639952696279587.jar>
<https://builds.apache.org/job/HBase-0.92/ws/trunk/target/surefire/surefire7359850561176277587tmp>
<https://builds.apache.org/job/HBase-0.92/ws/trunk/target/surefire/surefire1135651023758589019tmp>
Running org.apache.hadoop.hbase.regionserver.wal.TestLogRollAbort
Tests run: 1, Failures: 0, Errors: 0, Skipped: 0, Time elapsed: 22.429 sec
Forking command line: /bin/sh -c cd <https://builds.apache.org/job/HBase-0.92/ws/trunk>
&& /home/jenkins/tools/java/jdk1.6.0_27-32/jre/bin/java -enableassertions -Xmx1400m
-jar <https://builds.apache.org/job/HBase-0.92/ws/trunk/target/surefire/surefirebooter3019385119299746645.jar>
<https://builds.apache.org/job/HBase-0.92/ws/trunk/target/surefire/surefire5552765624658863968tmp>
<https://builds.apache.org/job/HBase-0.92/ws/trunk/target/surefire/surefire2597393750366131423tmp>
Running org.apache.hadoop.hbase.regionserver.wal.TestWALActionsListener
Tests run: 1, Failures: 0, Errors: 0, Skipped: 0, Time elapsed: 0.634 sec
Forking command line: /bin/sh -c cd <https://builds.apache.org/job/HBase-0.92/ws/trunk>
&& /home/jenkins/tools/java/jdk1.6.0_27-32/jre/bin/java -enableassertions -Xmx1400m
-jar <https://builds.apache.org/job/HBase-0.92/ws/trunk/target/surefire/surefirebooter2850570872094676721.jar>
<https://builds.apache.org/job/HBase-0.92/ws/trunk/target/surefire/surefire8430696562496401911tmp>
<https://builds.apache.org/job/HBase-0.92/ws/trunk/target/surefire/surefire6645033579834849353tmp>
Running org.apache.hadoop.hbase.regionserver.wal.TestLogRolling
Tests run: 3, Failures: 0, Errors: 0, Skipped: 0, Time elapsed: 440.923 sec
Forking command line: /bin/sh -c cd <https://builds.apache.org/job/HBase-0.92/ws/trunk>
&& /home/jenkins/tools/java/jdk1.6.0_27-32/jre/bin/java -enableassertions -Xmx1400m
-jar <https://builds.apache.org/job/HBase-0.92/ws/trunk/target/surefire/surefirebooter7349463766535104754.jar>
<https://builds.apache.org/job/HBase-0.92/ws/trunk/target/surefire/surefire6652584371709382456tmp>
<https://builds.apache.org/job/HBase-0.92/ws/trunk/target/surefire/surefire5298982291683303731tmp>
Running org.apache.hadoop.hbase.regionserver.wal.TestHLog
Tests run: 9, Failures: 0, Errors: 0, Skipped: 0, Time elapsed: 59.993 sec
Forking command line: /bin/sh -c cd <https://builds.apache.org/job/HBase-0.92/ws/trunk>
&& /home/jenkins/tools/java/jdk1.6.0_27-32/jre/bin/java -enableassertions -Xmx1400m
-jar <https://builds.apache.org/job/HBase-0.92/ws/trunk/target/surefire/surefirebooter8076914954877315841.jar>
<https://builds.apache.org/job/HBase-0.92/ws/trunk/target/surefire/surefire123049449712413999tmp>
<https://builds.apache.org/job/HBase-0.92/ws/trunk/target/surefire/surefire4383276097320737564tmp>
Running org.apache.hadoop.hbase.regionserver.wal.TestHLogSplit
Tests run: 29, Failures: 0, Errors: 0, Skipped: 1, Time elapsed: 230.041 sec
Forking command line: /bin/sh -c cd <https://builds.apache.org/job/HBase-0.92/ws/trunk>
&& /home/jenkins/tools/java/jdk1.6.0_27-32/jre/bin/java -enableassertions -Xmx1400m
-jar <https://builds.apache.org/job/HBase-0.92/ws/trunk/target/surefire/surefirebooter7710833406668777208.jar>
<https://builds.apache.org/job/HBase-0.92/ws/trunk/target/surefire/surefire8797785810691279005tmp>
<https://builds.apache.org/job/HBase-0.92/ws/trunk/target/surefire/surefire8430142480707281720tmp>
Running org.apache.hadoop.hbase.regionserver.wal.TestWALReplay
Tests run: 5, Failures: 0, Errors: 0, Skipped: 0, Time elapsed: 30.937 sec
Forking command line: /bin/sh -c cd <https://builds.apache.org/job/HBase-0.92/ws/trunk>
&& /home/jenkins/tools/java/jdk1.6.0_27-32/jre/bin/java -enableassertions -Xmx1400m
-jar <https://builds.apache.org/job/HBase-0.92/ws/trunk/target/surefire/surefirebooter4725601887834503731.jar>
<https://builds.apache.org/job/HBase-0.92/ws/trunk/target/surefire/surefire5307598284484274212tmp>
<https://builds.apache.org/job/HBase-0.92/ws/trunk/target/surefire/surefire7535003609457360330tmp>
Running org.apache.hadoop.hbase.regionserver.wal.TestHLogMethods
Tests run: 3, Failures: 0, Errors: 0, Skipped: 0, Time elapsed: 0.827 sec
Forking command line: /bin/sh -c cd <https://builds.apache.org/job/HBase-0.92/ws/trunk>
&& /home/jenkins/tools/java/jdk1.6.0_27-32/jre/bin/java -enableassertions -Xmx1400m
-jar <https://builds.apache.org/job/HBase-0.92/ws/trunk/target/surefire/surefirebooter7531662369265924616.jar>
<https://builds.apache.org/job/HBase-0.92/ws/trunk/target/surefire/surefire4049145739452284999tmp>
<https://builds.apache.org/job/HBase-0.92/ws/trunk/target/surefire/surefire2544641813342686881tmp>
Running org.apache.hadoop.hbase.regionserver.TestRSStatusServlet
Tests run: 2, Failures: 0, Errors: 0, Skipped: 0, Time elapsed: 0.675 sec
Forking command line: /bin/sh -c cd <https://builds.apache.org/job/HBase-0.92/ws/trunk>
&& /home/jenkins/tools/java/jdk1.6.0_27-32/jre/bin/java -enableassertions -Xmx1400m
-jar <https://builds.apache.org/job/HBase-0.92/ws/trunk/target/surefire/surefirebooter9067761056561635333.jar>
<https://builds.apache.org/job/HBase-0.92/ws/trunk/target/surefire/surefire5700246608870915072tmp>
<https://builds.apache.org/job/HBase-0.92/ws/trunk/target/surefire/surefire7019818619863245927tmp>
Running org.apache.hadoop.hbase.regionserver.TestStoreScanner
Tests run: 14, Failures: 0, Errors: 0, Skipped: 0, Time elapsed: 0.142 sec
Forking command line: /bin/sh -c cd <https://builds.apache.org/job/HBase-0.92/ws/trunk>
&& /home/jenkins/tools/java/jdk1.6.0_27-32/jre/bin/java -enableassertions -Xmx1400m
-jar <https://builds.apache.org/job/HBase-0.92/ws/trunk/target/surefire/surefirebooter2819833308721395314.jar>
<https://builds.apache.org/job/HBase-0.92/ws/trunk/target/surefire/surefire3399620070877375923tmp>
<https://builds.apache.org/job/HBase-0.92/ws/trunk/target/surefire/surefire1724347354972312244tmp>
Running org.apache.hadoop.hbase.regionserver.TestResettingCounters
Tests run: 1, Failures: 0, Errors: 0, Skipped: 0, Time elapsed: 0.737 sec
Forking command line: /bin/sh -c cd <https://builds.apache.org/job/HBase-0.92/ws/trunk>
&& /home/jenkins/tools/java/jdk1.6.0_27-32/jre/bin/java -enableassertions -Xmx1400m
-jar <https://builds.apache.org/job/HBase-0.92/ws/trunk/target/surefire/surefirebooter2250931904597620566.jar>
<https://builds.apache.org/job/HBase-0.92/ws/trunk/target/surefire/surefire2232301680378386158tmp>
<https://builds.apache.org/job/HBase-0.92/ws/trunk/target/surefire/surefire6859813332511681388tmp>
Running org.apache.hadoop.hbase.regionserver.TestStoreFile
Tests run: 8, Failures: 0, Errors: 0, Skipped: 0, Time elapsed: 1.67 sec
Forking command line: /bin/sh -c cd <https://builds.apache.org/job/HBase-0.92/ws/trunk>
&& /home/jenkins/tools/java/jdk1.6.0_27-32/jre/bin/java -enableassertions -Xmx1400m
-jar <https://builds.apache.org/job/HBase-0.92/ws/trunk/target/surefire/surefirebooter357973968352446175.jar>
<https://builds.apache.org/job/HBase-0.92/ws/trunk/target/surefire/surefire5202082790741067177tmp>
<https://builds.apache.org/job/HBase-0.92/ws/trunk/target/surefire/surefire6243114593571375915tmp>
Running org.apache.hadoop.hbase.regionserver.TestEndToEndSplitTransaction
Tests run: 1, Failures: 0, Errors: 0, Skipped: 0, Time elapsed: 47.906 sec
Forking command line: /bin/sh -c cd <https://builds.apache.org/job/HBase-0.92/ws/trunk>
&& /home/jenkins/tools/java/jdk1.6.0_27-32/jre/bin/java -enableassertions -Xmx1400m
-jar <https://builds.apache.org/job/HBase-0.92/ws/trunk/target/surefire/surefirebooter6603044648136148502.jar>
<https://builds.apache.org/job/HBase-0.92/ws/trunk/target/surefire/surefire3559457720566320198tmp>
<https://builds.apache.org/job/HBase-0.92/ws/trunk/target/surefire/surefire5292568185155034054tmp>
Running org.apache.hadoop.hbase.regionserver.TestScanWildcardColumnTracker
Tests run: 2, Failures: 0, Errors: 0, Skipped: 0, Time elapsed: 0.453 sec
Forking command line: /bin/sh -c cd <https://builds.apache.org/job/HBase-0.92/ws/trunk>
&& /home/jenkins/tools/java/jdk1.6.0_27-32/jre/bin/java -enableassertions -Xmx1400m
-jar <https://builds.apache.org/job/HBase-0.92/ws/trunk/target/surefire/surefirebooter641359995856204134.jar>
<https://builds.apache.org/job/HBase-0.92/ws/trunk/target/surefire/surefire8690944511396031918tmp>
<https://builds.apache.org/job/HBase-0.92/ws/trunk/target/surefire/surefire3201614480510496888tmp>
Running org.apache.hadoop.hbase.regionserver.TestCompaction
Tests run: 10, Failures: 0, Errors: 0, Skipped: 0, Time elapsed: 11.996 sec
Forking command line: /bin/sh -c cd <https://builds.apache.org/job/HBase-0.92/ws/trunk>
&& /home/jenkins/tools/java/jdk1.6.0_27-32/jre/bin/java -enableassertions -Xmx1400m
-jar <https://builds.apache.org/job/HBase-0.92/ws/trunk/target/surefire/surefirebooter45520175478042040.jar>
<https://builds.apache.org/job/HBase-0.92/ws/trunk/target/surefire/surefire3817607940865642405tmp>
<https://builds.apache.org/job/HBase-0.92/ws/trunk/target/surefire/surefire903733936514296141tmp>
Running org.apache.hadoop.hbase.regionserver.TestQueryMatcher
Tests run: 4, Failures: 0, Errors: 0, Skipped: 0, Time elapsed: 0.535 sec
Forking command line: /bin/sh -c cd <https://builds.apache.org/job/HBase-0.92/ws/trunk>
&& /home/jenkins/tools/java/jdk1.6.0_27-32/jre/bin/java -enableassertions -Xmx1400m
-jar <https://builds.apache.org/job/HBase-0.92/ws/trunk/target/surefire/surefirebooter927981921216579287.jar>
<https://builds.apache.org/job/HBase-0.92/ws/trunk/target/surefire/surefire7322697009584819007tmp>
<https://builds.apache.org/job/HBase-0.92/ws/trunk/target/surefire/surefire5219531030919641889tmp>
Running org.apache.hadoop.hbase.regionserver.TestRpcMetrics
Tests run: 1, Failures: 0, Errors: 0, Skipped: 0, Time elapsed: 2.027 sec
Forking command line: /bin/sh -c cd <https://builds.apache.org/job/HBase-0.92/ws/trunk>
&& /home/jenkins/tools/java/jdk1.6.0_27-32/jre/bin/java -enableassertions -Xmx1400m
-jar <https://builds.apache.org/job/HBase-0.92/ws/trunk/target/surefire/surefirebooter653696636365157246.jar>
<https://builds.apache.org/job/HBase-0.92/ws/trunk/target/surefire/surefire6203780402255670848tmp>
<https://builds.apache.org/job/HBase-0.92/ws/trunk/target/surefire/surefire5523779236008358701tmp>
Running org.apache.hadoop.hbase.regionserver.TestScanner
Tests run: 6, Failures: 0, Errors: 0, Skipped: 0, Time elapsed: 4.442 sec
Forking command line: /bin/sh -c cd <https://builds.apache.org/job/HBase-0.92/ws/trunk>
&& /home/jenkins/tools/java/jdk1.6.0_27-32/jre/bin/java -enableassertions -Xmx1400m
-jar <https://builds.apache.org/job/HBase-0.92/ws/trunk/target/surefire/surefirebooter4638667115927690070.jar>
<https://builds.apache.org/job/HBase-0.92/ws/trunk/target/surefire/surefire940016817099652466tmp>
<https://builds.apache.org/job/HBase-0.92/ws/trunk/target/surefire/surefire5747064045937371483tmp>
Running org.apache.hadoop.hbase.regionserver.TestMultiColumnScanner
Tests run: 6, Failures: 0, Errors: 0, Skipped: 0, Time elapsed: 18.423 sec
Forking command line: /bin/sh -c cd <https://builds.apache.org/job/HBase-0.92/ws/trunk>
&& /home/jenkins/tools/java/jdk1.6.0_27-32/jre/bin/java -enableassertions -Xmx1400m
-jar <https://builds.apache.org/job/HBase-0.92/ws/trunk/target/surefire/surefirebooter214140763751456065.jar>
<https://builds.apache.org/job/HBase-0.92/ws/trunk/target/surefire/surefire7000630084238380994tmp>
<https://builds.apache.org/job/HBase-0.92/ws/trunk/target/surefire/surefire7362202136676795307tmp>
Running org.apache.hadoop.hbase.regionserver.TestRegionSplitPolicy
Tests run: 3, Failures: 0, Errors: 0, Skipped: 0, Time elapsed: 0.701 sec
Forking command line: /bin/sh -c cd <https://builds.apache.org/job/HBase-0.92/ws/trunk>
&& /home/jenkins/tools/java/jdk1.6.0_27-32/jre/bin/java -enableassertions -Xmx1400m
-jar <https://builds.apache.org/job/HBase-0.92/ws/trunk/target/surefire/surefirebooter3532192889422520140.jar>
<https://builds.apache.org/job/HBase-0.92/ws/trunk/target/surefire/surefire1059826281928928420tmp>
<https://builds.apache.org/job/HBase-0.92/ws/trunk/target/surefire/surefire3015304631370919240tmp>
Running org.apache.hadoop.hbase.regionserver.TestKeyValueSkipListSet
Tests run: 4, Failures: 0, Errors: 0, Skipped: 0, Time elapsed: 0.121 sec
Forking command line: /bin/sh -c cd <https://builds.apache.org/job/HBase-0.92/ws/trunk>
&& /home/jenkins/tools/java/jdk1.6.0_27-32/jre/bin/java -enableassertions -Xmx1400m
-jar <https://builds.apache.org/job/HBase-0.92/ws/trunk/target/surefire/surefirebooter1818130179667930841.jar>
<https://builds.apache.org/job/HBase-0.92/ws/trunk/target/surefire/surefire8734362219274641742tmp>
<https://builds.apache.org/job/HBase-0.92/ws/trunk/target/surefire/surefire7040899577118758876tmp>
Running org.apache.hadoop.hbase.mapred.TestTableMapReduce
Tests run: 1, Failures: 0, Errors: 0, Skipped: 0, Time elapsed: 74.006 sec
Forking command line: /bin/sh -c cd <https://builds.apache.org/job/HBase-0.92/ws/trunk>
&& /home/jenkins/tools/java/jdk1.6.0_27-32/jre/bin/java -enableassertions -Xmx1400m
-jar <https://builds.apache.org/job/HBase-0.92/ws/trunk/target/surefire/surefirebooter6040933535375625282.jar>
<https://builds.apache.org/job/HBase-0.92/ws/trunk/target/surefire/surefire6736109888107336320tmp>
<https://builds.apache.org/job/HBase-0.92/ws/trunk/target/surefire/surefire8989794472549878382tmp>
Running org.apache.hadoop.hbase.mapred.TestTableInputFormat
Tests run: 6, Failures: 0, Errors: 0, Skipped: 0, Time elapsed: 25.019 sec
Forking command line: /bin/sh -c cd <https://builds.apache.org/job/HBase-0.92/ws/trunk>
&& /home/jenkins/tools/java/jdk1.6.0_27-32/jre/bin/java -enableassertions -Xmx1400m
-jar <https://builds.apache.org/job/HBase-0.92/ws/trunk/target/surefire/surefirebooter6012678175334469839.jar>
<https://builds.apache.org/job/HBase-0.92/ws/trunk/target/surefire/surefire2125222717796222166tmp>
<https://builds.apache.org/job/HBase-0.92/ws/trunk/target/surefire/surefire5193858896529541697tmp>
Running org.apache.hadoop.hbase.TestDrainingServer
Tests run: 2, Failures: 0, Errors: 0, Skipped: 0, Time elapsed: 18.665 sec
Forking command line: /bin/sh -c cd <https://builds.apache.org/job/HBase-0.92/ws/trunk>
&& /home/jenkins/tools/java/jdk1.6.0_27-32/jre/bin/java -enableassertions -Xmx1400m
-jar <https://builds.apache.org/job/HBase-0.92/ws/trunk/target/surefire/surefirebooter8692269727818449198.jar>
<https://builds.apache.org/job/HBase-0.92/ws/trunk/target/surefire/surefire6191178081582867784tmp>
<https://builds.apache.org/job/HBase-0.92/ws/trunk/target/surefire/surefire1708986868968878173tmp>
Running org.apache.hadoop.hbase.TestFSTableDescriptorForceCreation
Tests run: 3, Failures: 0, Errors: 0, Skipped: 0, Time elapsed: 0.525 sec
Forking command line: /bin/sh -c cd <https://builds.apache.org/job/HBase-0.92/ws/trunk>
&& /home/jenkins/tools/java/jdk1.6.0_27-32/jre/bin/java -enableassertions -Xmx1400m
-jar <https://builds.apache.org/job/HBase-0.92/ws/trunk/target/surefire/surefirebooter2073782221031984960.jar>
<https://builds.apache.org/job/HBase-0.92/ws/trunk/target/surefire/surefire7176748050571111637tmp>
<https://builds.apache.org/job/HBase-0.92/ws/trunk/target/surefire/surefire4958963854274714418tmp>
Running org.apache.hadoop.hbase.executor.TestExecutorService
Tests run: 1, Failures: 0, Errors: 0, Skipped: 0, Time elapsed: 2.428 sec
Forking command line: /bin/sh -c cd <https://builds.apache.org/job/HBase-0.92/ws/trunk>
&& /home/jenkins/tools/java/jdk1.6.0_27-32/jre/bin/java -enableassertions -Xmx1400m
-jar <https://builds.apache.org/job/HBase-0.92/ws/trunk/target/surefire/surefirebooter1228296783404898917.jar>
<https://builds.apache.org/job/HBase-0.92/ws/trunk/target/surefire/surefire2120703678333638020tmp>
<https://builds.apache.org/job/HBase-0.92/ws/trunk/target/surefire/surefire845656151394056833tmp>
Running org.apache.hadoop.hbase.mapreduce.TestTimeRangeMapRed
Tests run: 1, Failures: 0, Errors: 0, Skipped: 0, Time elapsed: 39.381 sec
Forking command line: /bin/sh -c cd <https://builds.apache.org/job/HBase-0.92/ws/trunk>
&& /home/jenkins/tools/java/jdk1.6.0_27-32/jre/bin/java -enableassertions -Xmx1400m
-jar <https://builds.apache.org/job/HBase-0.92/ws/trunk/target/surefire/surefirebooter9143848043036435367.jar>
<https://builds.apache.org/job/HBase-0.92/ws/trunk/target/surefire/surefire4048320945158488190tmp>
<https://builds.apache.org/job/HBase-0.92/ws/trunk/target/surefire/surefire5012552854624719149tmp>
Running org.apache.hadoop.hbase.mapreduce.TestHFileOutputFormat
Tests run: 8, Failures: 0, Errors: 0, Skipped: 0, Time elapsed: 150.196 sec
Forking command line: /bin/sh -c cd <https://builds.apache.org/job/HBase-0.92/ws/trunk>
&& /home/jenkins/tools/java/jdk1.6.0_27-32/jre/bin/java -enableassertions -Xmx1400m
-jar <https://builds.apache.org/job/HBase-0.92/ws/trunk/target/surefire/surefirebooter3504921367078161159.jar>
<https://builds.apache.org/job/HBase-0.92/ws/trunk/target/surefire/surefire6156987045078344783tmp>
<https://builds.apache.org/job/HBase-0.92/ws/trunk/target/surefire/surefire8170967100001628722tmp>
Running org.apache.hadoop.hbase.mapreduce.TestImportTsv
Tests run: 8, Failures: 0, Errors: 0, Skipped: 0, Time elapsed: 40.057 sec
Forking command line: /bin/sh -c cd <https://builds.apache.org/job/HBase-0.92/ws/trunk>
&& /home/jenkins/tools/java/jdk1.6.0_27-32/jre/bin/java -enableassertions -Xmx1400m
-jar <https://builds.apache.org/job/HBase-0.92/ws/trunk/target/surefire/surefirebooter7866900462822075311.jar>
<https://builds.apache.org/job/HBase-0.92/ws/trunk/target/surefire/surefire5657171643763716412tmp>
<https://builds.apache.org/job/HBase-0.92/ws/trunk/target/surefire/surefire9221164153893266983tmp>
Running org.apache.hadoop.hbase.mapreduce.TestTableInputFormatScan
Tests run: 11, Failures: 0, Errors: 0, Skipped: 0, Time elapsed: 449.08 sec
Forking command line: /bin/sh -c cd <https://builds.apache.org/job/HBase-0.92/ws/trunk>
&& /home/jenkins/tools/java/jdk1.6.0_27-32/jre/bin/java -enableassertions -Xmx1400m
-jar <https://builds.apache.org/job/HBase-0.92/ws/trunk/target/surefire/surefirebooter2244682323841087600.jar>
<https://builds.apache.org/job/HBase-0.92/ws/trunk/target/surefire/surefire2650392341846439982tmp>
<https://builds.apache.org/job/HBase-0.92/ws/trunk/target/surefire/surefire7499583689597840262tmp>
Running org.apache.hadoop.hbase.mapreduce.TestLoadIncrementalHFilesSplitRecovery
Tests run: 4, Failures: 0, Errors: 0, Skipped: 0, Time elapsed: 49.991 sec
Forking command line: /bin/sh -c cd <https://builds.apache.org/job/HBase-0.92/ws/trunk>
&& /home/jenkins/tools/java/jdk1.6.0_27-32/jre/bin/java -enableassertions -Xmx1400m
-jar <https://builds.apache.org/job/HBase-0.92/ws/trunk/target/surefire/surefirebooter4847591183074222445.jar>
<https://builds.apache.org/job/HBase-0.92/ws/trunk/target/surefire/surefire5098685284684210804tmp>
<https://builds.apache.org/job/HBase-0.92/ws/trunk/target/surefire/surefire6038960408286906837tmp>
Running org.apache.hadoop.hbase.mapreduce.TestTableSplit
Tests run: 1, Failures: 0, Errors: 0, Skipped: 0, Time elapsed: 0.136 sec
Forking command line: /bin/sh -c cd <https://builds.apache.org/job/HBase-0.92/ws/trunk>
&& /home/jenkins/tools/java/jdk1.6.0_27-32/jre/bin/java -enableassertions -Xmx1400m
-jar <https://builds.apache.org/job/HBase-0.92/ws/trunk/target/surefire/surefirebooter4397068071319759352.jar>
<https://builds.apache.org/job/HBase-0.92/ws/trunk/target/surefire/surefire4934579435640792519tmp>
<https://builds.apache.org/job/HBase-0.92/ws/trunk/target/surefire/surefire7226775397372224589tmp>
Running org.apache.hadoop.hbase.mapreduce.TestSimpleTotalOrderPartitioner
Tests run: 1, Failures: 0, Errors: 0, Skipped: 0, Time elapsed: 0.415 sec
Forking command line: /bin/sh -c cd <https://builds.apache.org/job/HBase-0.92/ws/trunk>
&& /home/jenkins/tools/java/jdk1.6.0_27-32/jre/bin/java -enableassertions -Xmx1400m
-jar <https://builds.apache.org/job/HBase-0.92/ws/trunk/target/surefire/surefirebooter5736282401147172095.jar>
<https://builds.apache.org/job/HBase-0.92/ws/trunk/target/surefire/surefire7340169096987803475tmp>
<https://builds.apache.org/job/HBase-0.92/ws/trunk/target/surefire/surefire7154473881538271297tmp>
Running org.apache.hadoop.hbase.mapreduce.TestTableMapReduce
Tests run: 1, Failures: 0, Errors: 0, Skipped: 0, Time elapsed: 96.448 sec
Forking command line: /bin/sh -c cd <https://builds.apache.org/job/HBase-0.92/ws/trunk>
&& /home/jenkins/tools/java/jdk1.6.0_27-32/jre/bin/java -enableassertions -Xmx1400m
-jar <https://builds.apache.org/job/HBase-0.92/ws/trunk/target/surefire/surefirebooter4383727924567002741.jar>
<https://builds.apache.org/job/HBase-0.92/ws/trunk/target/surefire/surefire3893935886549240655tmp>
<https://builds.apache.org/job/HBase-0.92/ws/trunk/target/surefire/surefire2543903152374322612tmp>
Running org.apache.hadoop.hbase.mapreduce.TestLoadIncrementalHFiles
Tests run: 6, Failures: 0, Errors: 0, Skipped: 0, Time elapsed: 29.626 sec
Forking command line: /bin/sh -c cd <https://builds.apache.org/job/HBase-0.92/ws/trunk>
&& /home/jenkins/tools/java/jdk1.6.0_27-32/jre/bin/java -enableassertions -Xmx1400m
-jar <https://builds.apache.org/job/HBase-0.92/ws/trunk/target/surefire/surefirebooter644023087343549606.jar>
<https://builds.apache.org/job/HBase-0.92/ws/trunk/target/surefire/surefire1571885579475324927tmp>
<https://builds.apache.org/job/HBase-0.92/ws/trunk/target/surefire/surefire1531703321119384199tmp>
Running org.apache.hadoop.hbase.TestHRegionLocation
Tests run: 3, Failures: 0, Errors: 0, Skipped: 0, Time elapsed: 0.142 sec

Results :

Tests in error: 
  testHundredsOfTable(org.apache.hadoop.hbase.client.TestAdmin): Call to juno.apache.org/67.195.138.61:38863
failed on socket timeout exception: java.net.SocketTimeoutException: 1500 millis timeout while
waiting for channel to be ready for read. ch : java.nio.channels.SocketChannel[connected local=/67.195.138.61:53942
remote=juno.apache.org/67.195.138.61:38863]

Tests run: 1052, Failures: 0, Errors: 1, Skipped: 10

[INFO] ------------------------------------------------------------------------
[INFO] BUILD FAILURE
[INFO] ------------------------------------------------------------------------
[INFO] Total time: 1:47:10.313s
[INFO] Finished at: Thu Nov 17 04:42:52 UTC 2011
[INFO] Final Memory: 46M/642M
[INFO] ------------------------------------------------------------------------
[ERROR] Failed to execute goal org.apache.maven.plugins:maven-surefire-plugin:2.10:test (default-test)
on project hbase: Failure or timeout -> [Help 1]
org.apache.maven.lifecycle.LifecycleExecutionException: Failed to execute goal org.apache.maven.plugins:maven-surefire-plugin:2.10:test
(default-test) on project hbase: Failure or timeout
	at org.apache.maven.lifecycle.internal.MojoExecutor.execute(MojoExecutor.java:217)
	at org.apache.maven.lifecycle.internal.MojoExecutor.execute(MojoExecutor.java:153)
	at org.apache.maven.lifecycle.internal.MojoExecutor.execute(MojoExecutor.java:145)
	at org.apache.maven.lifecycle.internal.MojoExecutor.executeForkedExecutions(MojoExecutor.java:365)
	at org.apache.maven.lifecycle.internal.MojoExecutor.execute(MojoExecutor.java:199)
	at org.apache.maven.lifecycle.internal.MojoExecutor.execute(MojoExecutor.java:153)
	at org.apache.maven.lifecycle.internal.MojoExecutor.execute(MojoExecutor.java:145)
	at org.apache.maven.lifecycle.internal.LifecycleModuleBuilder.buildProject(LifecycleModuleBuilder.java:84)
	at org.apache.maven.lifecycle.internal.LifecycleModuleBuilder.buildProject(LifecycleModuleBuilder.java:59)
	at org.apache.maven.lifecycle.internal.LifecycleStarter.singleThreadedBuild(LifecycleStarter.java:183)
	at org.apache.maven.lifecycle.internal.LifecycleStarter.execute(LifecycleStarter.java:161)
	at org.apache.maven.DefaultMaven.doExecute(DefaultMaven.java:319)
	at org.apache.maven.DefaultMaven.execute(DefaultMaven.java:156)
	at org.apache.maven.cli.MavenCli.execute(MavenCli.java:537)
	at org.apache.maven.cli.MavenCli.doMain(MavenCli.java:196)
	at org.apache.maven.cli.MavenCli.main(MavenCli.java:141)
	at sun.reflect.NativeMethodAccessorImpl.invoke0(Native Method)
	at sun.reflect.NativeMethodAccessorImpl.invoke(NativeMethodAccessorImpl.java:39)
	at sun.reflect.DelegatingMethodAccessorImpl.invoke(DelegatingMethodAccessorImpl.java:25)
	at java.lang.reflect.Method.invoke(Method.java:597)
	at org.codehaus.plexus.classworlds.launcher.Launcher.launchEnhanced(Launcher.java:290)
	at org.codehaus.plexus.classworlds.launcher.Launcher.launch(Launcher.java:230)
	at org.codehaus.plexus.classworlds.launcher.Launcher.mainWithExitCode(Launcher.java:409)
	at org.codehaus.plexus.classworlds.launcher.Launcher.main(Launcher.java:352)
Caused by: org.apache.maven.plugin.MojoExecutionException: Failure or timeout
	at org.apache.maven.plugin.surefire.SurefirePlugin.assertNoFailureOrTimeout(SurefirePlugin.java:633)
	at org.apache.maven.plugin.surefire.SurefirePlugin.handleSummary(SurefirePlugin.java:614)
	at org.apache.maven.plugin.surefire.AbstractSurefireMojo.executeAfterPreconditionsChecked(AbstractSurefireMojo.java:137)
	at org.apache.maven.plugin.surefire.AbstractSurefireMojo.execute(AbstractSurefireMojo.java:98)
	at org.apache.maven.plugin.DefaultBuildPluginManager.executeMojo(DefaultBuildPluginManager.java:101)
	at org.apache.maven.lifecycle.internal.MojoExecutor.execute(MojoExecutor.java:209)
	... 23 more
[ERROR] 
[ERROR] 
[ERROR] For more information about the errors and possible solutions, please read the following
articles:
[ERROR] [Help 1] http://cwiki.apache.org/confluence/display/MAVEN/MojoExecutionException
Build step 'Invoke top-level Maven targets' marked build as failure
[locks-and-latches] Releasing all the locks
[locks-and-latches] All the locks released
Archiving artifacts
Recording test results
Updating HBASE-4804
Updating HBASE-4801
Updating HBASE-4796


Mime
View raw message