hbase-dev mailing list archives

Site index · List index
Message view « Date » · « Thread »
Top « Date » · « Thread »
From Stack <st...@duboce.net>
Subject Re: Build failed in Jenkins: HBase-0.92 #53
Date Sat, 08 Oct 2011 21:28:47 GMT
This looks to be a failure where .tableinfo file schema is being
updated at same time someone is trying to check modtime on .tableinfo.
 I was thinking we should probably have the stuff that looks at
.tableinfo do retries till file comes back?

St.Ack

On Fri, Oct 7, 2011 at 10:39 PM, Apache Jenkins Server
<jenkins@builds.apache.org> wrote:
> See <https://builds.apache.org/job/HBase-0.92/53/>
>
> ------------------------------------------
> [...truncated 6060 lines...]
> Tests run: 33, Failures: 0, Errors: 0, Skipped: 0, Time elapsed: 0.313 sec
> Forking command line: /bin/sh -c cd <https://builds.apache.org/job/HBase-0.92/ws/trunk>
&& /home/jenkins/tools/java/jdk1.6.0_20-32/jre/bin/java -enableassertions -Xmx1400m
-jar <https://builds.apache.org/job/HBase-0.92/ws/trunk/target/surefire/surefirebooter6312121142277130821.jar>
<https://builds.apache.org/job/HBase-0.92/ws/trunk/target/surefire/surefire692088417773578850tmp>
<https://builds.apache.org/job/HBase-0.92/ws/trunk/target/surefire/surefire9052429322337862311tmp>
> Running org.apache.hadoop.hbase.filter.TestRandomRowFilter
> Tests run: 2, Failures: 0, Errors: 0, Skipped: 0, Time elapsed: 0.599 sec
> Forking command line: /bin/sh -c cd <https://builds.apache.org/job/HBase-0.92/ws/trunk>
&& /home/jenkins/tools/java/jdk1.6.0_20-32/jre/bin/java -enableassertions -Xmx1400m
-jar <https://builds.apache.org/job/HBase-0.92/ws/trunk/target/surefire/surefirebooter5491284576584149741.jar>
<https://builds.apache.org/job/HBase-0.92/ws/trunk/target/surefire/surefire5205394594158814895tmp>
<https://builds.apache.org/job/HBase-0.92/ws/trunk/target/surefire/surefire2160382603693886028tmp>
> Running org.apache.hadoop.hbase.filter.TestPrefixFilter
> Tests run: 3, Failures: 0, Errors: 0, Skipped: 0, Time elapsed: 0.107 sec
> Forking command line: /bin/sh -c cd <https://builds.apache.org/job/HBase-0.92/ws/trunk>
&& /home/jenkins/tools/java/jdk1.6.0_20-32/jre/bin/java -enableassertions -Xmx1400m
-jar <https://builds.apache.org/job/HBase-0.92/ws/trunk/target/surefire/surefirebooter6007107056328587270.jar>
<https://builds.apache.org/job/HBase-0.92/ws/trunk/target/surefire/surefire8544750521148237532tmp>
<https://builds.apache.org/job/HBase-0.92/ws/trunk/target/surefire/surefire3981207957500324519tmp>
> Running org.apache.hadoop.hbase.filter.TestBitComparator
> Tests run: 3, Failures: 0, Errors: 0, Skipped: 0, Time elapsed: 0.058 sec
> Forking command line: /bin/sh -c cd <https://builds.apache.org/job/HBase-0.92/ws/trunk>
&& /home/jenkins/tools/java/jdk1.6.0_20-32/jre/bin/java -enableassertions -Xmx1400m
-jar <https://builds.apache.org/job/HBase-0.92/ws/trunk/target/surefire/surefirebooter3951725743271242676.jar>
<https://builds.apache.org/job/HBase-0.92/ws/trunk/target/surefire/surefire5926504213733322305tmp>
<https://builds.apache.org/job/HBase-0.92/ws/trunk/target/surefire/surefire7014126012394739898tmp>
> Running org.apache.hadoop.hbase.filter.TestDependentColumnFilter
> Tests run: 2, Failures: 0, Errors: 0, Skipped: 0, Time elapsed: 0.786 sec
> Forking command line: /bin/sh -c cd <https://builds.apache.org/job/HBase-0.92/ws/trunk>
&& /home/jenkins/tools/java/jdk1.6.0_20-32/jre/bin/java -enableassertions -Xmx1400m
-jar <https://builds.apache.org/job/HBase-0.92/ws/trunk/target/surefire/surefirebooter7257275764461422597.jar>
<https://builds.apache.org/job/HBase-0.92/ws/trunk/target/surefire/surefire1091352678035856099tmp>
<https://builds.apache.org/job/HBase-0.92/ws/trunk/target/surefire/surefire7541864643173729964tmp>
> Running org.apache.hadoop.hbase.filter.TestSingleColumnValueFilter
> Tests run: 2, Failures: 0, Errors: 0, Skipped: 0, Time elapsed: 0.162 sec
> Forking command line: /bin/sh -c cd <https://builds.apache.org/job/HBase-0.92/ws/trunk>
&& /home/jenkins/tools/java/jdk1.6.0_20-32/jre/bin/java -enableassertions -Xmx1400m
-jar <https://builds.apache.org/job/HBase-0.92/ws/trunk/target/surefire/surefirebooter3682509420179509598.jar>
<https://builds.apache.org/job/HBase-0.92/ws/trunk/target/surefire/surefire8428555607142700762tmp>
<https://builds.apache.org/job/HBase-0.92/ws/trunk/target/surefire/surefire4346919101638232051tmp>
> Running org.apache.hadoop.hbase.filter.TestInclusiveStopFilter
> Tests run: 2, Failures: 0, Errors: 0, Skipped: 0, Time elapsed: 0.111 sec
> Forking command line: /bin/sh -c cd <https://builds.apache.org/job/HBase-0.92/ws/trunk>
&& /home/jenkins/tools/java/jdk1.6.0_20-32/jre/bin/java -enableassertions -Xmx1400m
-jar <https://builds.apache.org/job/HBase-0.92/ws/trunk/target/surefire/surefirebooter7485825102822634001.jar>
<https://builds.apache.org/job/HBase-0.92/ws/trunk/target/surefire/surefire4268847380948313715tmp>
<https://builds.apache.org/job/HBase-0.92/ws/trunk/target/surefire/surefire2309868178926751682tmp>
> Running org.apache.hadoop.hbase.filter.TestFilterList
> Tests run: 5, Failures: 0, Errors: 0, Skipped: 0, Time elapsed: 0.26 sec
> Forking command line: /bin/sh -c cd <https://builds.apache.org/job/HBase-0.92/ws/trunk>
&& /home/jenkins/tools/java/jdk1.6.0_20-32/jre/bin/java -enableassertions -Xmx1400m
-jar <https://builds.apache.org/job/HBase-0.92/ws/trunk/target/surefire/surefirebooter7391841524498675751.jar>
<https://builds.apache.org/job/HBase-0.92/ws/trunk/target/surefire/surefire8733323750170665133tmp>
<https://builds.apache.org/job/HBase-0.92/ws/trunk/target/surefire/surefire3351710999042838234tmp>
> Running org.apache.hadoop.hbase.filter.TestFilter
> Tests run: 18, Failures: 0, Errors: 0, Skipped: 0, Time elapsed: 5.291 sec
> Forking command line: /bin/sh -c cd <https://builds.apache.org/job/HBase-0.92/ws/trunk>
&& /home/jenkins/tools/java/jdk1.6.0_20-32/jre/bin/java -enableassertions -Xmx1400m
-jar <https://builds.apache.org/job/HBase-0.92/ws/trunk/target/surefire/surefirebooter4983132303065224154.jar>
<https://builds.apache.org/job/HBase-0.92/ws/trunk/target/surefire/surefire8960392183697078062tmp>
<https://builds.apache.org/job/HBase-0.92/ws/trunk/target/surefire/surefire4588527085229594370tmp>
> Running org.apache.hadoop.hbase.filter.TestMultipleColumnPrefixFilter
> Tests run: 3, Failures: 0, Errors: 0, Skipped: 0, Time elapsed: 3.709 sec
> Forking command line: /bin/sh -c cd <https://builds.apache.org/job/HBase-0.92/ws/trunk>
&& /home/jenkins/tools/java/jdk1.6.0_20-32/jre/bin/java -enableassertions -Xmx1400m
-jar <https://builds.apache.org/job/HBase-0.92/ws/trunk/target/surefire/surefirebooter8817234419825968270.jar>
<https://builds.apache.org/job/HBase-0.92/ws/trunk/target/surefire/surefire2384270148459529589tmp>
<https://builds.apache.org/job/HBase-0.92/ws/trunk/target/surefire/surefire6874813974304658559tmp>
> Running org.apache.hadoop.hbase.filter.TestColumnPrefixFilter
> Tests run: 2, Failures: 0, Errors: 0, Skipped: 0, Time elapsed: 2.753 sec
> Forking command line: /bin/sh -c cd <https://builds.apache.org/job/HBase-0.92/ws/trunk>
&& /home/jenkins/tools/java/jdk1.6.0_20-32/jre/bin/java -enableassertions -Xmx1400m
-jar <https://builds.apache.org/job/HBase-0.92/ws/trunk/target/surefire/surefirebooter4462424290485026344.jar>
<https://builds.apache.org/job/HBase-0.92/ws/trunk/target/surefire/surefire899475147161424525tmp>
<https://builds.apache.org/job/HBase-0.92/ws/trunk/target/surefire/surefire7834815988884806290tmp>
> Running org.apache.hadoop.hbase.filter.TestSingleColumnValueExcludeFilter
> Tests run: 1, Failures: 0, Errors: 0, Skipped: 0, Time elapsed: 0.115 sec
> Forking command line: /bin/sh -c cd <https://builds.apache.org/job/HBase-0.92/ws/trunk>
&& /home/jenkins/tools/java/jdk1.6.0_20-32/jre/bin/java -enableassertions -Xmx1400m
-jar <https://builds.apache.org/job/HBase-0.92/ws/trunk/target/surefire/surefirebooter2462076408032629391.jar>
<https://builds.apache.org/job/HBase-0.92/ws/trunk/target/surefire/surefire8151559394204862695tmp>
<https://builds.apache.org/job/HBase-0.92/ws/trunk/target/surefire/surefire2122515921477324301tmp>
> Running org.apache.hadoop.hbase.TestGlobalMemStoreSize
> Tests run: 1, Failures: 0, Errors: 0, Skipped: 0, Time elapsed: 15.122 sec
> Forking command line: /bin/sh -c cd <https://builds.apache.org/job/HBase-0.92/ws/trunk>
&& /home/jenkins/tools/java/jdk1.6.0_20-32/jre/bin/java -enableassertions -Xmx1400m
-jar <https://builds.apache.org/job/HBase-0.92/ws/trunk/target/surefire/surefirebooter5605766868009691269.jar>
<https://builds.apache.org/job/HBase-0.92/ws/trunk/target/surefire/surefire5934981551666389205tmp>
<https://builds.apache.org/job/HBase-0.92/ws/trunk/target/surefire/surefire1532926934118475578tmp>
> Running org.apache.hadoop.hbase.TestHBaseTestingUtility
> Tests run: 6, Failures: 0, Errors: 0, Skipped: 0, Time elapsed: 58.733 sec
> Forking command line: /bin/sh -c cd <https://builds.apache.org/job/HBase-0.92/ws/trunk>
&& /home/jenkins/tools/java/jdk1.6.0_20-32/jre/bin/java -enableassertions -Xmx1400m
-jar <https://builds.apache.org/job/HBase-0.92/ws/trunk/target/surefire/surefirebooter6938856469300112434.jar>
<https://builds.apache.org/job/HBase-0.92/ws/trunk/target/surefire/surefire2102610703744608240tmp>
<https://builds.apache.org/job/HBase-0.92/ws/trunk/target/surefire/surefire4785873922287275248tmp>
> Running org.apache.hadoop.hbase.security.TestUser
> Tests run: 3, Failures: 0, Errors: 0, Skipped: 0, Time elapsed: 0.349 sec
> Forking command line: /bin/sh -c cd <https://builds.apache.org/job/HBase-0.92/ws/trunk>
&& /home/jenkins/tools/java/jdk1.6.0_20-32/jre/bin/java -enableassertions -Xmx1400m
-jar <https://builds.apache.org/job/HBase-0.92/ws/trunk/target/surefire/surefirebooter4044526605603051482.jar>
<https://builds.apache.org/job/HBase-0.92/ws/trunk/target/surefire/surefire1523139488763252382tmp>
<https://builds.apache.org/job/HBase-0.92/ws/trunk/target/surefire/surefire403015806996461564tmp>
> Running org.apache.hadoop.hbase.TestMultiVersions
> Tests run: 3, Failures: 0, Errors: 0, Skipped: 0, Time elapsed: 37.124 sec
> Forking command line: /bin/sh -c cd <https://builds.apache.org/job/HBase-0.92/ws/trunk>
&& /home/jenkins/tools/java/jdk1.6.0_20-32/jre/bin/java -enableassertions -Xmx1400m
-jar <https://builds.apache.org/job/HBase-0.92/ws/trunk/target/surefire/surefirebooter7900735337009816430.jar>
<https://builds.apache.org/job/HBase-0.92/ws/trunk/target/surefire/surefire962540760823241066tmp>
<https://builds.apache.org/job/HBase-0.92/ws/trunk/target/surefire/surefire1452789768559727645tmp>
> Running org.apache.hadoop.hbase.TestRegionRebalancing
> Tests run: 1, Failures: 0, Errors: 0, Skipped: 0, Time elapsed: 44.588 sec
> Forking command line: /bin/sh -c cd <https://builds.apache.org/job/HBase-0.92/ws/trunk>
&& /home/jenkins/tools/java/jdk1.6.0_20-32/jre/bin/java -enableassertions -Xmx1400m
-jar <https://builds.apache.org/job/HBase-0.92/ws/trunk/target/surefire/surefirebooter7159024879919705972.jar>
<https://builds.apache.org/job/HBase-0.92/ws/trunk/target/surefire/surefire2208635125082277493tmp>
<https://builds.apache.org/job/HBase-0.92/ws/trunk/target/surefire/surefire3467372539847693340tmp>
> Running org.apache.hadoop.hbase.replication.TestReplication
> Tests run: 7, Failures: 0, Errors: 0, Skipped: 0, Time elapsed: 100.801 sec
> Forking command line: /bin/sh -c cd <https://builds.apache.org/job/HBase-0.92/ws/trunk>
&& /home/jenkins/tools/java/jdk1.6.0_20-32/jre/bin/java -enableassertions -Xmx1400m
-jar <https://builds.apache.org/job/HBase-0.92/ws/trunk/target/surefire/surefirebooter7048793057147119813.jar>
<https://builds.apache.org/job/HBase-0.92/ws/trunk/target/surefire/surefire3326876730066654457tmp>
<https://builds.apache.org/job/HBase-0.92/ws/trunk/target/surefire/surefire8962390181215218905tmp>
> Running org.apache.hadoop.hbase.replication.TestMasterReplication
> Tests run: 2, Failures: 0, Errors: 0, Skipped: 0, Time elapsed: 80.51 sec
> Forking command line: /bin/sh -c cd <https://builds.apache.org/job/HBase-0.92/ws/trunk>
&& /home/jenkins/tools/java/jdk1.6.0_20-32/jre/bin/java -enableassertions -Xmx1400m
-jar <https://builds.apache.org/job/HBase-0.92/ws/trunk/target/surefire/surefirebooter3766556701804296247.jar>
<https://builds.apache.org/job/HBase-0.92/ws/trunk/target/surefire/surefire2494430718714400286tmp>
<https://builds.apache.org/job/HBase-0.92/ws/trunk/target/surefire/surefire4679420982986037993tmp>
> Running org.apache.hadoop.hbase.replication.regionserver.TestReplicationSourceManager
> Tests run: 1, Failures: 0, Errors: 0, Skipped: 0, Time elapsed: 0.891 sec
> Forking command line: /bin/sh -c cd <https://builds.apache.org/job/HBase-0.92/ws/trunk>
&& /home/jenkins/tools/java/jdk1.6.0_20-32/jre/bin/java -enableassertions -Xmx1400m
-jar <https://builds.apache.org/job/HBase-0.92/ws/trunk/target/surefire/surefirebooter1828923342139497703.jar>
<https://builds.apache.org/job/HBase-0.92/ws/trunk/target/surefire/surefire3689971637813611682tmp>
<https://builds.apache.org/job/HBase-0.92/ws/trunk/target/surefire/surefire201352979525183870tmp>
> Running org.apache.hadoop.hbase.replication.regionserver.TestReplicationSink
> Tests run: 5, Failures: 0, Errors: 0, Skipped: 0, Time elapsed: 32.832 sec
> Forking command line: /bin/sh -c cd <https://builds.apache.org/job/HBase-0.92/ws/trunk>
&& /home/jenkins/tools/java/jdk1.6.0_20-32/jre/bin/java -enableassertions -Xmx1400m
-jar <https://builds.apache.org/job/HBase-0.92/ws/trunk/target/surefire/surefirebooter6514729417409522657.jar>
<https://builds.apache.org/job/HBase-0.92/ws/trunk/target/surefire/surefire5336913936355112304tmp>
<https://builds.apache.org/job/HBase-0.92/ws/trunk/target/surefire/surefire9165714601243037252tmp>
> Running org.apache.hadoop.hbase.replication.TestReplicationPeer
> Tests run: 1, Failures: 0, Errors: 0, Skipped: 0, Time elapsed: 25.508 sec
> Forking command line: /bin/sh -c cd <https://builds.apache.org/job/HBase-0.92/ws/trunk>
&& /home/jenkins/tools/java/jdk1.6.0_20-32/jre/bin/java -enableassertions -Xmx1400m
-jar <https://builds.apache.org/job/HBase-0.92/ws/trunk/target/surefire/surefirebooter6818936085807505892.jar>
<https://builds.apache.org/job/HBase-0.92/ws/trunk/target/surefire/surefire5560047577480984805tmp>
<https://builds.apache.org/job/HBase-0.92/ws/trunk/target/surefire/surefire3465323483429720802tmp>
> Running org.apache.hadoop.hbase.replication.TestMultiSlaveReplication
> Tests run: 1, Failures: 0, Errors: 0, Skipped: 0, Time elapsed: 59.7 sec
> Forking command line: /bin/sh -c cd <https://builds.apache.org/job/HBase-0.92/ws/trunk>
&& /home/jenkins/tools/java/jdk1.6.0_20-32/jre/bin/java -enableassertions -Xmx1400m
-jar <https://builds.apache.org/job/HBase-0.92/ws/trunk/target/surefire/surefirebooter5986148780180796419.jar>
<https://builds.apache.org/job/HBase-0.92/ws/trunk/target/surefire/surefire6569561680933353969tmp>
<https://builds.apache.org/job/HBase-0.92/ws/trunk/target/surefire/surefire5972062814282158744tmp>
> Running org.apache.hadoop.hbase.replication.TestReplicationSource
> Tests run: 1, Failures: 0, Errors: 0, Skipped: 0, Time elapsed: 1.71 sec
> Forking command line: /bin/sh -c cd <https://builds.apache.org/job/HBase-0.92/ws/trunk>
&& /home/jenkins/tools/java/jdk1.6.0_20-32/jre/bin/java -enableassertions -Xmx1400m
-jar <https://builds.apache.org/job/HBase-0.92/ws/trunk/target/surefire/surefirebooter4380701712992872105.jar>
<https://builds.apache.org/job/HBase-0.92/ws/trunk/target/surefire/surefire189595347512917247tmp>
<https://builds.apache.org/job/HBase-0.92/ws/trunk/target/surefire/surefire7416271983595504518tmp>
> Running org.apache.hadoop.hbase.avro.TestAvroServer
> Tests run: 3, Failures: 0, Errors: 3, Skipped: 0, Time elapsed: 52.702 sec <<<
FAILURE!
> Forking command line: /bin/sh -c cd <https://builds.apache.org/job/HBase-0.92/ws/trunk>
&& /home/jenkins/tools/java/jdk1.6.0_20-32/jre/bin/java -enableassertions -Xmx1400m
-jar <https://builds.apache.org/job/HBase-0.92/ws/trunk/target/surefire/surefirebooter2160228747740855395.jar>
<https://builds.apache.org/job/HBase-0.92/ws/trunk/target/surefire/surefire5944610302953237389tmp>
<https://builds.apache.org/job/HBase-0.92/ws/trunk/target/surefire/surefire6863992492005702501tmp>
> Running org.apache.hadoop.hbase.avro.TestAvroUtil
> Tests run: 1, Failures: 0, Errors: 0, Skipped: 0, Time elapsed: 0.698 sec
> Forking command line: /bin/sh -c cd <https://builds.apache.org/job/HBase-0.92/ws/trunk>
&& /home/jenkins/tools/java/jdk1.6.0_20-32/jre/bin/java -enableassertions -Xmx1400m
-jar <https://builds.apache.org/job/HBase-0.92/ws/trunk/target/surefire/surefirebooter5753766693017950174.jar>
<https://builds.apache.org/job/HBase-0.92/ws/trunk/target/surefire/surefire5818712392661528030tmp>
<https://builds.apache.org/job/HBase-0.92/ws/trunk/target/surefire/surefire8851688718403107637tmp>
> Running org.apache.hadoop.hbase.TestAcidGuarantees
> Tests run: 3, Failures: 0, Errors: 0, Skipped: 3, Time elapsed: 0.063 sec
> Forking command line: /bin/sh -c cd <https://builds.apache.org/job/HBase-0.92/ws/trunk>
&& /home/jenkins/tools/java/jdk1.6.0_20-32/jre/bin/java -enableassertions -Xmx1400m
-jar <https://builds.apache.org/job/HBase-0.92/ws/trunk/target/surefire/surefirebooter3346987788373507218.jar>
<https://builds.apache.org/job/HBase-0.92/ws/trunk/target/surefire/surefire4304327295233738184tmp>
<https://builds.apache.org/job/HBase-0.92/ws/trunk/target/surefire/surefire981733775152638162tmp>
> Running org.apache.hadoop.hbase.TestKeyValue
> Tests run: 11, Failures: 0, Errors: 0, Skipped: 0, Time elapsed: 0.138 sec
> Forking command line: /bin/sh -c cd <https://builds.apache.org/job/HBase-0.92/ws/trunk>
&& /home/jenkins/tools/java/jdk1.6.0_20-32/jre/bin/java -enableassertions -Xmx1400m
-jar <https://builds.apache.org/job/HBase-0.92/ws/trunk/target/surefire/surefirebooter200597194208239876.jar>
<https://builds.apache.org/job/HBase-0.92/ws/trunk/target/surefire/surefire513196103854674523tmp>
<https://builds.apache.org/job/HBase-0.92/ws/trunk/target/surefire/surefire6168771906140565981tmp>
> Running org.apache.hadoop.hbase.coprocessor.TestRegionServerCoprocessorExceptionWithRemove
> Tests run: 1, Failures: 0, Errors: 0, Skipped: 0, Time elapsed: 20.637 sec
> Forking command line: /bin/sh -c cd <https://builds.apache.org/job/HBase-0.92/ws/trunk>
&& /home/jenkins/tools/java/jdk1.6.0_20-32/jre/bin/java -enableassertions -Xmx1400m
-jar <https://builds.apache.org/job/HBase-0.92/ws/trunk/target/surefire/surefirebooter8715719663966742401.jar>
<https://builds.apache.org/job/HBase-0.92/ws/trunk/target/surefire/surefire1204430955153406607tmp>
<https://builds.apache.org/job/HBase-0.92/ws/trunk/target/surefire/surefire4693733333098337546tmp>
> Running org.apache.hadoop.hbase.coprocessor.TestRegionObserverInterface
> Tests run: 5, Failures: 0, Errors: 0, Skipped: 0, Time elapsed: 32.45 sec
> Forking command line: /bin/sh -c cd <https://builds.apache.org/job/HBase-0.92/ws/trunk>
&& /home/jenkins/tools/java/jdk1.6.0_20-32/jre/bin/java -enableassertions -Xmx1400m
-jar <https://builds.apache.org/job/HBase-0.92/ws/trunk/target/surefire/surefirebooter140538975150545655.jar>
<https://builds.apache.org/job/HBase-0.92/ws/trunk/target/surefire/surefire8614295983101708191tmp>
<https://builds.apache.org/job/HBase-0.92/ws/trunk/target/surefire/surefire8174194197658404494tmp>
> Running org.apache.hadoop.hbase.coprocessor.TestCoprocessorInterface
> Tests run: 1, Failures: 0, Errors: 0, Skipped: 0, Time elapsed: 4.187 sec
> Forking command line: /bin/sh -c cd <https://builds.apache.org/job/HBase-0.92/ws/trunk>
&& /home/jenkins/tools/java/jdk1.6.0_20-32/jre/bin/java -enableassertions -Xmx1400m
-jar <https://builds.apache.org/job/HBase-0.92/ws/trunk/target/surefire/surefirebooter7369451420948283159.jar>
<https://builds.apache.org/job/HBase-0.92/ws/trunk/target/surefire/surefire3378441566838403573tmp>
<https://builds.apache.org/job/HBase-0.92/ws/trunk/target/surefire/surefire5189377783273551831tmp>
> Running org.apache.hadoop.hbase.coprocessor.TestMasterObserver
> Tests run: 3, Failures: 0, Errors: 0, Skipped: 0, Time elapsed: 29.549 sec
> Forking command line: /bin/sh -c cd <https://builds.apache.org/job/HBase-0.92/ws/trunk>
&& /home/jenkins/tools/java/jdk1.6.0_20-32/jre/bin/java -enableassertions -Xmx1400m
-jar <https://builds.apache.org/job/HBase-0.92/ws/trunk/target/surefire/surefirebooter3694037024886601485.jar>
<https://builds.apache.org/job/HBase-0.92/ws/trunk/target/surefire/surefire7772212328825514754tmp>
<https://builds.apache.org/job/HBase-0.92/ws/trunk/target/surefire/surefire1522733612897891077tmp>
> Running org.apache.hadoop.hbase.coprocessor.TestCoprocessorEndpoint
> Tests run: 2, Failures: 0, Errors: 0, Skipped: 0, Time elapsed: 23.556 sec
> Forking command line: /bin/sh -c cd <https://builds.apache.org/job/HBase-0.92/ws/trunk>
&& /home/jenkins/tools/java/jdk1.6.0_20-32/jre/bin/java -enableassertions -Xmx1400m
-jar <https://builds.apache.org/job/HBase-0.92/ws/trunk/target/surefire/surefirebooter3884021105211078607.jar>
<https://builds.apache.org/job/HBase-0.92/ws/trunk/target/surefire/surefire6931249042488196952tmp>
<https://builds.apache.org/job/HBase-0.92/ws/trunk/target/surefire/surefire6877289661757523776tmp>
> Running org.apache.hadoop.hbase.coprocessor.TestWALObserver
> Tests run: 3, Failures: 0, Errors: 0, Skipped: 0, Time elapsed: 26.041 sec
> Forking command line: /bin/sh -c cd <https://builds.apache.org/job/HBase-0.92/ws/trunk>
&& /home/jenkins/tools/java/jdk1.6.0_20-32/jre/bin/java -enableassertions -Xmx1400m
-jar <https://builds.apache.org/job/HBase-0.92/ws/trunk/target/surefire/surefirebooter5926550506043454346.jar>
<https://builds.apache.org/job/HBase-0.92/ws/trunk/target/surefire/surefire6443024995380337960tmp>
<https://builds.apache.org/job/HBase-0.92/ws/trunk/target/surefire/surefire4025626735282930600tmp>
> Running org.apache.hadoop.hbase.coprocessor.TestRegionObserverBypass
> Tests run: 2, Failures: 0, Errors: 0, Skipped: 0, Time elapsed: 26.413 sec
> Forking command line: /bin/sh -c cd <https://builds.apache.org/job/HBase-0.92/ws/trunk>
&& /home/jenkins/tools/java/jdk1.6.0_20-32/jre/bin/java -enableassertions -Xmx1400m
-jar <https://builds.apache.org/job/HBase-0.92/ws/trunk/target/surefire/surefirebooter1470637563011423809.jar>
<https://builds.apache.org/job/HBase-0.92/ws/trunk/target/surefire/surefire776389920465837211tmp>
<https://builds.apache.org/job/HBase-0.92/ws/trunk/target/surefire/surefire6566606770011289117tmp>
> Running org.apache.hadoop.hbase.coprocessor.TestMasterCoprocessorExceptionWithAbort
> Tests run: 1, Failures: 0, Errors: 0, Skipped: 0, Time elapsed: 27.575 sec
> Forking command line: /bin/sh -c cd <https://builds.apache.org/job/HBase-0.92/ws/trunk>
&& /home/jenkins/tools/java/jdk1.6.0_20-32/jre/bin/java -enableassertions -Xmx1400m
-jar <https://builds.apache.org/job/HBase-0.92/ws/trunk/target/surefire/surefirebooter3560082054972549722.jar>
<https://builds.apache.org/job/HBase-0.92/ws/trunk/target/surefire/surefire8347285338566421053tmp>
<https://builds.apache.org/job/HBase-0.92/ws/trunk/target/surefire/surefire5018866359877682985tmp>
> Running org.apache.hadoop.hbase.coprocessor.TestRegionServerCoprocessorExceptionWithAbort
> Tests run: 1, Failures: 0, Errors: 0, Skipped: 0, Time elapsed: 28.581 sec
> Forking command line: /bin/sh -c cd <https://builds.apache.org/job/HBase-0.92/ws/trunk>
&& /home/jenkins/tools/java/jdk1.6.0_20-32/jre/bin/java -enableassertions -Xmx1400m
-jar <https://builds.apache.org/job/HBase-0.92/ws/trunk/target/surefire/surefirebooter3593397620869475394.jar>
<https://builds.apache.org/job/HBase-0.92/ws/trunk/target/surefire/surefire9065491602914660649tmp>
<https://builds.apache.org/job/HBase-0.92/ws/trunk/target/surefire/surefire769462532552258876tmp>
> Running org.apache.hadoop.hbase.coprocessor.TestAggregateProtocol
> Tests run: 44, Failures: 0, Errors: 0, Skipped: 0, Time elapsed: 33.06 sec
> Forking command line: /bin/sh -c cd <https://builds.apache.org/job/HBase-0.92/ws/trunk>
&& /home/jenkins/tools/java/jdk1.6.0_20-32/jre/bin/java -enableassertions -Xmx1400m
-jar <https://builds.apache.org/job/HBase-0.92/ws/trunk/target/surefire/surefirebooter6743481060125596963.jar>
<https://builds.apache.org/job/HBase-0.92/ws/trunk/target/surefire/surefire1495193605949304422tmp>
<https://builds.apache.org/job/HBase-0.92/ws/trunk/target/surefire/surefire8240081223181621594tmp>
> Running org.apache.hadoop.hbase.coprocessor.TestMasterCoprocessorExceptionWithRemove
> Tests run: 1, Failures: 0, Errors: 0, Skipped: 0, Time elapsed: 20.589 sec
> Forking command line: /bin/sh -c cd <https://builds.apache.org/job/HBase-0.92/ws/trunk>
&& /home/jenkins/tools/java/jdk1.6.0_20-32/jre/bin/java -enableassertions -Xmx1400m
-jar <https://builds.apache.org/job/HBase-0.92/ws/trunk/target/surefire/surefirebooter3505265978597773355.jar>
<https://builds.apache.org/job/HBase-0.92/ws/trunk/target/surefire/surefire7398655621553323144tmp>
<https://builds.apache.org/job/HBase-0.92/ws/trunk/target/surefire/surefire635918052555580096tmp>
> Running org.apache.hadoop.hbase.coprocessor.TestRegionObserverStacking
> Tests run: 1, Failures: 0, Errors: 0, Skipped: 0, Time elapsed: 0.621 sec
> Forking command line: /bin/sh -c cd <https://builds.apache.org/job/HBase-0.92/ws/trunk>
&& /home/jenkins/tools/java/jdk1.6.0_20-32/jre/bin/java -enableassertions -Xmx1400m
-jar <https://builds.apache.org/job/HBase-0.92/ws/trunk/target/surefire/surefirebooter254780860547605966.jar>
<https://builds.apache.org/job/HBase-0.92/ws/trunk/target/surefire/surefire967068270864737156tmp>
<https://builds.apache.org/job/HBase-0.92/ws/trunk/target/surefire/surefire7349332136856487595tmp>
> Running org.apache.hadoop.hbase.coprocessor.TestClassLoading
> Tests run: 3, Failures: 0, Errors: 0, Skipped: 0, Time elapsed: 28.435 sec
> Forking command line: /bin/sh -c cd <https://builds.apache.org/job/HBase-0.92/ws/trunk>
&& /home/jenkins/tools/java/jdk1.6.0_20-32/jre/bin/java -enableassertions -Xmx1400m
-jar <https://builds.apache.org/job/HBase-0.92/ws/trunk/target/surefire/surefirebooter5397652276298369550.jar>
<https://builds.apache.org/job/HBase-0.92/ws/trunk/target/surefire/surefire5384457928731884577tmp>
<https://builds.apache.org/job/HBase-0.92/ws/trunk/target/surefire/surefire602951257927064125tmp>
> Running org.apache.hadoop.hbase.mapred.TestTableMapReduce
> Tests run: 1, Failures: 0, Errors: 0, Skipped: 0, Time elapsed: 44.071 sec
> Forking command line: /bin/sh -c cd <https://builds.apache.org/job/HBase-0.92/ws/trunk>
&& /home/jenkins/tools/java/jdk1.6.0_20-32/jre/bin/java -enableassertions -Xmx1400m
-jar <https://builds.apache.org/job/HBase-0.92/ws/trunk/target/surefire/surefirebooter4420728058525106937.jar>
<https://builds.apache.org/job/HBase-0.92/ws/trunk/target/surefire/surefire6781149334151703849tmp>
<https://builds.apache.org/job/HBase-0.92/ws/trunk/target/surefire/surefire5729100992331043745tmp>
> Running org.apache.hadoop.hbase.mapred.TestTableInputFormat
> Tests run: 6, Failures: 0, Errors: 0, Skipped: 0, Time elapsed: 19.841 sec
> Forking command line: /bin/sh -c cd <https://builds.apache.org/job/HBase-0.92/ws/trunk>
&& /home/jenkins/tools/java/jdk1.6.0_20-32/jre/bin/java -enableassertions -Xmx1400m
-jar <https://builds.apache.org/job/HBase-0.92/ws/trunk/target/surefire/surefirebooter2139825892420249333.jar>
<https://builds.apache.org/job/HBase-0.92/ws/trunk/target/surefire/surefire3611494574188370040tmp>
<https://builds.apache.org/job/HBase-0.92/ws/trunk/target/surefire/surefire3983074323718340867tmp>
> Running org.apache.hadoop.hbase.TestServerName
> Tests run: 2, Failures: 0, Errors: 0, Skipped: 0, Time elapsed: 0.057 sec
> Forking command line: /bin/sh -c cd <https://builds.apache.org/job/HBase-0.92/ws/trunk>
&& /home/jenkins/tools/java/jdk1.6.0_20-32/jre/bin/java -enableassertions -Xmx1400m
-jar <https://builds.apache.org/job/HBase-0.92/ws/trunk/target/surefire/surefirebooter1562908581047106091.jar>
<https://builds.apache.org/job/HBase-0.92/ws/trunk/target/surefire/surefire8458542896497813689tmp>
<https://builds.apache.org/job/HBase-0.92/ws/trunk/target/surefire/surefire3743388350202233717tmp>
> Running org.apache.hadoop.hbase.master.TestActiveMasterManager
> Tests run: 2, Failures: 0, Errors: 0, Skipped: 0, Time elapsed: 0.737 sec
> Forking command line: /bin/sh -c cd <https://builds.apache.org/job/HBase-0.92/ws/trunk>
&& /home/jenkins/tools/java/jdk1.6.0_20-32/jre/bin/java -enableassertions -Xmx1400m
-jar <https://builds.apache.org/job/HBase-0.92/ws/trunk/target/surefire/surefirebooter8283271659452324458.jar>
<https://builds.apache.org/job/HBase-0.92/ws/trunk/target/surefire/surefire8399159964537286tmp>
<https://builds.apache.org/job/HBase-0.92/ws/trunk/target/surefire/surefire5411508537333092833tmp>
> Running org.apache.hadoop.hbase.master.TestMasterFailover
> Tests run: 4, Failures: 0, Errors: 0, Skipped: 0, Time elapsed: 98.073 sec
> Forking command line: /bin/sh -c cd <https://builds.apache.org/job/HBase-0.92/ws/trunk>
&& /home/jenkins/tools/java/jdk1.6.0_20-32/jre/bin/java -enableassertions -Xmx1400m
-jar <https://builds.apache.org/job/HBase-0.92/ws/trunk/target/surefire/surefirebooter4372371342936443172.jar>
<https://builds.apache.org/job/HBase-0.92/ws/trunk/target/surefire/surefire3261740320956110415tmp>
<https://builds.apache.org/job/HBase-0.92/ws/trunk/target/surefire/surefire3227510435905913103tmp>
> Running org.apache.hadoop.hbase.master.TestMasterRestartAfterDisablingTable
> Tests run: 1, Failures: 0, Errors: 0, Skipped: 0, Time elapsed: 25.406 sec
> Forking command line: /bin/sh -c cd <https://builds.apache.org/job/HBase-0.92/ws/trunk>
&& /home/jenkins/tools/java/jdk1.6.0_20-32/jre/bin/java -enableassertions -Xmx1400m
-jar <https://builds.apache.org/job/HBase-0.92/ws/trunk/target/surefire/surefirebooter5637095963016668069.jar>
<https://builds.apache.org/job/HBase-0.92/ws/trunk/target/surefire/surefire5504789241670446137tmp>
<https://builds.apache.org/job/HBase-0.92/ws/trunk/target/surefire/surefire6576768065252125727tmp>
> Running org.apache.hadoop.hbase.master.TestCatalogJanitor
> Tests run: 3, Failures: 0, Errors: 0, Skipped: 0, Time elapsed: 4.451 sec
> Forking command line: /bin/sh -c cd <https://builds.apache.org/job/HBase-0.92/ws/trunk>
&& /home/jenkins/tools/java/jdk1.6.0_20-32/jre/bin/java -enableassertions -Xmx1400m
-jar <https://builds.apache.org/job/HBase-0.92/ws/trunk/target/surefire/surefirebooter2072136612506800222.jar>
<https://builds.apache.org/job/HBase-0.92/ws/trunk/target/surefire/surefire2690753762977634101tmp>
<https://builds.apache.org/job/HBase-0.92/ws/trunk/target/surefire/surefire8194262804598164675tmp>
> Running org.apache.hadoop.hbase.master.TestRollingRestart
> Tests run: 1, Failures: 0, Errors: 0, Skipped: 0, Time elapsed: 62.414 sec
> Forking command line: /bin/sh -c cd <https://builds.apache.org/job/HBase-0.92/ws/trunk>
&& /home/jenkins/tools/java/jdk1.6.0_20-32/jre/bin/java -enableassertions -Xmx1400m
-jar <https://builds.apache.org/job/HBase-0.92/ws/trunk/target/surefire/surefirebooter5943699443938641770.jar>
<https://builds.apache.org/job/HBase-0.92/ws/trunk/target/surefire/surefire4514980532205647471tmp>
<https://builds.apache.org/job/HBase-0.92/ws/trunk/target/surefire/surefire4718421752096033722tmp>
> Running org.apache.hadoop.hbase.master.TestMasterTransitions
> Tests run: 3, Failures: 0, Errors: 0, Skipped: 3, Time elapsed: 23.577 sec
> Forking command line: /bin/sh -c cd <https://builds.apache.org/job/HBase-0.92/ws/trunk>
&& /home/jenkins/tools/java/jdk1.6.0_20-32/jre/bin/java -enableassertions -Xmx1400m
-jar <https://builds.apache.org/job/HBase-0.92/ws/trunk/target/surefire/surefirebooter7904636860755991710.jar>
<https://builds.apache.org/job/HBase-0.92/ws/trunk/target/surefire/surefire7028822351541664915tmp>
<https://builds.apache.org/job/HBase-0.92/ws/trunk/target/surefire/surefire782528946743809663tmp>
> Running org.apache.hadoop.hbase.master.TestRestartCluster
> Tests run: 2, Failures: 0, Errors: 0, Skipped: 0, Time elapsed: 52.918 sec
> Forking command line: /bin/sh -c cd <https://builds.apache.org/job/HBase-0.92/ws/trunk>
&& /home/jenkins/tools/java/jdk1.6.0_20-32/jre/bin/java -enableassertions -Xmx1400m
-jar <https://builds.apache.org/job/HBase-0.92/ws/trunk/target/surefire/surefirebooter6707351595624572134.jar>
<https://builds.apache.org/job/HBase-0.92/ws/trunk/target/surefire/surefire2126189891543150072tmp>
<https://builds.apache.org/job/HBase-0.92/ws/trunk/target/surefire/surefire3104773438862842898tmp>
> Running org.apache.hadoop.hbase.master.TestMasterStatusServlet
> Tests run: 5, Failures: 0, Errors: 0, Skipped: 0, Time elapsed: 1.019 sec
> Forking command line: /bin/sh -c cd <https://builds.apache.org/job/HBase-0.92/ws/trunk>
&& /home/jenkins/tools/java/jdk1.6.0_20-32/jre/bin/java -enableassertions -Xmx1400m
-jar <https://builds.apache.org/job/HBase-0.92/ws/trunk/target/surefire/surefirebooter2052930378099777473.jar>
<https://builds.apache.org/job/HBase-0.92/ws/trunk/target/surefire/surefire2952599945812223004tmp>
<https://builds.apache.org/job/HBase-0.92/ws/trunk/target/surefire/surefire8831784288148288022tmp>
> Running org.apache.hadoop.hbase.master.TestClockSkewDetection
> Tests run: 1, Failures: 0, Errors: 0, Skipped: 0, Time elapsed: 0.268 sec
> Forking command line: /bin/sh -c cd <https://builds.apache.org/job/HBase-0.92/ws/trunk>
&& /home/jenkins/tools/java/jdk1.6.0_20-32/jre/bin/java -enableassertions -Xmx1400m
-jar <https://builds.apache.org/job/HBase-0.92/ws/trunk/target/surefire/surefirebooter2243338927114609549.jar>
<https://builds.apache.org/job/HBase-0.92/ws/trunk/target/surefire/surefire5945265399920966570tmp>
<https://builds.apache.org/job/HBase-0.92/ws/trunk/target/surefire/surefire1201464959588098854tmp>
> Running org.apache.hadoop.hbase.master.TestDefaultLoadBalancer
> Tests run: 4, Failures: 0, Errors: 0, Skipped: 0, Time elapsed: 1.611 sec
> Forking command line: /bin/sh -c cd <https://builds.apache.org/job/HBase-0.92/ws/trunk>
&& /home/jenkins/tools/java/jdk1.6.0_20-32/jre/bin/java -enableassertions -Xmx1400m
-jar <https://builds.apache.org/job/HBase-0.92/ws/trunk/target/surefire/surefirebooter2985905711022470563.jar>
<https://builds.apache.org/job/HBase-0.92/ws/trunk/target/surefire/surefire3059721211602040531tmp>
<https://builds.apache.org/job/HBase-0.92/ws/trunk/target/surefire/surefire4712395096177143665tmp>
> Running org.apache.hadoop.hbase.master.TestHMasterRPCException
> Tests run: 1, Failures: 0, Errors: 0, Skipped: 0, Time elapsed: 1.068 sec
> Forking command line: /bin/sh -c cd <https://builds.apache.org/job/HBase-0.92/ws/trunk>
&& /home/jenkins/tools/java/jdk1.6.0_20-32/jre/bin/java -enableassertions -Xmx1400m
-jar <https://builds.apache.org/job/HBase-0.92/ws/trunk/target/surefire/surefirebooter6739235244314649934.jar>
<https://builds.apache.org/job/HBase-0.92/ws/trunk/target/surefire/surefire3064547599037079576tmp>
<https://builds.apache.org/job/HBase-0.92/ws/trunk/target/surefire/surefire6711168732088535520tmp>
> Running org.apache.hadoop.hbase.master.TestDistributedLogSplitting
> Tests run: 4, Failures: 0, Errors: 0, Skipped: 0, Time elapsed: 119.087 sec
> Forking command line: /bin/sh -c cd <https://builds.apache.org/job/HBase-0.92/ws/trunk>
&& /home/jenkins/tools/java/jdk1.6.0_20-32/jre/bin/java -enableassertions -Xmx1400m
-jar <https://builds.apache.org/job/HBase-0.92/ws/trunk/target/surefire/surefirebooter8139086402051072966.jar>
<https://builds.apache.org/job/HBase-0.92/ws/trunk/target/surefire/surefire8110543342319525819tmp>
<https://builds.apache.org/job/HBase-0.92/ws/trunk/target/surefire/surefire2620809097753201992tmp>
> Running org.apache.hadoop.hbase.master.TestMaster
> Tests run: 1, Failures: 0, Errors: 0, Skipped: 0, Time elapsed: 78.276 sec
> Forking command line: /bin/sh -c cd <https://builds.apache.org/job/HBase-0.92/ws/trunk>
&& /home/jenkins/tools/java/jdk1.6.0_20-32/jre/bin/java -enableassertions -Xmx1400m
-jar <https://builds.apache.org/job/HBase-0.92/ws/trunk/target/surefire/surefirebooter4062972785282353960.jar>
<https://builds.apache.org/job/HBase-0.92/ws/trunk/target/surefire/surefire3029549294747718225tmp>
<https://builds.apache.org/job/HBase-0.92/ws/trunk/target/surefire/surefire1790166827522492692tmp>
> Running org.apache.hadoop.hbase.master.TestSplitLogManager
> Tests run: 10, Failures: 0, Errors: 0, Skipped: 0, Time elapsed: 14.013 sec
> Forking command line: /bin/sh -c cd <https://builds.apache.org/job/HBase-0.92/ws/trunk>
&& /home/jenkins/tools/java/jdk1.6.0_20-32/jre/bin/java -enableassertions -Xmx1400m
-jar <https://builds.apache.org/job/HBase-0.92/ws/trunk/target/surefire/surefirebooter6351774401081684331.jar>
<https://builds.apache.org/job/HBase-0.92/ws/trunk/target/surefire/surefire6570841713272110043tmp>
<https://builds.apache.org/job/HBase-0.92/ws/trunk/target/surefire/surefire5605884754624095418tmp>
> Running org.apache.hadoop.hbase.master.TestDeadServer
> Tests run: 1, Failures: 0, Errors: 0, Skipped: 0, Time elapsed: 0.059 sec
> Forking command line: /bin/sh -c cd <https://builds.apache.org/job/HBase-0.92/ws/trunk>
&& /home/jenkins/tools/java/jdk1.6.0_20-32/jre/bin/java -enableassertions -Xmx1400m
-jar <https://builds.apache.org/job/HBase-0.92/ws/trunk/target/surefire/surefirebooter2462949987670835960.jar>
<https://builds.apache.org/job/HBase-0.92/ws/trunk/target/surefire/surefire1758866575172633425tmp>
<https://builds.apache.org/job/HBase-0.92/ws/trunk/target/surefire/surefire4483452653509363093tmp>
> Running org.apache.hadoop.hbase.master.TestLogsCleaner
> Tests run: 1, Failures: 0, Errors: 0, Skipped: 0, Time elapsed: 1.402 sec
> Forking command line: /bin/sh -c cd <https://builds.apache.org/job/HBase-0.92/ws/trunk>
&& /home/jenkins/tools/java/jdk1.6.0_20-32/jre/bin/java -enableassertions -Xmx1400m
-jar <https://builds.apache.org/job/HBase-0.92/ws/trunk/target/surefire/surefirebooter4040560094813607864.jar>
<https://builds.apache.org/job/HBase-0.92/ws/trunk/target/surefire/surefire416088455118581901tmp>
<https://builds.apache.org/job/HBase-0.92/ws/trunk/target/surefire/surefire4003362875074255212tmp>
> Running org.apache.hadoop.hbase.master.TestZKBasedOpenCloseRegion
> Tests run: 3, Failures: 0, Errors: 0, Skipped: 0, Time elapsed: 20.245 sec
>
> Results :
>
> Tests in error:
>  testTableAdminAndMetadata(org.apache.hadoop.hbase.avro.TestAvroServer)
>  testFamilyAdminAndMetadata(org.apache.hadoop.hbase.avro.TestAvroServer)
>  testDML(org.apache.hadoop.hbase.avro.TestAvroServer)
>
> Tests run: 1018, Failures: 0, Errors: 3, Skipped: 9
>
> [INFO] ------------------------------------------------------------------------
> [INFO] BUILD FAILURE
> [INFO] ------------------------------------------------------------------------
> [INFO] Total time: 1:53:55.437s
> [INFO] Finished at: Sat Oct 08 05:38:22 UTC 2011
> [INFO] Final Memory: 30M/910M
> [INFO] ------------------------------------------------------------------------
> [ERROR] Failed to execute goal org.apache.maven.plugins:maven-surefire-plugin:2.9:test
(default-test) on project hbase: There are test failures.
> [ERROR]
> [ERROR] Please refer to <https://builds.apache.org/job/HBase-0.92/ws/trunk/target/surefire-reports>
for the individual test results.
> [ERROR] -> [Help 1]
> org.apache.maven.lifecycle.LifecycleExecutionException: Failed to execute goal org.apache.maven.plugins:maven-surefire-plugin:2.9:test
(default-test) on project hbase: There are test failures.
>
> Please refer to <https://builds.apache.org/job/HBase-0.92/ws/trunk/target/surefire-reports>
for the individual test results.
>        at org.apache.maven.lifecycle.internal.MojoExecutor.execute(MojoExecutor.java:213)
>        at org.apache.maven.lifecycle.internal.MojoExecutor.execute(MojoExecutor.java:153)
>        at org.apache.maven.lifecycle.internal.MojoExecutor.execute(MojoExecutor.java:145)
>        at org.apache.maven.lifecycle.internal.MojoExecutor.executeForkedExecutions(MojoExecutor.java:365)
>        at org.apache.maven.lifecycle.internal.MojoExecutor.execute(MojoExecutor.java:199)
>        at org.apache.maven.lifecycle.internal.MojoExecutor.execute(MojoExecutor.java:153)
>        at org.apache.maven.lifecycle.internal.MojoExecutor.execute(MojoExecutor.java:145)
>        at org.apache.maven.lifecycle.internal.LifecycleModuleBuilder.buildProject(LifecycleModuleBuilder.java:84)
>        at org.apache.maven.lifecycle.internal.LifecycleModuleBuilder.buildProject(LifecycleModuleBuilder.java:59)
>        at org.apache.maven.lifecycle.internal.LifecycleStarter.singleThreadedBuild(LifecycleStarter.java:183)
>        at org.apache.maven.lifecycle.internal.LifecycleStarter.execute(LifecycleStarter.java:161)
>        at org.apache.maven.DefaultMaven.doExecute(DefaultMaven.java:319)
>        at org.apache.maven.DefaultMaven.execute(DefaultMaven.java:156)
>        at org.apache.maven.cli.MavenCli.execute(MavenCli.java:537)
>        at org.apache.maven.cli.MavenCli.doMain(MavenCli.java:196)
>        at org.apache.maven.cli.MavenCli.main(MavenCli.java:141)
>        at sun.reflect.NativeMethodAccessorImpl.invoke0(Native Method)
>        at sun.reflect.NativeMethodAccessorImpl.invoke(NativeMethodAccessorImpl.java:39)
>        at sun.reflect.DelegatingMethodAccessorImpl.invoke(DelegatingMethodAccessorImpl.java:25)
>        at java.lang.reflect.Method.invoke(Method.java:597)
>        at org.codehaus.plexus.classworlds.launcher.Launcher.launchEnhanced(Launcher.java:290)
>        at org.codehaus.plexus.classworlds.launcher.Launcher.launch(Launcher.java:230)
>        at org.codehaus.plexus.classworlds.launcher.Launcher.mainWithExitCode(Launcher.java:409)
>        at org.codehaus.plexus.classworlds.launcher.Launcher.main(Launcher.java:352)
> Caused by: org.apache.maven.plugin.MojoFailureException: There are test failures.
>
> Please refer to <https://builds.apache.org/job/HBase-0.92/ws/trunk/target/surefire-reports>
for the individual test results.
>        at org.apache.maven.plugin.surefire.SurefireHelper.reportExecution(SurefireHelper.java:87)
>        at org.apache.maven.plugin.surefire.SurefirePlugin.writeSummary(SurefirePlugin.java:631)
>        at org.apache.maven.plugin.surefire.SurefirePlugin.handleSummary(SurefirePlugin.java:605)
>        at org.apache.maven.plugin.surefire.AbstractSurefireMojo.executeAfterPreconditionsChecked(AbstractSurefireMojo.java:136)
>        at org.apache.maven.plugin.surefire.AbstractSurefireMojo.execute(AbstractSurefireMojo.java:97)
>        at org.apache.maven.plugin.DefaultBuildPluginManager.executeMojo(DefaultBuildPluginManager.java:101)
>        at org.apache.maven.lifecycle.internal.MojoExecutor.execute(MojoExecutor.java:209)
>        ... 23 more
> [ERROR]
> [ERROR]
> [ERROR] For more information about the errors and possible solutions, please read the
following articles:
> [ERROR] [Help 1] http://cwiki.apache.org/confluence/display/MAVEN/MojoFailureException
> Build step 'Invoke top-level Maven targets' marked build as failure
> [locks-and-latches] Releasing all the locks
> [locks-and-latches] All the locks released
> Archiving artifacts
> Recording test results
>
>

Mime
View raw message