hbase-dev mailing list archives

Site index · List index
Message view « Date » · « Thread »
Top « Date » · « Thread »
From Stack <st...@duboce.net>
Subject Re: Build failed in Jenkins: hbase-0.90 #324
Date Fri, 14 Oct 2011 06:52:45 GMT
Do you think this fail because of your change Gary?

Good on you,
St.Ack

On Fri, Oct 14, 2011 at 6:06 AM, Apache Jenkins Server
<jenkins@builds.apache.org> wrote:
> See <https://builds.apache.org/job/hbase-0.90/324/changes>
>
> Changes:
>
> [Gary Helmling] HBASE-4282  RegionServer should abort when WAL close fails with unflushed
edits
>
> ------------------------------------------
> [...truncated 1218 lines...]
> Running org.apache.hadoop.hbase.mapred.TestTableInputFormat
> Tests run: 6, Failures: 0, Errors: 0, Skipped: 0, Time elapsed: 20.817 sec
> Running org.apache.hadoop.hbase.mapreduce.TestHFileOutputFormat
> Tests run: 6, Failures: 0, Errors: 0, Skipped: 0, Time elapsed: 129.784 sec
> Running org.apache.hadoop.hbase.master.TestMasterRestartAfterDisablingTable
> Tests run: 1, Failures: 0, Errors: 0, Skipped: 0, Time elapsed: 25.575 sec
> Running org.apache.hadoop.hbase.regionserver.TestFSErrorsExposed
> Tests run: 3, Failures: 0, Errors: 0, Skipped: 0, Time elapsed: 29.235 sec
> Running org.apache.hadoop.hbase.client.replication.TestReplicationAdmin
> Tests run: 1, Failures: 0, Errors: 0, Skipped: 0, Time elapsed: 0.606 sec
> Running org.apache.hadoop.hbase.regionserver.TestScanDeleteTracker
> Tests run: 6, Failures: 0, Errors: 0, Skipped: 0, Time elapsed: 0.147 sec
> Running org.apache.hadoop.hbase.client.TestMetaScanner
> Tests run: 1, Failures: 0, Errors: 0, Skipped: 0, Time elapsed: 17.631 sec
> Running org.apache.hadoop.hbase.metrics.TestMetricsMBeanBase
> Tests run: 2, Failures: 0, Errors: 0, Skipped: 0, Time elapsed: 0.06 sec
> Running org.apache.hadoop.hbase.TestRegionRebalancing
> Tests run: 1, Failures: 0, Errors: 0, Skipped: 0, Time elapsed: 80.979 sec
> Running org.apache.hadoop.hbase.filter.TestSingleColumnValueExcludeFilter
> Tests run: 1, Failures: 0, Errors: 0, Skipped: 0, Time elapsed: 0.016 sec
> Running org.apache.hadoop.hbase.filter.TestInclusiveStopFilter
> Tests run: 2, Failures: 0, Errors: 0, Skipped: 0, Time elapsed: 0.017 sec
> Running org.apache.hadoop.hbase.rest.TestTableResource
> Tests run: 8, Failures: 0, Errors: 0, Skipped: 0, Time elapsed: 54.267 sec
> Running org.apache.hadoop.hbase.mapreduce.TestTableSplit
> Tests run: 1, Failures: 0, Errors: 0, Skipped: 0, Time elapsed: 0.016 sec
> Running org.apache.hadoop.hbase.TestHBaseTestingUtility
> Tests run: 5, Failures: 0, Errors: 0, Skipped: 0, Time elapsed: 55.263 sec
> Running org.apache.hadoop.hbase.mapreduce.TestLoadIncrementalHFiles
> Tests run: 5, Failures: 0, Errors: 0, Skipped: 0, Time elapsed: 64.258 sec
> Running org.apache.hadoop.hbase.regionserver.wal.TestWALReplay
> Tests run: 4, Failures: 0, Errors: 0, Skipped: 0, Time elapsed: 27.395 sec
> Running org.apache.hadoop.hbase.rest.TestSchemaResource
> Tests run: 2, Failures: 0, Errors: 0, Skipped: 0, Time elapsed: 27.299 sec
> Running org.apache.hadoop.hbase.regionserver.TestKeyValueScanFixture
> Tests run: 1, Failures: 0, Errors: 0, Skipped: 0, Time elapsed: 0.018 sec
> Running org.apache.hadoop.hbase.rest.model.TestTableListModel
> Tests run: 3, Failures: 0, Errors: 0, Skipped: 0, Time elapsed: 0.134 sec
> Running org.apache.hadoop.hbase.rest.model.TestColumnSchemaModel
> Tests run: 2, Failures: 0, Errors: 0, Skipped: 0, Time elapsed: 0.03 sec
> Running org.apache.hadoop.hbase.regionserver.TestStoreFile
> Tests run: 7, Failures: 0, Errors: 0, Skipped: 0, Time elapsed: 64.266 sec
> Running org.apache.hadoop.hbase.zookeeper.TestZooKeeperNodeTracker
> Tests run: 2, Failures: 0, Errors: 0, Skipped: 0, Time elapsed: 0.497 sec
> Running org.apache.hadoop.hbase.regionserver.wal.TestHLogMethods
> Tests run: 3, Failures: 0, Errors: 0, Skipped: 0, Time elapsed: 0.379 sec
> Running org.apache.hadoop.hbase.rest.model.TestScannerModel
> Tests run: 3, Failures: 0, Errors: 0, Skipped: 0, Time elapsed: 0.126 sec
> Running org.apache.hadoop.hbase.rest.TestVersionResource
> Tests run: 7, Failures: 0, Errors: 0, Skipped: 0, Time elapsed: 20.451 sec
> Running org.apache.hadoop.hbase.filter.TestFilter
> Tests run: 18, Failures: 0, Errors: 0, Skipped: 0, Time elapsed: 3.578 sec
> Running org.apache.hadoop.hbase.regionserver.TestWideScanner
> Tests run: 1, Failures: 0, Errors: 0, Skipped: 0, Time elapsed: 45.654 sec
> Running org.apache.hadoop.hbase.regionserver.TestSplitTransaction
> Tests run: 6, Failures: 0, Errors: 0, Skipped: 0, Time elapsed: 3.287 sec
> Running org.apache.hadoop.hbase.replication.regionserver.TestReplicationSink
> Tests run: 5, Failures: 0, Errors: 0, Skipped: 0, Time elapsed: 40.006 sec
> Running org.apache.hadoop.hbase.regionserver.TestGetClosestAtOrBefore
> Tests run: 3, Failures: 0, Errors: 0, Skipped: 0, Time elapsed: 15.992 sec
> Running org.apache.hadoop.hbase.regionserver.TestReadWriteConsistencyControl
> Tests run: 1, Failures: 0, Errors: 0, Skipped: 0, Time elapsed: 10.023 sec
> Running org.apache.hadoop.hbase.util.TestMergeTable
> Tests run: 1, Failures: 0, Errors: 0, Skipped: 0, Time elapsed: 62.326 sec
> Running org.apache.hadoop.hbase.rest.model.TestVersionModel
> Tests run: 3, Failures: 0, Errors: 0, Skipped: 0, Time elapsed: 0.125 sec
> Running org.apache.hadoop.hbase.rest.model.TestCellSetModel
> Tests run: 3, Failures: 0, Errors: 0, Skipped: 0, Time elapsed: 0.136 sec
> Running org.apache.hadoop.hbase.rest.client.TestRemoteTable
> Tests run: 3, Failures: 0, Errors: 0, Skipped: 0, Time elapsed: 20.364 sec
> Running org.apache.hadoop.hbase.rest.model.TestStorageClusterStatusModel
> Tests run: 3, Failures: 0, Errors: 0, Skipped: 0, Time elapsed: 0.132 sec
> Running org.apache.hadoop.hbase.avro.TestAvroServer
> Tests run: 3, Failures: 0, Errors: 0, Skipped: 0, Time elapsed: 31.434 sec
> Running org.apache.hadoop.hbase.TestFullLogReconstruction
> Tests run: 1, Failures: 0, Errors: 0, Skipped: 0, Time elapsed: 56.792 sec
> Running org.apache.hadoop.hbase.TestSerialization
> Tests run: 19, Failures: 0, Errors: 0, Skipped: 0, Time elapsed: 0.059 sec
> Running org.apache.hadoop.hbase.regionserver.TestKeyValueHeap
> Tests run: 3, Failures: 0, Errors: 0, Skipped: 0, Time elapsed: 0.091 sec
> Running org.apache.hadoop.hbase.regionserver.TestStoreScanner
> Tests run: 14, Failures: 0, Errors: 0, Skipped: 0, Time elapsed: 0.031 sec
> Running org.apache.hadoop.hbase.TestHMsg
> Tests run: 2, Failures: 0, Errors: 0, Skipped: 0, Time elapsed: 0.022 sec
> Running org.apache.hadoop.hbase.io.hfile.TestReseekTo
> Tests run: 1, Failures: 0, Errors: 0, Skipped: 0, Time elapsed: 0.209 sec
> Running org.apache.hadoop.hbase.regionserver.TestHRegionInfo
> Tests run: 2, Failures: 0, Errors: 0, Skipped: 0, Time elapsed: 0.017 sec
> Running org.apache.hadoop.hbase.util.TestIncrementingEnvironmentEdge
> Tests run: 1, Failures: 0, Errors: 0, Skipped: 0, Time elapsed: 0.016 sec
> Running org.apache.hadoop.hbase.util.TestKeying
> Tests run: 1, Failures: 0, Errors: 0, Skipped: 0, Time elapsed: 0.016 sec
> Running org.apache.hadoop.hbase.regionserver.TestScanner
> Tests run: 6, Failures: 0, Errors: 0, Skipped: 0, Time elapsed: 79.638 sec
> Running org.apache.hadoop.hbase.util.TestHBaseFsck
> Tests run: 4, Failures: 0, Errors: 0, Skipped: 0, Time elapsed: 37.951 sec
> Running org.apache.hadoop.hbase.master.TestRestartCluster
> Tests run: 2, Failures: 0, Errors: 0, Skipped: 0, Time elapsed: 48.893 sec
> Running org.apache.hadoop.hbase.client.TestShell
> Tests run: 1, Failures: 0, Errors: 0, Skipped: 0, Time elapsed: 265.298 sec
> Running org.apache.hadoop.hbase.rest.model.TestTableInfoModel
> Tests run: 3, Failures: 0, Errors: 0, Skipped: 0, Time elapsed: 0.132 sec
> Running org.apache.hadoop.hbase.TestInfoServers
> Tests run: 1, Failures: 0, Errors: 0, Skipped: 0, Time elapsed: 32.99 sec
> Running org.apache.hadoop.hbase.master.TestLogsCleaner
> Tests run: 1, Failures: 0, Errors: 0, Skipped: 0, Time elapsed: 1.356 sec
> Running org.apache.hadoop.hbase.regionserver.TestMasterAddressManager
> Tests run: 1, Failures: 0, Errors: 0, Skipped: 0, Time elapsed: 0.36 sec
> Running org.apache.hadoop.hbase.catalog.TestCatalogTrackerOnCluster
> Tests run: 1, Failures: 0, Errors: 0, Skipped: 0, Time elapsed: 143.344 sec
> Running org.apache.hadoop.hbase.regionserver.TestQueryMatcher
> Tests run: 4, Failures: 0, Errors: 0, Skipped: 0, Time elapsed: 0.101 sec
> Running org.apache.hadoop.hbase.zookeeper.TestZKTable
> Tests run: 1, Failures: 0, Errors: 0, Skipped: 0, Time elapsed: 0.308 sec
> Running org.apache.hadoop.hbase.client.TestAdmin
> Tests run: 17, Failures: 0, Errors: 0, Skipped: 0, Time elapsed: 282.448 sec
> Running org.apache.hadoop.hbase.regionserver.TestPriorityCompactionQueue
> Tests run: 1, Failures: 0, Errors: 0, Skipped: 0, Time elapsed: 1.074 sec
> Running org.apache.hadoop.hbase.util.TestMergeTool
> Tests run: 1, Failures: 0, Errors: 0, Skipped: 0, Time elapsed: 44.73 sec
> Running org.apache.hadoop.hbase.TestAcidGuarantees
> Tests run: 3, Failures: 0, Errors: 0, Skipped: 3, Time elapsed: 0.015 sec
> Running org.apache.hadoop.hbase.util.TestBase64
> Tests run: 1, Failures: 0, Errors: 0, Skipped: 0, Time elapsed: 0.018 sec
> Running org.apache.hadoop.hbase.regionserver.TestMemStore
> Tests run: 21, Failures: 0, Errors: 0, Skipped: 0, Time elapsed: 47.464 sec
> Running org.apache.hadoop.hbase.rest.TestScannerResource
> Tests run: 5, Failures: 0, Errors: 0, Skipped: 0, Time elapsed: 55.644 sec
> Running org.apache.hadoop.hbase.io.hfile.TestLruBlockCache
> Tests run: 7, Failures: 0, Errors: 0, Skipped: 0, Time elapsed: 1.053 sec
> Running org.apache.hadoop.hbase.master.TestDeadServer
> Tests run: 1, Failures: 0, Errors: 0, Skipped: 0, Time elapsed: 0.018 sec
> Running org.apache.hadoop.hbase.rest.TestGzipFilter
> Tests run: 3, Failures: 0, Errors: 0, Skipped: 0, Time elapsed: 19.218 sec
> Running org.apache.hadoop.hbase.mapreduce.TestTableMapReduce
> Tests run: 2, Failures: 0, Errors: 0, Skipped: 0, Time elapsed: 96.63 sec
> Running org.apache.hadoop.hbase.TestKeyValue
> Tests run: 11, Failures: 0, Errors: 0, Skipped: 0, Time elapsed: 0.025 sec
> Running org.apache.hadoop.hbase.client.TestMultiParallel
> Tests run: 10, Failures: 0, Errors: 0, Skipped: 0, Time elapsed: 29.808 sec
> Running org.apache.hadoop.hbase.master.TestMaster
> Tests run: 1, Failures: 0, Errors: 0, Skipped: 0, Time elapsed: 76.227 sec
> Running org.apache.hadoop.hbase.master.TestRollingRestart
> Tests run: 1, Failures: 0, Errors: 0, Skipped: 0, Time elapsed: 68.575 sec
> Running org.apache.hadoop.hbase.client.TestResult
> Tests run: 2, Failures: 0, Errors: 0, Skipped: 0, Time elapsed: 0.038 sec
> Running org.apache.hadoop.hbase.client.TestHTablePool
> Tests run: 5, Failures: 0, Errors: 0, Skipped: 0, Time elapsed: 29.333 sec
> Running org.apache.hadoop.hbase.master.TestOpenedRegionHandler
> Tests run: 2, Failures: 0, Errors: 0, Skipped: 0, Time elapsed: 20.507 sec
> Running org.apache.hadoop.hbase.rest.model.TestTableSchemaModel
> Tests run: 3, Failures: 0, Errors: 0, Skipped: 0, Time elapsed: 0.132 sec
> Running org.apache.hadoop.hbase.util.TestByteBloomFilter
> Tests run: 3, Failures: 0, Errors: 0, Skipped: 0, Time elapsed: 1.574 sec
> Running org.apache.hadoop.hbase.filter.TestFilterList
> Tests run: 4, Failures: 0, Errors: 0, Skipped: 0, Time elapsed: 0.038 sec
> Running org.apache.hadoop.hbase.mapreduce.TestTableInputFormatScan
> Tests run: 11, Failures: 0, Errors: 0, Skipped: 0, Time elapsed: 319.561 sec
> Running org.apache.hadoop.hbase.regionserver.TestHRegion
> Tests run: 54, Failures: 0, Errors: 0, Skipped: 0, Time elapsed: 30.783 sec
> Running org.apache.hadoop.hbase.master.TestMasterFailover
> Tests run: 4, Failures: 0, Errors: 0, Skipped: 0, Time elapsed: 83.024 sec
> Running org.apache.hadoop.hbase.rest.model.TestTableRegionModel
> Tests run: 4, Failures: 0, Errors: 0, Skipped: 0, Time elapsed: 0.032 sec
> Running org.apache.hadoop.hbase.client.TestTimestampsFilter
> Tests run: 3, Failures: 0, Errors: 0, Skipped: 0, Time elapsed: 39.893 sec
> Running org.apache.hadoop.hbase.master.TestLoadBalancer
> Tests run: 5, Failures: 0, Errors: 0, Skipped: 0, Time elapsed: 2.224 sec
> Running org.apache.hadoop.hbase.util.TestRootPath
> Tests run: 1, Failures: 0, Errors: 0, Skipped: 0, Time elapsed: 0.02 sec
> Running org.apache.hadoop.hbase.client.TestScannerTimeout
> Tests run: 4, Failures: 0, Errors: 0, Skipped: 0, Time elapsed: 61.969 sec
> Running org.apache.hadoop.hbase.regionserver.wal.TestWALObserver
> Tests run: 1, Failures: 0, Errors: 0, Skipped: 0, Time elapsed: 0.331 sec
> Running org.apache.hadoop.hbase.mapred.TestTableMapReduce
> Tests run: 1, Failures: 0, Errors: 0, Skipped: 0, Time elapsed: 58.938 sec
> Running org.apache.hadoop.hbase.master.TestActiveMasterManager
> Tests run: 2, Failures: 0, Errors: 0, Skipped: 0, Time elapsed: 0.426 sec
> Running org.apache.hadoop.hbase.replication.regionserver.TestReplicationSourceManager
> Tests run: 1, Failures: 0, Errors: 0, Skipped: 0, Time elapsed: 0.88 sec
> Running org.apache.hadoop.hbase.util.TestBytes
> Tests run: 10, Failures: 0, Errors: 0, Skipped: 0, Time elapsed: 0.022 sec
> Running org.apache.hadoop.hbase.util.TestCompressionTest
> Tests run: 1, Failures: 0, Errors: 0, Skipped: 0, Time elapsed: 0.025 sec
> Running org.apache.hadoop.hbase.client.TestGetRowVersions
> Tests run: 1, Failures: 0, Errors: 0, Skipped: 0, Time elapsed: 30.568 sec
> Running org.apache.hadoop.hbase.filter.TestDependentColumnFilter
> Tests run: 2, Failures: 0, Errors: 0, Skipped: 0, Time elapsed: 0.362 sec
> Running org.apache.hadoop.hbase.rest.model.TestCellModel
> Tests run: 3, Failures: 0, Errors: 0, Skipped: 0, Time elapsed: 0.129 sec
> Running org.apache.hadoop.hbase.master.TestCatalogJanitor
> Tests run: 2, Failures: 0, Errors: 0, Skipped: 0, Time elapsed: 0.501 sec
> Running org.apache.hadoop.hbase.catalog.TestCatalogTracker
> Tests run: 8, Failures: 0, Errors: 0, Skipped: 0, Time elapsed: 2.884 sec
> Running org.apache.hadoop.hbase.replication.TestReplicationSource
> Tests run: 1, Failures: 0, Errors: 0, Skipped: 0, Time elapsed: 17.75 sec
> Running org.apache.hadoop.hbase.rest.TestRowResource
> Tests run: 11, Failures: 0, Errors: 0, Skipped: 0, Time elapsed: 20.444 sec
> Running org.apache.hadoop.hbase.util.TestRegionSplitCalculator
> Tests run: 14, Failures: 0, Errors: 0, Skipped: 0, Time elapsed: 0.06 sec
> Running org.apache.hadoop.hbase.io.hfile.TestHFile
> Tests run: 7, Failures: 0, Errors: 0, Skipped: 0, Time elapsed: 0.328 sec
> Running org.apache.hadoop.hbase.catalog.TestMetaReaderEditor
> Tests run: 4, Failures: 0, Errors: 0, Skipped: 0, Time elapsed: 23.227 sec
> Running org.apache.hadoop.hbase.mapreduce.TestImportTsv
> Tests run: 7, Failures: 0, Errors: 0, Skipped: 0, Time elapsed: 25.559 sec
> Running org.apache.hadoop.hbase.util.TestHBaseFsckComparator
> Tests run: 7, Failures: 0, Errors: 0, Skipped: 0, Time elapsed: 0.161 sec
> Running org.apache.hadoop.hbase.rest.client.TestRemoteAdmin
> Tests run: 2, Failures: 0, Errors: 0, Skipped: 0, Time elapsed: 35.575 sec
> Running org.apache.hadoop.hbase.regionserver.wal.TestHLog
> Tests run: 8, Failures: 0, Errors: 0, Skipped: 0, Time elapsed: 93.99 sec
> Running org.apache.hadoop.hbase.client.TestTimestamp
> Tests run: 1, Failures: 0, Errors: 0, Skipped: 0, Time elapsed: 15.669 sec
> Running org.apache.hadoop.hbase.TestScanMultipleVersions
> Tests run: 1, Failures: 0, Errors: 0, Skipped: 0, Time elapsed: 30.518 sec
> Running org.apache.hadoop.hbase.rest.model.TestStorageClusterVersionModel
> Tests run: 2, Failures: 0, Errors: 0, Skipped: 0, Time elapsed: 0.03 sec
> Running org.apache.hadoop.hbase.client.TestHCM
> Tests run: 1, Failures: 0, Errors: 0, Skipped: 0, Time elapsed: 16.275 sec
>
> Results :
>
> Tests in error:
>
> Tests run: 681, Failures: 0, Errors: 1, Skipped: 9
>
> [INFO] ------------------------------------------------------------------------
> [INFO] BUILD FAILURE
> [INFO] ------------------------------------------------------------------------
> [INFO] Total time: 1:39:34.561s
> [INFO] Finished at: Fri Oct 14 06:05:40 UTC 2011
> [INFO] Final Memory: 31M/367M
> [INFO] ------------------------------------------------------------------------
> [ERROR] Failed to execute goal org.apache.maven.plugins:maven-surefire-plugin:2.4.3:test
(default-test) on project hbase: There are test failures.
> [ERROR]
> [ERROR] Please refer to <https://builds.apache.org/job/hbase-0.90/ws/trunk/target/surefire-reports>
for the individual test results.
> [ERROR] -> [Help 1]
> [ERROR]
> [ERROR] To see the full stack trace of the errors, re-run Maven with the -e switch.
> [ERROR] Re-run Maven using the -X switch to enable full debug logging.
> [ERROR]
> [ERROR] For more information about the errors and possible solutions, please read the
following articles:
> [ERROR] [Help 1] http://cwiki.apache.org/confluence/display/MAVEN/MojoFailureException
> Build step 'Invoke top-level Maven targets' marked build as failure
> [locks-and-latches] Releasing all the locks
> [locks-and-latches] All the locks released
> Archiving artifacts
> Recording test results
>
>

Mime
View raw message