hbase-dev mailing list archives

Site index · List index
Message view « Date » · « Thread »
Top « Date » · « Thread »
From Stack <st...@duboce.net>
Subject Re: Build failed in Jenkins: HBase-0.92 #64
Date Fri, 14 Oct 2011 06:57:54 GMT
The cache on write change seems to have caused the TestFromClientSide
test to break Jon.  You see that on your end?

I see below when I run locally too:

Failed tests:
testCacheOnWriteEvictOnClose(org.apache.hadoop.hbase.client.TestFromClientSide):
expected:<68> but was:<67>

St.Ack

On Fri, Oct 14, 2011 at 3:03 AM, Apache Jenkins Server
<jenkins@builds.apache.org> wrote:
> See <https://builds.apache.org/job/HBase-0.92/64/changes>
>
> Changes:
>
> [Gary Helmling] HBASE-4282  RegionServer should abort when WAL close fails with unflushed
edits
>
> [nspiegelberg] HBASE-4568  Make zk dump jsp response faster
>
> [stack] HBASE-3446 ProcessServerShutdown fails if META moves, orphaning lots of regions
>
> [stack] HBASE-3446 ProcessServerShutdown fails if META moves, orphaning lots of regions
>
> ------------------------------------------
> [...truncated 6134 lines...]
> Tests run: 3, Failures: 0, Errors: 0, Skipped: 0, Time elapsed: 24.761 sec
> Forking command line: /bin/sh -c cd <https://builds.apache.org/job/HBase-0.92/ws/trunk>
&& /home/jenkins/tools/java/jdk1.6.0_20-32/jre/bin/java -enableassertions -Xmx1400m
-jar <https://builds.apache.org/job/HBase-0.92/ws/trunk/target/surefire/surefirebooter1175344002372424365.jar>
<https://builds.apache.org/job/HBase-0.92/ws/trunk/target/surefire/surefire8420854538336091138tmp>
<https://builds.apache.org/job/HBase-0.92/ws/trunk/target/surefire/surefire5325186347514141443tmp>
> Running org.apache.hadoop.hbase.rest.TestMultiRowResource
> Tests run: 3, Failures: 0, Errors: 0, Skipped: 0, Time elapsed: 21.008 sec
> Forking command line: /bin/sh -c cd <https://builds.apache.org/job/HBase-0.92/ws/trunk>
&& /home/jenkins/tools/java/jdk1.6.0_20-32/jre/bin/java -enableassertions -Xmx1400m
-jar <https://builds.apache.org/job/HBase-0.92/ws/trunk/target/surefire/surefirebooter7829579837296809626.jar>
<https://builds.apache.org/job/HBase-0.92/ws/trunk/target/surefire/surefire7478026906346401594tmp>
<https://builds.apache.org/job/HBase-0.92/ws/trunk/target/surefire/surefire8404115373700120478tmp>
> Running org.apache.hadoop.hbase.rest.TestScannersWithFilters
> Tests run: 10, Failures: 0, Errors: 0, Skipped: 0, Time elapsed: 21.977 sec
> Forking command line: /bin/sh -c cd <https://builds.apache.org/job/HBase-0.92/ws/trunk>
&& /home/jenkins/tools/java/jdk1.6.0_20-32/jre/bin/java -enableassertions -Xmx1400m
-jar <https://builds.apache.org/job/HBase-0.92/ws/trunk/target/surefire/surefirebooter4301488714188985966.jar>
<https://builds.apache.org/job/HBase-0.92/ws/trunk/target/surefire/surefire3789955454601471765tmp>
<https://builds.apache.org/job/HBase-0.92/ws/trunk/target/surefire/surefire1930866822607143705tmp>
> Running org.apache.hadoop.hbase.rest.TestRowResource
> Tests run: 11, Failures: 0, Errors: 0, Skipped: 0, Time elapsed: 23.027 sec
> Forking command line: /bin/sh -c cd <https://builds.apache.org/job/HBase-0.92/ws/trunk>
&& /home/jenkins/tools/java/jdk1.6.0_20-32/jre/bin/java -enableassertions -Xmx1400m
-jar <https://builds.apache.org/job/HBase-0.92/ws/trunk/target/surefire/surefirebooter3887172265265009115.jar>
<https://builds.apache.org/job/HBase-0.92/ws/trunk/target/surefire/surefire7010584110381873642tmp>
<https://builds.apache.org/job/HBase-0.92/ws/trunk/target/surefire/surefire941506260393922855tmp>
> Running org.apache.hadoop.hbase.rest.model.TestCellModel
> Tests run: 3, Failures: 0, Errors: 0, Skipped: 0, Time elapsed: 0.382 sec
> Forking command line: /bin/sh -c cd <https://builds.apache.org/job/HBase-0.92/ws/trunk>
&& /home/jenkins/tools/java/jdk1.6.0_20-32/jre/bin/java -enableassertions -Xmx1400m
-jar <https://builds.apache.org/job/HBase-0.92/ws/trunk/target/surefire/surefirebooter5372382450837710472.jar>
<https://builds.apache.org/job/HBase-0.92/ws/trunk/target/surefire/surefire2471496232450961516tmp>
<https://builds.apache.org/job/HBase-0.92/ws/trunk/target/surefire/surefire734928638324560379tmp>
> Running org.apache.hadoop.hbase.rest.model.TestCellSetModel
> Tests run: 3, Failures: 0, Errors: 0, Skipped: 0, Time elapsed: 0.412 sec
> Forking command line: /bin/sh -c cd <https://builds.apache.org/job/HBase-0.92/ws/trunk>
&& /home/jenkins/tools/java/jdk1.6.0_20-32/jre/bin/java -enableassertions -Xmx1400m
-jar <https://builds.apache.org/job/HBase-0.92/ws/trunk/target/surefire/surefirebooter5296473141451431139.jar>
<https://builds.apache.org/job/HBase-0.92/ws/trunk/target/surefire/surefire2277992291343044394tmp>
<https://builds.apache.org/job/HBase-0.92/ws/trunk/target/surefire/surefire5473886261445442487tmp>
> Running org.apache.hadoop.hbase.rest.model.TestTableListModel
> Tests run: 3, Failures: 0, Errors: 0, Skipped: 0, Time elapsed: 0.394 sec
> Forking command line: /bin/sh -c cd <https://builds.apache.org/job/HBase-0.92/ws/trunk>
&& /home/jenkins/tools/java/jdk1.6.0_20-32/jre/bin/java -enableassertions -Xmx1400m
-jar <https://builds.apache.org/job/HBase-0.92/ws/trunk/target/surefire/surefirebooter4582599561125323519.jar>
<https://builds.apache.org/job/HBase-0.92/ws/trunk/target/surefire/surefire3799256512738731941tmp>
<https://builds.apache.org/job/HBase-0.92/ws/trunk/target/surefire/surefire4420901753980972046tmp>
> Running org.apache.hadoop.hbase.rest.model.TestVersionModel
> Tests run: 3, Failures: 0, Errors: 0, Skipped: 0, Time elapsed: 0.373 sec
> Forking command line: /bin/sh -c cd <https://builds.apache.org/job/HBase-0.92/ws/trunk>
&& /home/jenkins/tools/java/jdk1.6.0_20-32/jre/bin/java -enableassertions -Xmx1400m
-jar <https://builds.apache.org/job/HBase-0.92/ws/trunk/target/surefire/surefirebooter8440653206192914585.jar>
<https://builds.apache.org/job/HBase-0.92/ws/trunk/target/surefire/surefire7092067574065437107tmp>
<https://builds.apache.org/job/HBase-0.92/ws/trunk/target/surefire/surefire8750736186959674579tmp>
> Running org.apache.hadoop.hbase.rest.model.TestColumnSchemaModel
> Tests run: 2, Failures: 0, Errors: 0, Skipped: 0, Time elapsed: 0.28 sec
> Forking command line: /bin/sh -c cd <https://builds.apache.org/job/HBase-0.92/ws/trunk>
&& /home/jenkins/tools/java/jdk1.6.0_20-32/jre/bin/java -enableassertions -Xmx1400m
-jar <https://builds.apache.org/job/HBase-0.92/ws/trunk/target/surefire/surefirebooter2193233248737221313.jar>
<https://builds.apache.org/job/HBase-0.92/ws/trunk/target/surefire/surefire1509091664389440942tmp>
<https://builds.apache.org/job/HBase-0.92/ws/trunk/target/surefire/surefire1420742413716556823tmp>
> Running org.apache.hadoop.hbase.rest.model.TestTableInfoModel
> Tests run: 3, Failures: 0, Errors: 0, Skipped: 0, Time elapsed: 0.407 sec
> Forking command line: /bin/sh -c cd <https://builds.apache.org/job/HBase-0.92/ws/trunk>
&& /home/jenkins/tools/java/jdk1.6.0_20-32/jre/bin/java -enableassertions -Xmx1400m
-jar <https://builds.apache.org/job/HBase-0.92/ws/trunk/target/surefire/surefirebooter1838331091785113971.jar>
<https://builds.apache.org/job/HBase-0.92/ws/trunk/target/surefire/surefire7769965871808604807tmp>
<https://builds.apache.org/job/HBase-0.92/ws/trunk/target/surefire/surefire50911329781452732tmp>
> Running org.apache.hadoop.hbase.rest.model.TestRowModel
> Tests run: 2, Failures: 0, Errors: 0, Skipped: 0, Time elapsed: 0.374 sec
> Forking command line: /bin/sh -c cd <https://builds.apache.org/job/HBase-0.92/ws/trunk>
&& /home/jenkins/tools/java/jdk1.6.0_20-32/jre/bin/java -enableassertions -Xmx1400m
-jar <https://builds.apache.org/job/HBase-0.92/ws/trunk/target/surefire/surefirebooter740400771729727969.jar>
<https://builds.apache.org/job/HBase-0.92/ws/trunk/target/surefire/surefire2206364926630825784tmp>
<https://builds.apache.org/job/HBase-0.92/ws/trunk/target/surefire/surefire3394432495023581913tmp>
> Running org.apache.hadoop.hbase.rest.model.TestTableSchemaModel
> Tests run: 3, Failures: 0, Errors: 0, Skipped: 0, Time elapsed: 0.416 sec
> Forking command line: /bin/sh -c cd <https://builds.apache.org/job/HBase-0.92/ws/trunk>
&& /home/jenkins/tools/java/jdk1.6.0_20-32/jre/bin/java -enableassertions -Xmx1400m
-jar <https://builds.apache.org/job/HBase-0.92/ws/trunk/target/surefire/surefirebooter8207970254723254587.jar>
<https://builds.apache.org/job/HBase-0.92/ws/trunk/target/surefire/surefire2675964362692218345tmp>
<https://builds.apache.org/job/HBase-0.92/ws/trunk/target/surefire/surefire6377667146459875455tmp>
> Running org.apache.hadoop.hbase.rest.model.TestStorageClusterVersionModel
> Tests run: 2, Failures: 0, Errors: 0, Skipped: 0, Time elapsed: 0.274 sec
> Forking command line: /bin/sh -c cd <https://builds.apache.org/job/HBase-0.92/ws/trunk>
&& /home/jenkins/tools/java/jdk1.6.0_20-32/jre/bin/java -enableassertions -Xmx1400m
-jar <https://builds.apache.org/job/HBase-0.92/ws/trunk/target/surefire/surefirebooter3798249616182573686.jar>
<https://builds.apache.org/job/HBase-0.92/ws/trunk/target/surefire/surefire2019747144729928018tmp>
<https://builds.apache.org/job/HBase-0.92/ws/trunk/target/surefire/surefire4299577664949210700tmp>
> Running org.apache.hadoop.hbase.rest.model.TestTableRegionModel
> Tests run: 4, Failures: 0, Errors: 0, Skipped: 0, Time elapsed: 0.475 sec
> Forking command line: /bin/sh -c cd <https://builds.apache.org/job/HBase-0.92/ws/trunk>
&& /home/jenkins/tools/java/jdk1.6.0_20-32/jre/bin/java -enableassertions -Xmx1400m
-jar <https://builds.apache.org/job/HBase-0.92/ws/trunk/target/surefire/surefirebooter6063254262800394659.jar>
<https://builds.apache.org/job/HBase-0.92/ws/trunk/target/surefire/surefire3721883545129771458tmp>
<https://builds.apache.org/job/HBase-0.92/ws/trunk/target/surefire/surefire7361264727825268387tmp>
> Running org.apache.hadoop.hbase.rest.model.TestStorageClusterStatusModel
> Tests run: 3, Failures: 0, Errors: 0, Skipped: 0, Time elapsed: 0.454 sec
> Forking command line: /bin/sh -c cd <https://builds.apache.org/job/HBase-0.92/ws/trunk>
&& /home/jenkins/tools/java/jdk1.6.0_20-32/jre/bin/java -enableassertions -Xmx1400m
-jar <https://builds.apache.org/job/HBase-0.92/ws/trunk/target/surefire/surefirebooter1939414335739045721.jar>
<https://builds.apache.org/job/HBase-0.92/ws/trunk/target/surefire/surefire2345648991813305843tmp>
<https://builds.apache.org/job/HBase-0.92/ws/trunk/target/surefire/surefire1814846675123842467tmp>
> Running org.apache.hadoop.hbase.rest.model.TestScannerModel
> Tests run: 3, Failures: 0, Errors: 0, Skipped: 0, Time elapsed: 0.409 sec
> Forking command line: /bin/sh -c cd <https://builds.apache.org/job/HBase-0.92/ws/trunk>
&& /home/jenkins/tools/java/jdk1.6.0_20-32/jre/bin/java -enableassertions -Xmx1400m
-jar <https://builds.apache.org/job/HBase-0.92/ws/trunk/target/surefire/surefirebooter3655122369168476597.jar>
<https://builds.apache.org/job/HBase-0.92/ws/trunk/target/surefire/surefire2887224671449047911tmp>
<https://builds.apache.org/job/HBase-0.92/ws/trunk/target/surefire/surefire1195990784386577991tmp>
> Running org.apache.hadoop.hbase.rest.client.TestRemoteAdmin
> Tests run: 2, Failures: 0, Errors: 0, Skipped: 0, Time elapsed: 27.874 sec
> Forking command line: /bin/sh -c cd <https://builds.apache.org/job/HBase-0.92/ws/trunk>
&& /home/jenkins/tools/java/jdk1.6.0_20-32/jre/bin/java -enableassertions -Xmx1400m
-jar <https://builds.apache.org/job/HBase-0.92/ws/trunk/target/surefire/surefirebooter3298571682202028396.jar>
<https://builds.apache.org/job/HBase-0.92/ws/trunk/target/surefire/surefire8339186095091176897tmp>
<https://builds.apache.org/job/HBase-0.92/ws/trunk/target/surefire/surefire8315954614531283198tmp>
> Running org.apache.hadoop.hbase.rest.client.TestRemoteTable
> Tests run: 3, Failures: 0, Errors: 0, Skipped: 0, Time elapsed: 19.958 sec
> Forking command line: /bin/sh -c cd <https://builds.apache.org/job/HBase-0.92/ws/trunk>
&& /home/jenkins/tools/java/jdk1.6.0_20-32/jre/bin/java -enableassertions -Xmx1400m
-jar <https://builds.apache.org/job/HBase-0.92/ws/trunk/target/surefire/surefirebooter921757069527308596.jar>
<https://builds.apache.org/job/HBase-0.92/ws/trunk/target/surefire/surefire7975771445051310983tmp>
<https://builds.apache.org/job/HBase-0.92/ws/trunk/target/surefire/surefire6169455502263020735tmp>
> Running org.apache.hadoop.hbase.rest.TestVersionResource
> Tests run: 7, Failures: 0, Errors: 0, Skipped: 0, Time elapsed: 23.429 sec
> Forking command line: /bin/sh -c cd <https://builds.apache.org/job/HBase-0.92/ws/trunk>
&& /home/jenkins/tools/java/jdk1.6.0_20-32/jre/bin/java -enableassertions -Xmx1400m
-jar <https://builds.apache.org/job/HBase-0.92/ws/trunk/target/surefire/surefirebooter5167102271277947437.jar>
<https://builds.apache.org/job/HBase-0.92/ws/trunk/target/surefire/surefire7002411083843445409tmp>
<https://builds.apache.org/job/HBase-0.92/ws/trunk/target/surefire/surefire7078286234601281583tmp>
> Running org.apache.hadoop.hbase.rest.TestScannerResource
> Tests run: 5, Failures: 0, Errors: 0, Skipped: 0, Time elapsed: 45.99 sec
> Forking command line: /bin/sh -c cd <https://builds.apache.org/job/HBase-0.92/ws/trunk>
&& /home/jenkins/tools/java/jdk1.6.0_20-32/jre/bin/java -enableassertions -Xmx1400m
-jar <https://builds.apache.org/job/HBase-0.92/ws/trunk/target/surefire/surefirebooter3732406824530536387.jar>
<https://builds.apache.org/job/HBase-0.92/ws/trunk/target/surefire/surefire7987895026529619224tmp>
<https://builds.apache.org/job/HBase-0.92/ws/trunk/target/surefire/surefire5944061196999863771tmp>
> Running org.apache.hadoop.hbase.rest.TestTransform
> Tests run: 1, Failures: 0, Errors: 0, Skipped: 0, Time elapsed: 22.846 sec
> Forking command line: /bin/sh -c cd <https://builds.apache.org/job/HBase-0.92/ws/trunk>
&& /home/jenkins/tools/java/jdk1.6.0_20-32/jre/bin/java -enableassertions -Xmx1400m
-jar <https://builds.apache.org/job/HBase-0.92/ws/trunk/target/surefire/surefirebooter5350204370950953882.jar>
<https://builds.apache.org/job/HBase-0.92/ws/trunk/target/surefire/surefire2838312259800916611tmp>
<https://builds.apache.org/job/HBase-0.92/ws/trunk/target/surefire/surefire6381843686549828209tmp>
> Running org.apache.hadoop.hbase.rest.TestTableResource
> Tests run: 8, Failures: 0, Errors: 0, Skipped: 0, Time elapsed: 53.998 sec
> Forking command line: /bin/sh -c cd <https://builds.apache.org/job/HBase-0.92/ws/trunk>
&& /home/jenkins/tools/java/jdk1.6.0_20-32/jre/bin/java -enableassertions -Xmx1400m
-jar <https://builds.apache.org/job/HBase-0.92/ws/trunk/target/surefire/surefirebooter2686828457392708296.jar>
<https://builds.apache.org/job/HBase-0.92/ws/trunk/target/surefire/surefire1172608544864250510tmp>
<https://builds.apache.org/job/HBase-0.92/ws/trunk/target/surefire/surefire5831184770961025865tmp>
> Running org.apache.hadoop.hbase.rest.TestStatusResource
> Tests run: 2, Failures: 0, Errors: 0, Skipped: 0, Time elapsed: 24.468 sec
> Forking command line: /bin/sh -c cd <https://builds.apache.org/job/HBase-0.92/ws/trunk>
&& /home/jenkins/tools/java/jdk1.6.0_20-32/jre/bin/java -enableassertions -Xmx1400m
-jar <https://builds.apache.org/job/HBase-0.92/ws/trunk/target/surefire/surefirebooter7519583002911105932.jar>
<https://builds.apache.org/job/HBase-0.92/ws/trunk/target/surefire/surefire2213535429147533896tmp>
<https://builds.apache.org/job/HBase-0.92/ws/trunk/target/surefire/surefire7679957981002373715tmp>
> Running org.apache.hadoop.hbase.rest.TestSchemaResource
> Tests run: 2, Failures: 0, Errors: 0, Skipped: 0, Time elapsed: 26.09 sec
> Forking command line: /bin/sh -c cd <https://builds.apache.org/job/HBase-0.92/ws/trunk>
&& /home/jenkins/tools/java/jdk1.6.0_20-32/jre/bin/java -enableassertions -Xmx1400m
-jar <https://builds.apache.org/job/HBase-0.92/ws/trunk/target/surefire/surefirebooter20085802973028868.jar>
<https://builds.apache.org/job/HBase-0.92/ws/trunk/target/surefire/surefire5104132556897677121tmp>
<https://builds.apache.org/job/HBase-0.92/ws/trunk/target/surefire/surefire6664419798877931349tmp>
> Running org.apache.hadoop.hbase.thrift.TestThriftServer
> Tests run: 1, Failures: 0, Errors: 0, Skipped: 0, Time elapsed: 22.48 sec
> Forking command line: /bin/sh -c cd <https://builds.apache.org/job/HBase-0.92/ws/trunk>
&& /home/jenkins/tools/java/jdk1.6.0_20-32/jre/bin/java -enableassertions -Xmx1400m
-jar <https://builds.apache.org/job/HBase-0.92/ws/trunk/target/surefire/surefirebooter1702585722903742119.jar>
<https://builds.apache.org/job/HBase-0.92/ws/trunk/target/surefire/surefire4443607167478019156tmp>
<https://builds.apache.org/job/HBase-0.92/ws/trunk/target/surefire/surefire1387711525086890328tmp>
> Running org.apache.hadoop.hbase.io.TestHeapSize
> Tests run: 2, Failures: 0, Errors: 0, Skipped: 0, Time elapsed: 0.161 sec
> Forking command line: /bin/sh -c cd <https://builds.apache.org/job/HBase-0.92/ws/trunk>
&& /home/jenkins/tools/java/jdk1.6.0_20-32/jre/bin/java -enableassertions -Xmx1400m
-jar <https://builds.apache.org/job/HBase-0.92/ws/trunk/target/surefire/surefirebooter3316796460902975220.jar>
<https://builds.apache.org/job/HBase-0.92/ws/trunk/target/surefire/surefire501707134565607852tmp>
<https://builds.apache.org/job/HBase-0.92/ws/trunk/target/surefire/surefire2721953023997376599tmp>
> Running org.apache.hadoop.hbase.io.hfile.TestHFileSeek
> Tests run: 1, Failures: 0, Errors: 0, Skipped: 0, Time elapsed: 5.79 sec
> Forking command line: /bin/sh -c cd <https://builds.apache.org/job/HBase-0.92/ws/trunk>
&& /home/jenkins/tools/java/jdk1.6.0_20-32/jre/bin/java -enableassertions -Xmx1400m
-jar <https://builds.apache.org/job/HBase-0.92/ws/trunk/target/surefire/surefirebooter5777371766318596678.jar>
<https://builds.apache.org/job/HBase-0.92/ws/trunk/target/surefire/surefire7574641959543435834tmp>
<https://builds.apache.org/job/HBase-0.92/ws/trunk/target/surefire/surefire665529857606577508tmp>
> Running org.apache.hadoop.hbase.io.hfile.slab.TestSlab
> Tests run: 1, Failures: 0, Errors: 0, Skipped: 0, Time elapsed: 0.143 sec
> Forking command line: /bin/sh -c cd <https://builds.apache.org/job/HBase-0.92/ws/trunk>
&& /home/jenkins/tools/java/jdk1.6.0_20-32/jre/bin/java -enableassertions -Xmx1400m
-jar <https://builds.apache.org/job/HBase-0.92/ws/trunk/target/surefire/surefirebooter7782679410144229969.jar>
<https://builds.apache.org/job/HBase-0.92/ws/trunk/target/surefire/surefire2348963926964740666tmp>
<https://builds.apache.org/job/HBase-0.92/ws/trunk/target/surefire/surefire5818558382908788628tmp>
> Running org.apache.hadoop.hbase.io.hfile.slab.TestSlabCache
> Tests run: 7, Failures: 0, Errors: 0, Skipped: 0, Time elapsed: 22.484 sec
> Forking command line: /bin/sh -c cd <https://builds.apache.org/job/HBase-0.92/ws/trunk>
&& /home/jenkins/tools/java/jdk1.6.0_20-32/jre/bin/java -enableassertions -Xmx1400m
-jar <https://builds.apache.org/job/HBase-0.92/ws/trunk/target/surefire/surefirebooter7468101605539551115.jar>
<https://builds.apache.org/job/HBase-0.92/ws/trunk/target/surefire/surefire4709904297446045303tmp>
<https://builds.apache.org/job/HBase-0.92/ws/trunk/target/surefire/surefire3596086663187552901tmp>
> Running org.apache.hadoop.hbase.io.hfile.slab.TestSingleSizeCache
> Tests run: 5, Failures: 0, Errors: 0, Skipped: 0, Time elapsed: 22.764 sec
> Forking command line: /bin/sh -c cd <https://builds.apache.org/job/HBase-0.92/ws/trunk>
&& /home/jenkins/tools/java/jdk1.6.0_20-32/jre/bin/java -enableassertions -Xmx1400m
-jar <https://builds.apache.org/job/HBase-0.92/ws/trunk/target/surefire/surefirebooter2344247562469680187.jar>
<https://builds.apache.org/job/HBase-0.92/ws/trunk/target/surefire/surefire6845559701504251729tmp>
<https://builds.apache.org/job/HBase-0.92/ws/trunk/target/surefire/surefire8405201827845473733tmp>
> Running org.apache.hadoop.hbase.io.hfile.TestCachedBlockQueue
> Tests run: 2, Failures: 0, Errors: 0, Skipped: 0, Time elapsed: 0.101 sec
> Forking command line: /bin/sh -c cd <https://builds.apache.org/job/HBase-0.92/ws/trunk>
&& /home/jenkins/tools/java/jdk1.6.0_20-32/jre/bin/java -enableassertions -Xmx1400m
-jar <https://builds.apache.org/job/HBase-0.92/ws/trunk/target/surefire/surefirebooter1350204698399051802.jar>
<https://builds.apache.org/job/HBase-0.92/ws/trunk/target/surefire/surefire7029085341542911719tmp>
<https://builds.apache.org/job/HBase-0.92/ws/trunk/target/surefire/surefire3512327685438330046tmp>
> Running org.apache.hadoop.hbase.io.hfile.TestHFileBlockIndex
> Tests run: 10, Failures: 0, Errors: 0, Skipped: 0, Time elapsed: 11.353 sec
> Forking command line: /bin/sh -c cd <https://builds.apache.org/job/HBase-0.92/ws/trunk>
&& /home/jenkins/tools/java/jdk1.6.0_20-32/jre/bin/java -enableassertions -Xmx1400m
-jar <https://builds.apache.org/job/HBase-0.92/ws/trunk/target/surefire/surefirebooter1021541247438502388.jar>
<https://builds.apache.org/job/HBase-0.92/ws/trunk/target/surefire/surefire4753413300869803143tmp>
<https://builds.apache.org/job/HBase-0.92/ws/trunk/target/surefire/surefire413869077270000923tmp>
> Running org.apache.hadoop.hbase.io.hfile.TestLruBlockCache
> Tests run: 7, Failures: 0, Errors: 0, Skipped: 0, Time elapsed: 1.139 sec
> Forking command line: /bin/sh -c cd <https://builds.apache.org/job/HBase-0.92/ws/trunk>
&& /home/jenkins/tools/java/jdk1.6.0_20-32/jre/bin/java -enableassertions -Xmx1400m
-jar <https://builds.apache.org/job/HBase-0.92/ws/trunk/target/surefire/surefirebooter2800259501920463910.jar>
<https://builds.apache.org/job/HBase-0.92/ws/trunk/target/surefire/surefire917076628283959085tmp>
<https://builds.apache.org/job/HBase-0.92/ws/trunk/target/surefire/surefire3239744704546387466tmp>
> Running org.apache.hadoop.hbase.io.hfile.TestHFilePerformance
> Tests run: 1, Failures: 0, Errors: 0, Skipped: 0, Time elapsed: 6.703 sec
> Forking command line: /bin/sh -c cd <https://builds.apache.org/job/HBase-0.92/ws/trunk>
&& /home/jenkins/tools/java/jdk1.6.0_20-32/jre/bin/java -enableassertions -Xmx1400m
-jar <https://builds.apache.org/job/HBase-0.92/ws/trunk/target/surefire/surefirebooter6217159537792421624.jar>
<https://builds.apache.org/job/HBase-0.92/ws/trunk/target/surefire/surefire696589967791893227tmp>
<https://builds.apache.org/job/HBase-0.92/ws/trunk/target/surefire/surefire74516507767831530tmp>
> Running org.apache.hadoop.hbase.io.hfile.TestFixedFileTrailer
> Tests run: 2, Failures: 0, Errors: 0, Skipped: 0, Time elapsed: 0.54 sec
> Forking command line: /bin/sh -c cd <https://builds.apache.org/job/HBase-0.92/ws/trunk>
&& /home/jenkins/tools/java/jdk1.6.0_20-32/jre/bin/java -enableassertions -Xmx1400m
-jar <https://builds.apache.org/job/HBase-0.92/ws/trunk/target/surefire/surefirebooter4419469298614963880.jar>
<https://builds.apache.org/job/HBase-0.92/ws/trunk/target/surefire/surefire2117756510164426423tmp>
<https://builds.apache.org/job/HBase-0.92/ws/trunk/target/surefire/surefire8292652705242476443tmp>
> Running org.apache.hadoop.hbase.io.hfile.TestHFileWriterV2
> Tests run: 1, Failures: 0, Errors: 0, Skipped: 0, Time elapsed: 0.896 sec
> Forking command line: /bin/sh -c cd <https://builds.apache.org/job/HBase-0.92/ws/trunk>
&& /home/jenkins/tools/java/jdk1.6.0_20-32/jre/bin/java -enableassertions -Xmx1400m
-jar <https://builds.apache.org/job/HBase-0.92/ws/trunk/target/surefire/surefirebooter6944364450443091144.jar>
<https://builds.apache.org/job/HBase-0.92/ws/trunk/target/surefire/surefire6740849332236509851tmp>
<https://builds.apache.org/job/HBase-0.92/ws/trunk/target/surefire/surefire2369047734585965739tmp>
> Running org.apache.hadoop.hbase.io.hfile.TestBlockCacheColumnFamilySummary
> Tests run: 4, Failures: 0, Errors: 0, Skipped: 0, Time elapsed: 0.056 sec
> Forking command line: /bin/sh -c cd <https://builds.apache.org/job/HBase-0.92/ws/trunk>
&& /home/jenkins/tools/java/jdk1.6.0_20-32/jre/bin/java -enableassertions -Xmx1400m
-jar <https://builds.apache.org/job/HBase-0.92/ws/trunk/target/surefire/surefirebooter136438338788819009.jar>
<https://builds.apache.org/job/HBase-0.92/ws/trunk/target/surefire/surefire2923867763100864563tmp>
<https://builds.apache.org/job/HBase-0.92/ws/trunk/target/surefire/surefire6238943848539607729tmp>
> Running org.apache.hadoop.hbase.io.hfile.TestHFileReaderV1
> Tests run: 1, Failures: 0, Errors: 0, Skipped: 0, Time elapsed: 0.45 sec
> Forking command line: /bin/sh -c cd <https://builds.apache.org/job/HBase-0.92/ws/trunk>
&& /home/jenkins/tools/java/jdk1.6.0_20-32/jre/bin/java -enableassertions -Xmx1400m
-jar <https://builds.apache.org/job/HBase-0.92/ws/trunk/target/surefire/surefirebooter5211605108316075061.jar>
<https://builds.apache.org/job/HBase-0.92/ws/trunk/target/surefire/surefire3878210117839388717tmp>
<https://builds.apache.org/job/HBase-0.92/ws/trunk/target/surefire/surefire8045643359470380036tmp>
> Running org.apache.hadoop.hbase.io.hfile.TestHFile
> Tests run: 6, Failures: 0, Errors: 0, Skipped: 0, Time elapsed: 0.841 sec
> Forking command line: /bin/sh -c cd <https://builds.apache.org/job/HBase-0.92/ws/trunk>
&& /home/jenkins/tools/java/jdk1.6.0_20-32/jre/bin/java -enableassertions -Xmx1400m
-jar <https://builds.apache.org/job/HBase-0.92/ws/trunk/target/surefire/surefirebooter7950908429148555053.jar>
<https://builds.apache.org/job/HBase-0.92/ws/trunk/target/surefire/surefire5019062787136879841tmp>
<https://builds.apache.org/job/HBase-0.92/ws/trunk/target/surefire/surefire3814097809019803879tmp>
> Running org.apache.hadoop.hbase.io.hfile.TestReseekTo
> Tests run: 1, Failures: 0, Errors: 0, Skipped: 0, Time elapsed: 0.568 sec
> Forking command line: /bin/sh -c cd <https://builds.apache.org/job/HBase-0.92/ws/trunk>
&& /home/jenkins/tools/java/jdk1.6.0_20-32/jre/bin/java -enableassertions -Xmx1400m
-jar <https://builds.apache.org/job/HBase-0.92/ws/trunk/target/surefire/surefirebooter7054473007605347799.jar>
<https://builds.apache.org/job/HBase-0.92/ws/trunk/target/surefire/surefire5765913950807884739tmp>
<https://builds.apache.org/job/HBase-0.92/ws/trunk/target/surefire/surefire5615171992528747099tmp>
> Running org.apache.hadoop.hbase.io.hfile.TestHFileBlock
> Tests run: 7, Failures: 0, Errors: 0, Skipped: 0, Time elapsed: 30.373 sec
> Forking command line: /bin/sh -c cd <https://builds.apache.org/job/HBase-0.92/ws/trunk>
&& /home/jenkins/tools/java/jdk1.6.0_20-32/jre/bin/java -enableassertions -Xmx1400m
-jar <https://builds.apache.org/job/HBase-0.92/ws/trunk/target/surefire/surefirebooter6319498278201304149.jar>
<https://builds.apache.org/job/HBase-0.92/ws/trunk/target/surefire/surefire4692451723036782926tmp>
<https://builds.apache.org/job/HBase-0.92/ws/trunk/target/surefire/surefire5569013001655446657tmp>
> Running org.apache.hadoop.hbase.io.hfile.TestSeekTo
> Tests run: 3, Failures: 0, Errors: 0, Skipped: 0, Time elapsed: 0.653 sec
> Forking command line: /bin/sh -c cd <https://builds.apache.org/job/HBase-0.92/ws/trunk>
&& /home/jenkins/tools/java/jdk1.6.0_20-32/jre/bin/java -enableassertions -Xmx1400m
-jar <https://builds.apache.org/job/HBase-0.92/ws/trunk/target/surefire/surefirebooter4428708296872161840.jar>
<https://builds.apache.org/job/HBase-0.92/ws/trunk/target/surefire/surefire5650590842021789833tmp>
<https://builds.apache.org/job/HBase-0.92/ws/trunk/target/surefire/surefire2427327744486107004tmp>
> Running org.apache.hadoop.hbase.io.hfile.TestCacheOnWrite
> Tests run: 6, Failures: 0, Errors: 0, Skipped: 0, Time elapsed: 9.627 sec
> Forking command line: /bin/sh -c cd <https://builds.apache.org/job/HBase-0.92/ws/trunk>
&& /home/jenkins/tools/java/jdk1.6.0_20-32/jre/bin/java -enableassertions -Xmx1400m
-jar <https://builds.apache.org/job/HBase-0.92/ws/trunk/target/surefire/surefirebooter4560714886760674785.jar>
<https://builds.apache.org/job/HBase-0.92/ws/trunk/target/surefire/surefire3581831046629500411tmp>
<https://builds.apache.org/job/HBase-0.92/ws/trunk/target/surefire/surefire1508801931206763042tmp>
> Running org.apache.hadoop.hbase.io.TestHbaseObjectWritable
> Tests run: 3, Failures: 0, Errors: 0, Skipped: 0, Time elapsed: 0.424 sec
> Forking command line: /bin/sh -c cd <https://builds.apache.org/job/HBase-0.92/ws/trunk>
&& /home/jenkins/tools/java/jdk1.6.0_20-32/jre/bin/java -enableassertions -Xmx1400m
-jar <https://builds.apache.org/job/HBase-0.92/ws/trunk/target/surefire/surefirebooter7037135099334981270.jar>
<https://builds.apache.org/job/HBase-0.92/ws/trunk/target/surefire/surefire3586474252185656212tmp>
<https://builds.apache.org/job/HBase-0.92/ws/trunk/target/surefire/surefire9123367024809244744tmp>
> Running org.apache.hadoop.hbase.io.TestImmutableBytesWritable
> Tests run: 3, Failures: 0, Errors: 0, Skipped: 0, Time elapsed: 0.107 sec
> Forking command line: /bin/sh -c cd <https://builds.apache.org/job/HBase-0.92/ws/trunk>
&& /home/jenkins/tools/java/jdk1.6.0_20-32/jre/bin/java -enableassertions -Xmx1400m
-jar <https://builds.apache.org/job/HBase-0.92/ws/trunk/target/surefire/surefirebooter5878434601935801299.jar>
<https://builds.apache.org/job/HBase-0.92/ws/trunk/target/surefire/surefire7612031160408047809tmp>
<https://builds.apache.org/job/HBase-0.92/ws/trunk/target/surefire/surefire2850047945915788218tmp>
> Running org.apache.hadoop.hbase.io.TestHalfStoreFileReader
> Tests run: 1, Failures: 0, Errors: 0, Skipped: 0, Time elapsed: 0.604 sec
> Forking command line: /bin/sh -c cd <https://builds.apache.org/job/HBase-0.92/ws/trunk>
&& /home/jenkins/tools/java/jdk1.6.0_20-32/jre/bin/java -enableassertions -Xmx1400m
-jar <https://builds.apache.org/job/HBase-0.92/ws/trunk/target/surefire/surefirebooter4284137405491796905.jar>
<https://builds.apache.org/job/HBase-0.92/ws/trunk/target/surefire/surefire652718215903903610tmp>
<https://builds.apache.org/job/HBase-0.92/ws/trunk/target/surefire/surefire9213670554874114779tmp>
> Running org.apache.hadoop.hbase.TestFSTableDescriptorForceCreation
> Tests run: 3, Failures: 0, Errors: 0, Skipped: 0, Time elapsed: 3.007 sec
> Forking command line: /bin/sh -c cd <https://builds.apache.org/job/HBase-0.92/ws/trunk>
&& /home/jenkins/tools/java/jdk1.6.0_20-32/jre/bin/java -enableassertions -Xmx1400m
-jar <https://builds.apache.org/job/HBase-0.92/ws/trunk/target/surefire/surefirebooter5074561867644082735.jar>
<https://builds.apache.org/job/HBase-0.92/ws/trunk/target/surefire/surefire2093104254990793577tmp>
<https://builds.apache.org/job/HBase-0.92/ws/trunk/target/surefire/surefire5445853846427346387tmp>
> Running org.apache.hadoop.hbase.avro.TestAvroUtil
> Tests run: 1, Failures: 0, Errors: 0, Skipped: 0, Time elapsed: 0.629 sec
> Forking command line: /bin/sh -c cd <https://builds.apache.org/job/HBase-0.92/ws/trunk>
&& /home/jenkins/tools/java/jdk1.6.0_20-32/jre/bin/java -enableassertions -Xmx1400m
-jar <https://builds.apache.org/job/HBase-0.92/ws/trunk/target/surefire/surefirebooter8596626535389431561.jar>
<https://builds.apache.org/job/HBase-0.92/ws/trunk/target/surefire/surefire3890776850489533636tmp>
<https://builds.apache.org/job/HBase-0.92/ws/trunk/target/surefire/surefire3696848852554885950tmp>
> Running org.apache.hadoop.hbase.avro.TestAvroServer
> Tests run: 3, Failures: 0, Errors: 0, Skipped: 0, Time elapsed: 37.713 sec
> Forking command line: /bin/sh -c cd <https://builds.apache.org/job/HBase-0.92/ws/trunk>
&& /home/jenkins/tools/java/jdk1.6.0_20-32/jre/bin/java -enableassertions -Xmx1400m
-jar <https://builds.apache.org/job/HBase-0.92/ws/trunk/target/surefire/surefirebooter3234713503414697252.jar>
<https://builds.apache.org/job/HBase-0.92/ws/trunk/target/surefire/surefire4911338891559866977tmp>
<https://builds.apache.org/job/HBase-0.92/ws/trunk/target/surefire/surefire5015843949376469047tmp>
> Running org.apache.hadoop.hbase.TestKeyValue
> Tests run: 11, Failures: 0, Errors: 0, Skipped: 0, Time elapsed: 0.126 sec
> Forking command line: /bin/sh -c cd <https://builds.apache.org/job/HBase-0.92/ws/trunk>
&& /home/jenkins/tools/java/jdk1.6.0_20-32/jre/bin/java -enableassertions -Xmx1400m
-jar <https://builds.apache.org/job/HBase-0.92/ws/trunk/target/surefire/surefirebooter5537237604250135281.jar>
<https://builds.apache.org/job/HBase-0.92/ws/trunk/target/surefire/surefire978028395548570021tmp>
<https://builds.apache.org/job/HBase-0.92/ws/trunk/target/surefire/surefire6066066344592980438tmp>
> Running org.apache.hadoop.hbase.replication.TestMultiSlaveReplication
> Tests run: 1, Failures: 0, Errors: 0, Skipped: 0, Time elapsed: 51.264 sec
> Forking command line: /bin/sh -c cd <https://builds.apache.org/job/HBase-0.92/ws/trunk>
&& /home/jenkins/tools/java/jdk1.6.0_20-32/jre/bin/java -enableassertions -Xmx1400m
-jar <https://builds.apache.org/job/HBase-0.92/ws/trunk/target/surefire/surefirebooter6344276909035733137.jar>
<https://builds.apache.org/job/HBase-0.92/ws/trunk/target/surefire/surefire5327880349800833621tmp>
<https://builds.apache.org/job/HBase-0.92/ws/trunk/target/surefire/surefire874818808140870658tmp>
> Running org.apache.hadoop.hbase.replication.regionserver.TestReplicationSourceManager
> Tests run: 1, Failures: 0, Errors: 0, Skipped: 0, Time elapsed: 0.91 sec
> Forking command line: /bin/sh -c cd <https://builds.apache.org/job/HBase-0.92/ws/trunk>
&& /home/jenkins/tools/java/jdk1.6.0_20-32/jre/bin/java -enableassertions -Xmx1400m
-jar <https://builds.apache.org/job/HBase-0.92/ws/trunk/target/surefire/surefirebooter3950618163619577643.jar>
<https://builds.apache.org/job/HBase-0.92/ws/trunk/target/surefire/surefire4730894918616905436tmp>
<https://builds.apache.org/job/HBase-0.92/ws/trunk/target/surefire/surefire8387061737467955922tmp>
> Running org.apache.hadoop.hbase.replication.regionserver.TestReplicationSink
> Tests run: 5, Failures: 0, Errors: 0, Skipped: 0, Time elapsed: 25.001 sec
> Forking command line: /bin/sh -c cd <https://builds.apache.org/job/HBase-0.92/ws/trunk>
&& /home/jenkins/tools/java/jdk1.6.0_20-32/jre/bin/java -enableassertions -Xmx1400m
-jar <https://builds.apache.org/job/HBase-0.92/ws/trunk/target/surefire/surefirebooter6658584169735891443.jar>
<https://builds.apache.org/job/HBase-0.92/ws/trunk/target/surefire/surefire9141448519148117167tmp>
<https://builds.apache.org/job/HBase-0.92/ws/trunk/target/surefire/surefire1051551902776953217tmp>
> Running org.apache.hadoop.hbase.replication.TestMasterReplication
> Tests run: 2, Failures: 0, Errors: 0, Skipped: 0, Time elapsed: 84.237 sec
> Forking command line: /bin/sh -c cd <https://builds.apache.org/job/HBase-0.92/ws/trunk>
&& /home/jenkins/tools/java/jdk1.6.0_20-32/jre/bin/java -enableassertions -Xmx1400m
-jar <https://builds.apache.org/job/HBase-0.92/ws/trunk/target/surefire/surefirebooter4690074404492077759.jar>
<https://builds.apache.org/job/HBase-0.92/ws/trunk/target/surefire/surefire4145074294618868108tmp>
<https://builds.apache.org/job/HBase-0.92/ws/trunk/target/surefire/surefire7910737278009237822tmp>
> Running org.apache.hadoop.hbase.replication.TestReplicationSource
> Tests run: 1, Failures: 0, Errors: 0, Skipped: 0, Time elapsed: 6.264 sec
> Forking command line: /bin/sh -c cd <https://builds.apache.org/job/HBase-0.92/ws/trunk>
&& /home/jenkins/tools/java/jdk1.6.0_20-32/jre/bin/java -enableassertions -Xmx1400m
-jar <https://builds.apache.org/job/HBase-0.92/ws/trunk/target/surefire/surefirebooter1103873018587984658.jar>
<https://builds.apache.org/job/HBase-0.92/ws/trunk/target/surefire/surefire75018387352124383tmp>
<https://builds.apache.org/job/HBase-0.92/ws/trunk/target/surefire/surefire1588683330649993109tmp>
> Running org.apache.hadoop.hbase.replication.TestReplicationPeer
> Tests run: 1, Failures: 0, Errors: 0, Skipped: 0, Time elapsed: 25.497 sec
> Forking command line: /bin/sh -c cd <https://builds.apache.org/job/HBase-0.92/ws/trunk>
&& /home/jenkins/tools/java/jdk1.6.0_20-32/jre/bin/java -enableassertions -Xmx1400m
-jar <https://builds.apache.org/job/HBase-0.92/ws/trunk/target/surefire/surefirebooter6714338672682563491.jar>
<https://builds.apache.org/job/HBase-0.92/ws/trunk/target/surefire/surefire4951931546923765965tmp>
<https://builds.apache.org/job/HBase-0.92/ws/trunk/target/surefire/surefire6818090295841589826tmp>
> Running org.apache.hadoop.hbase.replication.TestReplication
> Tests run: 7, Failures: 0, Errors: 0, Skipped: 0, Time elapsed: 89.914 sec
> Forking command line: /bin/sh -c cd <https://builds.apache.org/job/HBase-0.92/ws/trunk>
&& /home/jenkins/tools/java/jdk1.6.0_20-32/jre/bin/java -enableassertions -Xmx1400m
-jar <https://builds.apache.org/job/HBase-0.92/ws/trunk/target/surefire/surefirebooter3792635533845502577.jar>
<https://builds.apache.org/job/HBase-0.92/ws/trunk/target/surefire/surefire7888633856700113109tmp>
<https://builds.apache.org/job/HBase-0.92/ws/trunk/target/surefire/surefire2222001126610693210tmp>
> Running org.apache.hadoop.hbase.ipc.TestDelayedRpc
> Tests run: 4, Failures: 0, Errors: 0, Skipped: 0, Time elapsed: 2.501 sec
> Forking command line: /bin/sh -c cd <https://builds.apache.org/job/HBase-0.92/ws/trunk>
&& /home/jenkins/tools/java/jdk1.6.0_20-32/jre/bin/java -enableassertions -Xmx1400m
-jar <https://builds.apache.org/job/HBase-0.92/ws/trunk/target/surefire/surefirebooter6738564674788743435.jar>
<https://builds.apache.org/job/HBase-0.92/ws/trunk/target/surefire/surefire3106762195766194552tmp>
<https://builds.apache.org/job/HBase-0.92/ws/trunk/target/surefire/surefire831903868042345355tmp>
> Running org.apache.hadoop.hbase.TestCompare
> Tests run: 1, Failures: 0, Errors: 0, Skipped: 0, Time elapsed: 0.234 sec
> Forking command line: /bin/sh -c cd <https://builds.apache.org/job/HBase-0.92/ws/trunk>
&& /home/jenkins/tools/java/jdk1.6.0_20-32/jre/bin/java -enableassertions -Xmx1400m
-jar <https://builds.apache.org/job/HBase-0.92/ws/trunk/target/surefire/surefirebooter7441068070999407284.jar>
<https://builds.apache.org/job/HBase-0.92/ws/trunk/target/surefire/surefire1381003408242279516tmp>
<https://builds.apache.org/job/HBase-0.92/ws/trunk/target/surefire/surefire566939750923553390tmp>
> Running org.apache.hadoop.hbase.TestZooKeeper
> Tests run: 7, Failures: 0, Errors: 0, Skipped: 0, Time elapsed: 85.967 sec
> Forking command line: /bin/sh -c cd <https://builds.apache.org/job/HBase-0.92/ws/trunk>
&& /home/jenkins/tools/java/jdk1.6.0_20-32/jre/bin/java -enableassertions -Xmx1400m
-jar <https://builds.apache.org/job/HBase-0.92/ws/trunk/target/surefire/surefirebooter7872685334136213139.jar>
<https://builds.apache.org/job/HBase-0.92/ws/trunk/target/surefire/surefire8225956982866563879tmp>
<https://builds.apache.org/job/HBase-0.92/ws/trunk/target/surefire/surefire8299638285729228967tmp>
> Running org.apache.hadoop.hbase.TestHBaseTestingUtility
> Tests run: 6, Failures: 0, Errors: 0, Skipped: 0, Time elapsed: 59.822 sec
>
> Results :
>
> Failed tests:   testCacheOnWriteEvictOnClose(org.apache.hadoop.hbase.client.TestFromClientSide):
expected:<68> but was:<67>
>
> Tests run: 1027, Failures: 1, Errors: 0, Skipped: 9
>
> [INFO] ------------------------------------------------------------------------
> [INFO] BUILD FAILURE
> [INFO] ------------------------------------------------------------------------
> [INFO] Total time: 2:00:15.074s
> [INFO] Finished at: Fri Oct 14 03:02:53 UTC 2011
> [INFO] Final Memory: 30M/960M
> [INFO] ------------------------------------------------------------------------
> [ERROR] Failed to execute goal org.apache.maven.plugins:maven-surefire-plugin:2.9:test
(default-test) on project hbase: There are test failures.
> [ERROR]
> [ERROR] Please refer to <https://builds.apache.org/job/HBase-0.92/ws/trunk/target/surefire-reports>
for the individual test results.
> [ERROR] -> [Help 1]
> org.apache.maven.lifecycle.LifecycleExecutionException: Failed to execute goal org.apache.maven.plugins:maven-surefire-plugin:2.9:test
(default-test) on project hbase: There are test failures.
>
> Please refer to <https://builds.apache.org/job/HBase-0.92/ws/trunk/target/surefire-reports>
for the individual test results.
>        at org.apache.maven.lifecycle.internal.MojoExecutor.execute(MojoExecutor.java:213)
>        at org.apache.maven.lifecycle.internal.MojoExecutor.execute(MojoExecutor.java:153)
>        at org.apache.maven.lifecycle.internal.MojoExecutor.execute(MojoExecutor.java:145)
>        at org.apache.maven.lifecycle.internal.MojoExecutor.executeForkedExecutions(MojoExecutor.java:365)
>        at org.apache.maven.lifecycle.internal.MojoExecutor.execute(MojoExecutor.java:199)
>        at org.apache.maven.lifecycle.internal.MojoExecutor.execute(MojoExecutor.java:153)
>        at org.apache.maven.lifecycle.internal.MojoExecutor.execute(MojoExecutor.java:145)
>        at org.apache.maven.lifecycle.internal.LifecycleModuleBuilder.buildProject(LifecycleModuleBuilder.java:84)
>        at org.apache.maven.lifecycle.internal.LifecycleModuleBuilder.buildProject(LifecycleModuleBuilder.java:59)
>        at org.apache.maven.lifecycle.internal.LifecycleStarter.singleThreadedBuild(LifecycleStarter.java:183)
>        at org.apache.maven.lifecycle.internal.LifecycleStarter.execute(LifecycleStarter.java:161)
>        at org.apache.maven.DefaultMaven.doExecute(DefaultMaven.java:319)
>        at org.apache.maven.DefaultMaven.execute(DefaultMaven.java:156)
>        at org.apache.maven.cli.MavenCli.execute(MavenCli.java:537)
>        at org.apache.maven.cli.MavenCli.doMain(MavenCli.java:196)
>        at org.apache.maven.cli.MavenCli.main(MavenCli.java:141)
>        at sun.reflect.NativeMethodAccessorImpl.invoke0(Native Method)
>        at sun.reflect.NativeMethodAccessorImpl.invoke(NativeMethodAccessorImpl.java:39)
>        at sun.reflect.DelegatingMethodAccessorImpl.invoke(DelegatingMethodAccessorImpl.java:25)
>        at java.lang.reflect.Method.invoke(Method.java:597)
>        at org.codehaus.plexus.classworlds.launcher.Launcher.launchEnhanced(Launcher.java:290)
>        at org.codehaus.plexus.classworlds.launcher.Launcher.launch(Launcher.java:230)
>        at org.codehaus.plexus.classworlds.launcher.Launcher.mainWithExitCode(Launcher.java:409)
>        at org.codehaus.plexus.classworlds.launcher.Launcher.main(Launcher.java:352)
> Caused by: org.apache.maven.plugin.MojoFailureException: There are test failures.
>
> Please refer to <https://builds.apache.org/job/HBase-0.92/ws/trunk/target/surefire-reports>
for the individual test results.
>        at org.apache.maven.plugin.surefire.SurefireHelper.reportExecution(SurefireHelper.java:87)
>        at org.apache.maven.plugin.surefire.SurefirePlugin.writeSummary(SurefirePlugin.java:631)
>        at org.apache.maven.plugin.surefire.SurefirePlugin.handleSummary(SurefirePlugin.java:605)
>        at org.apache.maven.plugin.surefire.AbstractSurefireMojo.executeAfterPreconditionsChecked(AbstractSurefireMojo.java:136)
>        at org.apache.maven.plugin.surefire.AbstractSurefireMojo.execute(AbstractSurefireMojo.java:97)
>        at org.apache.maven.plugin.DefaultBuildPluginManager.executeMojo(DefaultBuildPluginManager.java:101)
>        at org.apache.maven.lifecycle.internal.MojoExecutor.execute(MojoExecutor.java:209)
>        ... 23 more
> [ERROR]
> [ERROR]
> [ERROR] For more information about the errors and possible solutions, please read the
following articles:
> [ERROR] [Help 1] http://cwiki.apache.org/confluence/display/MAVEN/MojoFailureException
> Build step 'Invoke top-level Maven targets' marked build as failure
> [locks-and-latches] Releasing all the locks
> [locks-and-latches] All the locks released
> Archiving artifacts
> Recording test results
> Updating HBASE-4568
> Updating HBASE-3446
> Updating HBASE-4282
>
>

Mime
View raw message