hbase-dev mailing list archives

Site index · List index
Message view « Date » · « Thread »
Top « Date » · « Thread »
From Ted Yu <yuzhih...@gmail.com>
Subject Re: Build failed in Jenkins: HBase-TRUNK #2306
Date Sat, 08 Oct 2011 21:45:37 GMT
TestSlabCache hung. 

On Oct 8, 2011, at 2:29 PM, Stack <stack@duboce.net> wrote:

> All tests pass but still reported as failed.  I can't see which of the
> tests is hanging out.  Suggestions on how to look for the hung test?
> 
> St.Ack
> 
> On Sat, Oct 8, 2011 at 12:36 AM, Apache Jenkins Server
> <jenkins@builds.apache.org> wrote:
>> See <https://builds.apache.org/job/HBase-TRUNK/2306/>
>> 
>> ------------------------------------------
>> [...truncated 1659 lines...]
>> Tests run: 4, Failures: 0, Errors: 0, Skipped: 0, Time elapsed: 0.892 sec
>> Running org.apache.hadoop.hbase.regionserver.TestStoreFile
>> Tests run: 8, Failures: 0, Errors: 0, Skipped: 0, Time elapsed: 40.986 sec
>> Running org.apache.hadoop.hbase.regionserver.TestWideScanner
>> Tests run: 1, Failures: 0, Errors: 0, Skipped: 0, Time elapsed: 24.81 sec
>> Running org.apache.hadoop.hbase.regionserver.TestQueryMatcher
>> Tests run: 4, Failures: 0, Errors: 0, Skipped: 0, Time elapsed: 0.548 sec
>> Running org.apache.hadoop.hbase.regionserver.TestReadWriteConsistencyControl
>> Tests run: 1, Failures: 0, Errors: 0, Skipped: 0, Time elapsed: 10.11 sec
>> Running org.apache.hadoop.hbase.regionserver.TestResettingCounters
>> Tests run: 1, Failures: 0, Errors: 0, Skipped: 0, Time elapsed: 0.81 sec
>> Running org.apache.hadoop.hbase.regionserver.TestStoreScanner
>> Tests run: 14, Failures: 0, Errors: 0, Skipped: 0, Time elapsed: 0.149 sec
>> Running org.apache.hadoop.hbase.regionserver.TestMinVersions
>> Tests run: 6, Failures: 0, Errors: 0, Skipped: 0, Time elapsed: 1.587 sec
>> Running org.apache.hadoop.hbase.regionserver.TestMemStoreLAB
>> Tests run: 3, Failures: 0, Errors: 0, Skipped: 0, Time elapsed: 1.418 sec
>> Running org.apache.hadoop.hbase.regionserver.TestSplitTransactionOnCluster
>> Tests run: 4, Failures: 0, Errors: 0, Skipped: 0, Time elapsed: 43.857 sec
>> Running org.apache.hadoop.hbase.regionserver.TestSplitTransaction
>> Tests run: 6, Failures: 0, Errors: 0, Skipped: 0, Time elapsed: 4.963 sec
>> Running org.apache.hadoop.hbase.regionserver.TestScanDeleteTracker
>> Tests run: 6, Failures: 0, Errors: 0, Skipped: 0, Time elapsed: 0.58 sec
>> Running org.apache.hadoop.hbase.regionserver.TestCompactSelection
>> Tests run: 1, Failures: 0, Errors: 0, Skipped: 0, Time elapsed: 0.646 sec
>> Running org.apache.hadoop.hbase.regionserver.TestStoreFileBlockCacheSummary
>> Tests run: 1, Failures: 0, Errors: 0, Skipped: 0, Time elapsed: 16.241 sec
>> Running org.apache.hadoop.hbase.regionserver.TestMemStore
>> Tests run: 21, Failures: 0, Errors: 0, Skipped: 0, Time elapsed: 30.839 sec
>> Running org.apache.hadoop.hbase.regionserver.TestGetClosestAtOrBefore
>> Tests run: 3, Failures: 0, Errors: 0, Skipped: 0, Time elapsed: 17.19 sec
>> Running org.apache.hadoop.hbase.regionserver.TestScanWithBloomError
>> Tests run: 3, Failures: 0, Errors: 0, Skipped: 0, Time elapsed: 1.281 sec
>> Running org.apache.hadoop.hbase.regionserver.TestKeyValueSkipListSet
>> Tests run: 4, Failures: 0, Errors: 0, Skipped: 0, Time elapsed: 0.12 sec
>> Running org.apache.hadoop.hbase.regionserver.TestKeyValueHeap
>> Tests run: 3, Failures: 0, Errors: 0, Skipped: 0, Time elapsed: 0.473 sec
>> Running org.apache.hadoop.hbase.regionserver.TestScanner
>> Tests run: 6, Failures: 0, Errors: 0, Skipped: 0, Time elapsed: 59.122 sec
>> Running org.apache.hadoop.hbase.regionserver.TestRegionSplitPolicy
>> Tests run: 3, Failures: 0, Errors: 0, Skipped: 0, Time elapsed: 0.822 sec
>> Running org.apache.hadoop.hbase.regionserver.TestMultiColumnScanner
>> Tests run: 6, Failures: 0, Errors: 0, Skipped: 0, Time elapsed: 25.169 sec
>> Running org.apache.hadoop.hbase.regionserver.TestHRegionInfo
>> Tests run: 3, Failures: 0, Errors: 0, Skipped: 0, Time elapsed: 0.606 sec
>> Running org.apache.hadoop.hbase.regionserver.handler.TestCloseRegionHandler
>> Tests run: 1, Failures: 0, Errors: 0, Skipped: 0, Time elapsed: 0.847 sec
>> Running org.apache.hadoop.hbase.regionserver.handler.TestOpenRegionHandler
>> Tests run: 3, Failures: 0, Errors: 0, Skipped: 0, Time elapsed: 0.967 sec
>> Running org.apache.hadoop.hbase.regionserver.TestMasterAddressManager
>> Tests run: 1, Failures: 0, Errors: 0, Skipped: 0, Time elapsed: 0.519 sec
>> Running org.apache.hadoop.hbase.regionserver.TestSplitLogWorker
>> Tests run: 5, Failures: 0, Errors: 0, Skipped: 0, Time elapsed: 2.095 sec
>> Running org.apache.hadoop.hbase.regionserver.TestSeekOptimizations
>> Tests run: 6, Failures: 0, Errors: 0, Skipped: 0, Time elapsed: 4.998 sec
>> Running org.apache.hadoop.hbase.regionserver.TestFSErrorsExposed
>> Tests run: 3, Failures: 0, Errors: 0, Skipped: 0, Time elapsed: 43.046 sec
>> Running org.apache.hadoop.hbase.TestHServerAddress
>> Tests run: 6, Failures: 0, Errors: 0, Skipped: 0, Time elapsed: 0.076 sec
>> Running org.apache.hadoop.hbase.filter.TestColumnRangeFilter
>> Tests run: 1, Failures: 0, Errors: 0, Skipped: 0, Time elapsed: 36.903 sec
>> Running org.apache.hadoop.hbase.filter.TestColumnPaginationFilter
>> Tests run: 1, Failures: 0, Errors: 0, Skipped: 0, Time elapsed: 0.275 sec
>> Running org.apache.hadoop.hbase.filter.TestPageFilter
>> Tests run: 2, Failures: 0, Errors: 0, Skipped: 0, Time elapsed: 0.031 sec
>> Running org.apache.hadoop.hbase.filter.TestParseFilter
>> Tests run: 33, Failures: 0, Errors: 0, Skipped: 0, Time elapsed: 0.452 sec
>> Running org.apache.hadoop.hbase.filter.TestRandomRowFilter
>> Tests run: 2, Failures: 0, Errors: 0, Skipped: 0, Time elapsed: 0.635 sec
>> Running org.apache.hadoop.hbase.filter.TestPrefixFilter
>> Tests run: 3, Failures: 0, Errors: 0, Skipped: 0, Time elapsed: 0.112 sec
>> Running org.apache.hadoop.hbase.filter.TestBitComparator
>> Tests run: 3, Failures: 0, Errors: 0, Skipped: 0, Time elapsed: 0.038 sec
>> Running org.apache.hadoop.hbase.filter.TestDependentColumnFilter
>> Tests run: 2, Failures: 0, Errors: 0, Skipped: 0, Time elapsed: 1.131 sec
>> Running org.apache.hadoop.hbase.filter.TestSingleColumnValueFilter
>> Tests run: 2, Failures: 0, Errors: 0, Skipped: 0, Time elapsed: 0.191 sec
>> Running org.apache.hadoop.hbase.filter.TestInclusiveStopFilter
>> Tests run: 2, Failures: 0, Errors: 0, Skipped: 0, Time elapsed: 0.111 sec
>> Running org.apache.hadoop.hbase.filter.TestFilterList
>> Tests run: 5, Failures: 0, Errors: 0, Skipped: 0, Time elapsed: 0.263 sec
>> Running org.apache.hadoop.hbase.filter.TestFilter
>> Tests run: 18, Failures: 0, Errors: 0, Skipped: 0, Time elapsed: 5.572 sec
>> Running org.apache.hadoop.hbase.filter.TestMultipleColumnPrefixFilter
>> Tests run: 3, Failures: 0, Errors: 0, Skipped: 0, Time elapsed: 3.799 sec
>> Running org.apache.hadoop.hbase.filter.TestColumnPrefixFilter
>> Tests run: 2, Failures: 0, Errors: 0, Skipped: 0, Time elapsed: 2.864 sec
>> Running org.apache.hadoop.hbase.filter.TestSingleColumnValueExcludeFilter
>> Tests run: 1, Failures: 0, Errors: 0, Skipped: 0, Time elapsed: 0.115 sec
>> Running org.apache.hadoop.hbase.TestGlobalMemStoreSize
>> Tests run: 1, Failures: 0, Errors: 0, Skipped: 0, Time elapsed: 16.704 sec
>> Running org.apache.hadoop.hbase.TestHBaseTestingUtility
>> Tests run: 6, Failures: 0, Errors: 0, Skipped: 0, Time elapsed: 72.422 sec
>> Running org.apache.hadoop.hbase.security.TestUser
>> Tests run: 3, Failures: 0, Errors: 0, Skipped: 0, Time elapsed: 0.354 sec
>> Running org.apache.hadoop.hbase.TestMultiVersions
>> Tests run: 3, Failures: 0, Errors: 0, Skipped: 0, Time elapsed: 29.209 sec
>> Running org.apache.hadoop.hbase.TestRegionRebalancing
>> Tests run: 1, Failures: 0, Errors: 0, Skipped: 0, Time elapsed: 61.878 sec
>> Running org.apache.hadoop.hbase.replication.TestReplication
>> Tests run: 7, Failures: 0, Errors: 0, Skipped: 0, Time elapsed: 103.222 sec
>> Running org.apache.hadoop.hbase.replication.TestMasterReplication
>> Tests run: 2, Failures: 0, Errors: 0, Skipped: 0, Time elapsed: 80.589 sec
>> Running org.apache.hadoop.hbase.replication.regionserver.TestReplicationSourceManager
>> Tests run: 1, Failures: 0, Errors: 0, Skipped: 0, Time elapsed: 0.925 sec
>> Running org.apache.hadoop.hbase.replication.regionserver.TestReplicationSink
>> Tests run: 5, Failures: 0, Errors: 0, Skipped: 0, Time elapsed: 21.077 sec
>> Running org.apache.hadoop.hbase.replication.TestReplicationPeer
>> Tests run: 1, Failures: 0, Errors: 0, Skipped: 0, Time elapsed: 25.531 sec
>> Running org.apache.hadoop.hbase.replication.TestMultiSlaveReplication
>> Tests run: 1, Failures: 0, Errors: 0, Skipped: 0, Time elapsed: 55.247 sec
>> Running org.apache.hadoop.hbase.replication.TestReplicationSource
>> Tests run: 1, Failures: 0, Errors: 0, Skipped: 0, Time elapsed: 1.822 sec
>> Running org.apache.hadoop.hbase.avro.TestAvroServer
>> Tests run: 3, Failures: 1, Errors: 2, Skipped: 0, Time elapsed: 32.773 sec <<<
FAILURE!
>> Running org.apache.hadoop.hbase.avro.TestAvroUtil
>> Tests run: 1, Failures: 0, Errors: 0, Skipped: 0, Time elapsed: 0.888 sec
>> Running org.apache.hadoop.hbase.TestAcidGuarantees
>> Tests run: 3, Failures: 0, Errors: 0, Skipped: 3, Time elapsed: 0.078 sec
>> Running org.apache.hadoop.hbase.TestKeyValue
>> Tests run: 11, Failures: 0, Errors: 0, Skipped: 0, Time elapsed: 0.146 sec
>> Running org.apache.hadoop.hbase.coprocessor.TestRegionServerCoprocessorExceptionWithRemove
>> Tests run: 1, Failures: 0, Errors: 0, Skipped: 0, Time elapsed: 24.656 sec
>> Running org.apache.hadoop.hbase.coprocessor.TestRegionObserverInterface
>> Tests run: 5, Failures: 0, Errors: 0, Skipped: 0, Time elapsed: 40.947 sec
>> Running org.apache.hadoop.hbase.coprocessor.TestCoprocessorInterface
>> Tests run: 1, Failures: 0, Errors: 0, Skipped: 0, Time elapsed: 4.139 sec
>> Running org.apache.hadoop.hbase.coprocessor.TestMasterObserver
>> Tests run: 3, Failures: 0, Errors: 0, Skipped: 0, Time elapsed: 28.671 sec
>> Running org.apache.hadoop.hbase.coprocessor.TestCoprocessorEndpoint
>> Tests run: 2, Failures: 0, Errors: 0, Skipped: 0, Time elapsed: 26.6 sec
>> Running org.apache.hadoop.hbase.coprocessor.TestWALObserver
>> Tests run: 3, Failures: 0, Errors: 0, Skipped: 0, Time elapsed: 27.73 sec
>> Running org.apache.hadoop.hbase.coprocessor.TestRegionObserverBypass
>> Tests run: 2, Failures: 0, Errors: 0, Skipped: 0, Time elapsed: 16.26 sec
>> Running org.apache.hadoop.hbase.coprocessor.TestMasterCoprocessorExceptionWithAbort
>> Tests run: 1, Failures: 0, Errors: 0, Skipped: 0, Time elapsed: 18.402 sec
>> Running org.apache.hadoop.hbase.coprocessor.TestRegionServerCoprocessorExceptionWithAbort
>> Tests run: 1, Failures: 0, Errors: 0, Skipped: 0, Time elapsed: 23.604 sec
>> Running org.apache.hadoop.hbase.coprocessor.TestAggregateProtocol
>> Tests run: 44, Failures: 0, Errors: 0, Skipped: 0, Time elapsed: 25.455 sec
>> Running org.apache.hadoop.hbase.coprocessor.TestMasterCoprocessorExceptionWithRemove
>> Tests run: 1, Failures: 0, Errors: 0, Skipped: 0, Time elapsed: 25.839 sec
>> Running org.apache.hadoop.hbase.coprocessor.TestRegionObserverStacking
>> Tests run: 1, Failures: 0, Errors: 0, Skipped: 0, Time elapsed: 0.68 sec
>> Running org.apache.hadoop.hbase.coprocessor.TestClassLoading
>> Tests run: 3, Failures: 0, Errors: 0, Skipped: 0, Time elapsed: 25.923 sec
>> Running org.apache.hadoop.hbase.mapred.TestTableMapReduce
>> Tests run: 1, Failures: 0, Errors: 0, Skipped: 0, Time elapsed: 42.048 sec
>> Running org.apache.hadoop.hbase.mapred.TestTableInputFormat
>> Tests run: 6, Failures: 0, Errors: 0, Skipped: 0, Time elapsed: 24.425 sec
>> Running org.apache.hadoop.hbase.TestServerName
>> Tests run: 2, Failures: 0, Errors: 0, Skipped: 0, Time elapsed: 0.055 sec
>> Running org.apache.hadoop.hbase.master.TestActiveMasterManager
>> Tests run: 2, Failures: 0, Errors: 0, Skipped: 0, Time elapsed: 0.725 sec
>> Running org.apache.hadoop.hbase.master.TestMasterFailover
>> Tests run: 4, Failures: 0, Errors: 0, Skipped: 0, Time elapsed: 102.611 sec
>> Running org.apache.hadoop.hbase.master.TestMasterRestartAfterDisablingTable
>> Tests run: 1, Failures: 0, Errors: 0, Skipped: 0, Time elapsed: 23.254 sec
>> Running org.apache.hadoop.hbase.master.TestCatalogJanitor
>> Tests run: 3, Failures: 0, Errors: 0, Skipped: 0, Time elapsed: 4.36 sec
>> Running org.apache.hadoop.hbase.master.TestRollingRestart
>> Tests run: 1, Failures: 0, Errors: 0, Skipped: 0, Time elapsed: 55.123 sec
>> Running org.apache.hadoop.hbase.master.TestMasterTransitions
>> Tests run: 3, Failures: 0, Errors: 0, Skipped: 3, Time elapsed: 27.045 sec
>> Running org.apache.hadoop.hbase.master.TestRestartCluster
>> Tests run: 2, Failures: 0, Errors: 0, Skipped: 0, Time elapsed: 60.251 sec
>> Running org.apache.hadoop.hbase.master.TestMasterStatusServlet
>> Tests run: 5, Failures: 0, Errors: 0, Skipped: 0, Time elapsed: 1.046 sec
>> Running org.apache.hadoop.hbase.master.TestClockSkewDetection
>> Tests run: 1, Failures: 0, Errors: 0, Skipped: 0, Time elapsed: 0.26 sec
>> Running org.apache.hadoop.hbase.master.TestDefaultLoadBalancer
>> Tests run: 4, Failures: 0, Errors: 0, Skipped: 0, Time elapsed: 1.679 sec
>> Running org.apache.hadoop.hbase.master.TestHMasterRPCException
>> Tests run: 1, Failures: 0, Errors: 0, Skipped: 0, Time elapsed: 1.082 sec
>> Running org.apache.hadoop.hbase.master.TestDistributedLogSplitting
>> Tests run: 4, Failures: 0, Errors: 0, Skipped: 0, Time elapsed: 120.233 sec
>> Running org.apache.hadoop.hbase.master.TestMaster
>> Tests run: 1, Failures: 0, Errors: 0, Skipped: 0, Time elapsed: 80.379 sec
>> Running org.apache.hadoop.hbase.master.TestSplitLogManager
>> Tests run: 10, Failures: 0, Errors: 0, Skipped: 0, Time elapsed: 13.914 sec
>> Running org.apache.hadoop.hbase.master.TestDeadServer
>> Tests run: 1, Failures: 0, Errors: 0, Skipped: 0, Time elapsed: 0.068 sec
>> Running org.apache.hadoop.hbase.master.TestLogsCleaner
>> Tests run: 1, Failures: 0, Errors: 0, Skipped: 0, Time elapsed: 1.277 sec
>> Running org.apache.hadoop.hbase.master.TestZKBasedOpenCloseRegion
>> Tests run: 3, Failures: 0, Errors: 0, Skipped: 0, Time elapsed: 22.818 sec
>> 
>> Results :
>> 
>> Failed tests:   testTableAdminAndMetadata(org.apache.hadoop.hbase.avro.TestAvroServer)
>> 
>> Tests in error:
>>  testFamilyAdminAndMetadata(org.apache.hadoop.hbase.avro.TestAvroServer)
>>  testDML(org.apache.hadoop.hbase.avro.TestAvroServer)
>> 
>> Tests run: 1021, Failures: 1, Errors: 2, Skipped: 9
>> 
>> [INFO] ------------------------------------------------------------------------
>> [INFO] BUILD FAILURE
>> [INFO] ------------------------------------------------------------------------
>> [INFO] Total time: 1:54:21.914s
>> [INFO] Finished at: Sat Oct 08 07:34:32 UTC 2011
>> [INFO] Final Memory: 45M/685M
>> [INFO] ------------------------------------------------------------------------
>> [ERROR] Failed to execute goal org.apache.maven.plugins:maven-surefire-plugin:2.9:test
(default-test) on project hbase: Failure or timeout -> [Help 1]
>> org.apache.maven.lifecycle.LifecycleExecutionException: Failed to execute goal org.apache.maven.plugins:maven-surefire-plugin:2.9:test
(default-test) on project hbase: Failure or timeout
>>        at org.apache.maven.lifecycle.internal.MojoExecutor.execute(MojoExecutor.java:217)
>>        at org.apache.maven.lifecycle.internal.MojoExecutor.execute(MojoExecutor.java:153)
>>        at org.apache.maven.lifecycle.internal.MojoExecutor.execute(MojoExecutor.java:145)
>>        at org.apache.maven.lifecycle.internal.MojoExecutor.executeForkedExecutions(MojoExecutor.java:365)
>>        at org.apache.maven.lifecycle.internal.MojoExecutor.execute(MojoExecutor.java:199)
>>        at org.apache.maven.lifecycle.internal.MojoExecutor.execute(MojoExecutor.java:153)
>>        at org.apache.maven.lifecycle.internal.MojoExecutor.execute(MojoExecutor.java:145)
>>        at org.apache.maven.lifecycle.internal.LifecycleModuleBuilder.buildProject(LifecycleModuleBuilder.java:84)
>>        at org.apache.maven.lifecycle.internal.LifecycleModuleBuilder.buildProject(LifecycleModuleBuilder.java:59)
>>        at org.apache.maven.lifecycle.internal.LifecycleStarter.singleThreadedBuild(LifecycleStarter.java:183)
>>        at org.apache.maven.lifecycle.internal.LifecycleStarter.execute(LifecycleStarter.java:161)
>>        at org.apache.maven.DefaultMaven.doExecute(DefaultMaven.java:319)
>>        at org.apache.maven.DefaultMaven.execute(DefaultMaven.java:156)
>>        at org.apache.maven.cli.MavenCli.execute(MavenCli.java:537)
>>        at org.apache.maven.cli.MavenCli.doMain(MavenCli.java:196)
>>        at org.apache.maven.cli.MavenCli.main(MavenCli.java:141)
>>        at sun.reflect.NativeMethodAccessorImpl.invoke0(Native Method)
>>        at sun.reflect.NativeMethodAccessorImpl.invoke(NativeMethodAccessorImpl.java:39)
>>        at sun.reflect.DelegatingMethodAccessorImpl.invoke(DelegatingMethodAccessorImpl.java:25)
>>        at java.lang.reflect.Method.invoke(Method.java:597)
>>        at org.codehaus.plexus.classworlds.launcher.Launcher.launchEnhanced(Launcher.java:290)
>>        at org.codehaus.plexus.classworlds.launcher.Launcher.launch(Launcher.java:230)
>>        at org.codehaus.plexus.classworlds.launcher.Launcher.mainWithExitCode(Launcher.java:409)
>>        at org.codehaus.plexus.classworlds.launcher.Launcher.main(Launcher.java:352)
>> Caused by: org.apache.maven.plugin.MojoExecutionException: Failure or timeout
>>        at org.apache.maven.plugin.surefire.SurefirePlugin.assertNoFailureOrTimeout(SurefirePlugin.java:623)
>>        at org.apache.maven.plugin.surefire.SurefirePlugin.handleSummary(SurefirePlugin.java:604)
>>        at org.apache.maven.plugin.surefire.AbstractSurefireMojo.executeAfterPreconditionsChecked(AbstractSurefireMojo.java:136)
>>        at org.apache.maven.plugin.surefire.AbstractSurefireMojo.execute(AbstractSurefireMojo.java:97)
>>        at org.apache.maven.plugin.DefaultBuildPluginManager.executeMojo(DefaultBuildPluginManager.java:101)
>>        at org.apache.maven.lifecycle.internal.MojoExecutor.execute(MojoExecutor.java:209)
>>        ... 23 more
>> [ERROR]
>> [ERROR] Re-run Maven using the -X switch to enable full debug logging.
>> [ERROR]
>> [ERROR] For more information about the errors and possible solutions, please read
the following articles:
>> [ERROR] [Help 1] http://cwiki.apache.org/confluence/display/MAVEN/MojoExecutionException
>> Build step 'Invoke top-level Maven targets' marked build as failure
>> [locks-and-latches] Releasing all the locks
>> [locks-and-latches] All the locks released
>> Archiving artifacts
>> Recording test results
>> 
>> 

Mime
View raw message