hbase-dev mailing list archives

Site index · List index
Message view « Date » · « Thread »
Top « Date » · « Thread »
From Apache Jenkins Server <jenk...@builds.apache.org>
Subject Build failed in Jenkins: HBase-0.92 #50
Date Fri, 07 Oct 2011 06:41:41 GMT
See <https://builds.apache.org/job/HBase-0.92/50/>

------------------------------------------
[...truncated 6092 lines...]
Tests run: 33, Failures: 0, Errors: 0, Skipped: 0, Time elapsed: 0.359 sec
Forking command line: /bin/sh -c cd <https://builds.apache.org/job/HBase-0.92/ws/trunk>
&& /home/jenkins/tools/java/jdk1.6.0_20-32/jre/bin/java -enableassertions -Xmx1400m
-jar <https://builds.apache.org/job/HBase-0.92/ws/trunk/target/surefire/surefirebooter8504511485643687857.jar>
<https://builds.apache.org/job/HBase-0.92/ws/trunk/target/surefire/surefire3873495002226059300tmp>
<https://builds.apache.org/job/HBase-0.92/ws/trunk/target/surefire/surefire4783300595863382783tmp>
Running org.apache.hadoop.hbase.filter.TestRandomRowFilter
Tests run: 2, Failures: 0, Errors: 0, Skipped: 0, Time elapsed: 0.625 sec
Forking command line: /bin/sh -c cd <https://builds.apache.org/job/HBase-0.92/ws/trunk>
&& /home/jenkins/tools/java/jdk1.6.0_20-32/jre/bin/java -enableassertions -Xmx1400m
-jar <https://builds.apache.org/job/HBase-0.92/ws/trunk/target/surefire/surefirebooter967222277740553087.jar>
<https://builds.apache.org/job/HBase-0.92/ws/trunk/target/surefire/surefire7936195538173073763tmp>
<https://builds.apache.org/job/HBase-0.92/ws/trunk/target/surefire/surefire1660609253573617768tmp>
Running org.apache.hadoop.hbase.filter.TestPrefixFilter
Tests run: 3, Failures: 0, Errors: 0, Skipped: 0, Time elapsed: 0.109 sec
Forking command line: /bin/sh -c cd <https://builds.apache.org/job/HBase-0.92/ws/trunk>
&& /home/jenkins/tools/java/jdk1.6.0_20-32/jre/bin/java -enableassertions -Xmx1400m
-jar <https://builds.apache.org/job/HBase-0.92/ws/trunk/target/surefire/surefirebooter7796665231079466149.jar>
<https://builds.apache.org/job/HBase-0.92/ws/trunk/target/surefire/surefire665083959084663305tmp>
<https://builds.apache.org/job/HBase-0.92/ws/trunk/target/surefire/surefire1321732209567032502tmp>
Running org.apache.hadoop.hbase.filter.TestBitComparator
Tests run: 3, Failures: 0, Errors: 0, Skipped: 0, Time elapsed: 0.03 sec
Forking command line: /bin/sh -c cd <https://builds.apache.org/job/HBase-0.92/ws/trunk>
&& /home/jenkins/tools/java/jdk1.6.0_20-32/jre/bin/java -enableassertions -Xmx1400m
-jar <https://builds.apache.org/job/HBase-0.92/ws/trunk/target/surefire/surefirebooter5742635405893183953.jar>
<https://builds.apache.org/job/HBase-0.92/ws/trunk/target/surefire/surefire4591545436735122711tmp>
<https://builds.apache.org/job/HBase-0.92/ws/trunk/target/surefire/surefire8341305606933067652tmp>
Running org.apache.hadoop.hbase.filter.TestDependentColumnFilter
Tests run: 2, Failures: 0, Errors: 0, Skipped: 0, Time elapsed: 0.856 sec
Forking command line: /bin/sh -c cd <https://builds.apache.org/job/HBase-0.92/ws/trunk>
&& /home/jenkins/tools/java/jdk1.6.0_20-32/jre/bin/java -enableassertions -Xmx1400m
-jar <https://builds.apache.org/job/HBase-0.92/ws/trunk/target/surefire/surefirebooter522872635990905004.jar>
<https://builds.apache.org/job/HBase-0.92/ws/trunk/target/surefire/surefire8510597671119820209tmp>
<https://builds.apache.org/job/HBase-0.92/ws/trunk/target/surefire/surefire4839990181254251094tmp>
Running org.apache.hadoop.hbase.filter.TestSingleColumnValueFilter
Tests run: 2, Failures: 0, Errors: 0, Skipped: 0, Time elapsed: 0.162 sec
Forking command line: /bin/sh -c cd <https://builds.apache.org/job/HBase-0.92/ws/trunk>
&& /home/jenkins/tools/java/jdk1.6.0_20-32/jre/bin/java -enableassertions -Xmx1400m
-jar <https://builds.apache.org/job/HBase-0.92/ws/trunk/target/surefire/surefirebooter991536871514443180.jar>
<https://builds.apache.org/job/HBase-0.92/ws/trunk/target/surefire/surefire1482719629502792868tmp>
<https://builds.apache.org/job/HBase-0.92/ws/trunk/target/surefire/surefire8220747796567595163tmp>
Running org.apache.hadoop.hbase.filter.TestInclusiveStopFilter
Tests run: 2, Failures: 0, Errors: 0, Skipped: 0, Time elapsed: 0.123 sec
Forking command line: /bin/sh -c cd <https://builds.apache.org/job/HBase-0.92/ws/trunk>
&& /home/jenkins/tools/java/jdk1.6.0_20-32/jre/bin/java -enableassertions -Xmx1400m
-jar <https://builds.apache.org/job/HBase-0.92/ws/trunk/target/surefire/surefirebooter1881281838347659374.jar>
<https://builds.apache.org/job/HBase-0.92/ws/trunk/target/surefire/surefire5397269044909335396tmp>
<https://builds.apache.org/job/HBase-0.92/ws/trunk/target/surefire/surefire3548552223416177864tmp>
Running org.apache.hadoop.hbase.filter.TestFilterList
Tests run: 5, Failures: 0, Errors: 0, Skipped: 0, Time elapsed: 0.265 sec
Forking command line: /bin/sh -c cd <https://builds.apache.org/job/HBase-0.92/ws/trunk>
&& /home/jenkins/tools/java/jdk1.6.0_20-32/jre/bin/java -enableassertions -Xmx1400m
-jar <https://builds.apache.org/job/HBase-0.92/ws/trunk/target/surefire/surefirebooter321451883003712209.jar>
<https://builds.apache.org/job/HBase-0.92/ws/trunk/target/surefire/surefire388001720566603963tmp>
<https://builds.apache.org/job/HBase-0.92/ws/trunk/target/surefire/surefire6764842148195323993tmp>
Running org.apache.hadoop.hbase.filter.TestFilter
Tests run: 18, Failures: 0, Errors: 0, Skipped: 0, Time elapsed: 5.083 sec
Forking command line: /bin/sh -c cd <https://builds.apache.org/job/HBase-0.92/ws/trunk>
&& /home/jenkins/tools/java/jdk1.6.0_20-32/jre/bin/java -enableassertions -Xmx1400m
-jar <https://builds.apache.org/job/HBase-0.92/ws/trunk/target/surefire/surefirebooter7533397880213063682.jar>
<https://builds.apache.org/job/HBase-0.92/ws/trunk/target/surefire/surefire3326181764315809371tmp>
<https://builds.apache.org/job/HBase-0.92/ws/trunk/target/surefire/surefire7744160690896159344tmp>
Running org.apache.hadoop.hbase.filter.TestMultipleColumnPrefixFilter
Tests run: 3, Failures: 0, Errors: 0, Skipped: 0, Time elapsed: 3.862 sec
Forking command line: /bin/sh -c cd <https://builds.apache.org/job/HBase-0.92/ws/trunk>
&& /home/jenkins/tools/java/jdk1.6.0_20-32/jre/bin/java -enableassertions -Xmx1400m
-jar <https://builds.apache.org/job/HBase-0.92/ws/trunk/target/surefire/surefirebooter7681609567944351553.jar>
<https://builds.apache.org/job/HBase-0.92/ws/trunk/target/surefire/surefire950512134780250984tmp>
<https://builds.apache.org/job/HBase-0.92/ws/trunk/target/surefire/surefire2384663260904348547tmp>
Running org.apache.hadoop.hbase.filter.TestColumnPrefixFilter
Tests run: 2, Failures: 0, Errors: 0, Skipped: 0, Time elapsed: 2.828 sec
Forking command line: /bin/sh -c cd <https://builds.apache.org/job/HBase-0.92/ws/trunk>
&& /home/jenkins/tools/java/jdk1.6.0_20-32/jre/bin/java -enableassertions -Xmx1400m
-jar <https://builds.apache.org/job/HBase-0.92/ws/trunk/target/surefire/surefirebooter2631529092191333950.jar>
<https://builds.apache.org/job/HBase-0.92/ws/trunk/target/surefire/surefire394997735370706438tmp>
<https://builds.apache.org/job/HBase-0.92/ws/trunk/target/surefire/surefire1304383314773807219tmp>
Running org.apache.hadoop.hbase.filter.TestSingleColumnValueExcludeFilter
Tests run: 1, Failures: 0, Errors: 0, Skipped: 0, Time elapsed: 0.124 sec
Forking command line: /bin/sh -c cd <https://builds.apache.org/job/HBase-0.92/ws/trunk>
&& /home/jenkins/tools/java/jdk1.6.0_20-32/jre/bin/java -enableassertions -Xmx1400m
-jar <https://builds.apache.org/job/HBase-0.92/ws/trunk/target/surefire/surefirebooter6901266923746417654.jar>
<https://builds.apache.org/job/HBase-0.92/ws/trunk/target/surefire/surefire6383047929548409729tmp>
<https://builds.apache.org/job/HBase-0.92/ws/trunk/target/surefire/surefire1486708903899854942tmp>
Running org.apache.hadoop.hbase.TestGlobalMemStoreSize
Tests run: 1, Failures: 0, Errors: 0, Skipped: 0, Time elapsed: 18.888 sec
Forking command line: /bin/sh -c cd <https://builds.apache.org/job/HBase-0.92/ws/trunk>
&& /home/jenkins/tools/java/jdk1.6.0_20-32/jre/bin/java -enableassertions -Xmx1400m
-jar <https://builds.apache.org/job/HBase-0.92/ws/trunk/target/surefire/surefirebooter5615063106291236965.jar>
<https://builds.apache.org/job/HBase-0.92/ws/trunk/target/surefire/surefire254084801566089104tmp>
<https://builds.apache.org/job/HBase-0.92/ws/trunk/target/surefire/surefire5035129953289068239tmp>
Running org.apache.hadoop.hbase.TestHBaseTestingUtility
Tests run: 6, Failures: 0, Errors: 0, Skipped: 0, Time elapsed: 61.687 sec
Forking command line: /bin/sh -c cd <https://builds.apache.org/job/HBase-0.92/ws/trunk>
&& /home/jenkins/tools/java/jdk1.6.0_20-32/jre/bin/java -enableassertions -Xmx1400m
-jar <https://builds.apache.org/job/HBase-0.92/ws/trunk/target/surefire/surefirebooter172598960852148151.jar>
<https://builds.apache.org/job/HBase-0.92/ws/trunk/target/surefire/surefire794981288152005142tmp>
<https://builds.apache.org/job/HBase-0.92/ws/trunk/target/surefire/surefire682399743155712256tmp>
Running org.apache.hadoop.hbase.security.TestUser
Tests run: 3, Failures: 0, Errors: 0, Skipped: 0, Time elapsed: 0.327 sec
Forking command line: /bin/sh -c cd <https://builds.apache.org/job/HBase-0.92/ws/trunk>
&& /home/jenkins/tools/java/jdk1.6.0_20-32/jre/bin/java -enableassertions -Xmx1400m
-jar <https://builds.apache.org/job/HBase-0.92/ws/trunk/target/surefire/surefirebooter8474465880574964524.jar>
<https://builds.apache.org/job/HBase-0.92/ws/trunk/target/surefire/surefire117348162648503171tmp>
<https://builds.apache.org/job/HBase-0.92/ws/trunk/target/surefire/surefire5525781989052923132tmp>
Running org.apache.hadoop.hbase.TestMultiVersions
Tests run: 3, Failures: 0, Errors: 0, Skipped: 0, Time elapsed: 28.595 sec
Forking command line: /bin/sh -c cd <https://builds.apache.org/job/HBase-0.92/ws/trunk>
&& /home/jenkins/tools/java/jdk1.6.0_20-32/jre/bin/java -enableassertions -Xmx1400m
-jar <https://builds.apache.org/job/HBase-0.92/ws/trunk/target/surefire/surefirebooter6863741961689919363.jar>
<https://builds.apache.org/job/HBase-0.92/ws/trunk/target/surefire/surefire6391344568716097032tmp>
<https://builds.apache.org/job/HBase-0.92/ws/trunk/target/surefire/surefire7688514659840427342tmp>
Running org.apache.hadoop.hbase.TestRegionRebalancing
Tests run: 1, Failures: 0, Errors: 0, Skipped: 0, Time elapsed: 37.408 sec
Forking command line: /bin/sh -c cd <https://builds.apache.org/job/HBase-0.92/ws/trunk>
&& /home/jenkins/tools/java/jdk1.6.0_20-32/jre/bin/java -enableassertions -Xmx1400m
-jar <https://builds.apache.org/job/HBase-0.92/ws/trunk/target/surefire/surefirebooter2713001999863979701.jar>
<https://builds.apache.org/job/HBase-0.92/ws/trunk/target/surefire/surefire8628955291235916987tmp>
<https://builds.apache.org/job/HBase-0.92/ws/trunk/target/surefire/surefire2976186559200795468tmp>
Running org.apache.hadoop.hbase.replication.TestReplication
Tests run: 7, Failures: 0, Errors: 0, Skipped: 0, Time elapsed: 108.912 sec
Forking command line: /bin/sh -c cd <https://builds.apache.org/job/HBase-0.92/ws/trunk>
&& /home/jenkins/tools/java/jdk1.6.0_20-32/jre/bin/java -enableassertions -Xmx1400m
-jar <https://builds.apache.org/job/HBase-0.92/ws/trunk/target/surefire/surefirebooter106316314186123509.jar>
<https://builds.apache.org/job/HBase-0.92/ws/trunk/target/surefire/surefire8562067180757663917tmp>
<https://builds.apache.org/job/HBase-0.92/ws/trunk/target/surefire/surefire8203859499510683379tmp>
Running org.apache.hadoop.hbase.replication.TestMasterReplication
Tests run: 2, Failures: 0, Errors: 0, Skipped: 0, Time elapsed: 80.499 sec
Forking command line: /bin/sh -c cd <https://builds.apache.org/job/HBase-0.92/ws/trunk>
&& /home/jenkins/tools/java/jdk1.6.0_20-32/jre/bin/java -enableassertions -Xmx1400m
-jar <https://builds.apache.org/job/HBase-0.92/ws/trunk/target/surefire/surefirebooter6236169233359372268.jar>
<https://builds.apache.org/job/HBase-0.92/ws/trunk/target/surefire/surefire1419546813510192tmp>
<https://builds.apache.org/job/HBase-0.92/ws/trunk/target/surefire/surefire8762722527755424409tmp>
Running org.apache.hadoop.hbase.replication.regionserver.TestReplicationSourceManager
Tests run: 1, Failures: 0, Errors: 0, Skipped: 0, Time elapsed: 0.904 sec
Forking command line: /bin/sh -c cd <https://builds.apache.org/job/HBase-0.92/ws/trunk>
&& /home/jenkins/tools/java/jdk1.6.0_20-32/jre/bin/java -enableassertions -Xmx1400m
-jar <https://builds.apache.org/job/HBase-0.92/ws/trunk/target/surefire/surefirebooter1561830389647198013.jar>
<https://builds.apache.org/job/HBase-0.92/ws/trunk/target/surefire/surefire4455095159325035591tmp>
<https://builds.apache.org/job/HBase-0.92/ws/trunk/target/surefire/surefire2351033512020904373tmp>
Running org.apache.hadoop.hbase.replication.regionserver.TestReplicationSink
Tests run: 5, Failures: 0, Errors: 0, Skipped: 0, Time elapsed: 24.732 sec
Forking command line: /bin/sh -c cd <https://builds.apache.org/job/HBase-0.92/ws/trunk>
&& /home/jenkins/tools/java/jdk1.6.0_20-32/jre/bin/java -enableassertions -Xmx1400m
-jar <https://builds.apache.org/job/HBase-0.92/ws/trunk/target/surefire/surefirebooter3546899137832632131.jar>
<https://builds.apache.org/job/HBase-0.92/ws/trunk/target/surefire/surefire2978201592122529110tmp>
<https://builds.apache.org/job/HBase-0.92/ws/trunk/target/surefire/surefire7618423119520211732tmp>
Running org.apache.hadoop.hbase.replication.TestReplicationPeer
Tests run: 1, Failures: 0, Errors: 0, Skipped: 0, Time elapsed: 25.482 sec
Forking command line: /bin/sh -c cd <https://builds.apache.org/job/HBase-0.92/ws/trunk>
&& /home/jenkins/tools/java/jdk1.6.0_20-32/jre/bin/java -enableassertions -Xmx1400m
-jar <https://builds.apache.org/job/HBase-0.92/ws/trunk/target/surefire/surefirebooter6122175564327739896.jar>
<https://builds.apache.org/job/HBase-0.92/ws/trunk/target/surefire/surefire5830380225174953080tmp>
<https://builds.apache.org/job/HBase-0.92/ws/trunk/target/surefire/surefire6612558729040684727tmp>
Running org.apache.hadoop.hbase.replication.TestMultiSlaveReplication
Tests run: 1, Failures: 0, Errors: 0, Skipped: 0, Time elapsed: 55.16 sec
Forking command line: /bin/sh -c cd <https://builds.apache.org/job/HBase-0.92/ws/trunk>
&& /home/jenkins/tools/java/jdk1.6.0_20-32/jre/bin/java -enableassertions -Xmx1400m
-jar <https://builds.apache.org/job/HBase-0.92/ws/trunk/target/surefire/surefirebooter281140091154268794.jar>
<https://builds.apache.org/job/HBase-0.92/ws/trunk/target/surefire/surefire6875353596543702660tmp>
<https://builds.apache.org/job/HBase-0.92/ws/trunk/target/surefire/surefire197229498870613930tmp>
Running org.apache.hadoop.hbase.replication.TestReplicationSource
Tests run: 1, Failures: 0, Errors: 0, Skipped: 0, Time elapsed: 3.004 sec
Forking command line: /bin/sh -c cd <https://builds.apache.org/job/HBase-0.92/ws/trunk>
&& /home/jenkins/tools/java/jdk1.6.0_20-32/jre/bin/java -enableassertions -Xmx1400m
-jar <https://builds.apache.org/job/HBase-0.92/ws/trunk/target/surefire/surefirebooter2772939150129665989.jar>
<https://builds.apache.org/job/HBase-0.92/ws/trunk/target/surefire/surefire6787844689502063996tmp>
<https://builds.apache.org/job/HBase-0.92/ws/trunk/target/surefire/surefire7189355132586195893tmp>
Running org.apache.hadoop.hbase.avro.TestAvroServer
Tests run: 3, Failures: 0, Errors: 0, Skipped: 0, Time elapsed: 32.436 sec
Forking command line: /bin/sh -c cd <https://builds.apache.org/job/HBase-0.92/ws/trunk>
&& /home/jenkins/tools/java/jdk1.6.0_20-32/jre/bin/java -enableassertions -Xmx1400m
-jar <https://builds.apache.org/job/HBase-0.92/ws/trunk/target/surefire/surefirebooter5918259298143606967.jar>
<https://builds.apache.org/job/HBase-0.92/ws/trunk/target/surefire/surefire974538538628156712tmp>
<https://builds.apache.org/job/HBase-0.92/ws/trunk/target/surefire/surefire2263679272565166039tmp>
Running org.apache.hadoop.hbase.avro.TestAvroUtil
Tests run: 1, Failures: 0, Errors: 0, Skipped: 0, Time elapsed: 0.691 sec
Forking command line: /bin/sh -c cd <https://builds.apache.org/job/HBase-0.92/ws/trunk>
&& /home/jenkins/tools/java/jdk1.6.0_20-32/jre/bin/java -enableassertions -Xmx1400m
-jar <https://builds.apache.org/job/HBase-0.92/ws/trunk/target/surefire/surefirebooter7999547853322756148.jar>
<https://builds.apache.org/job/HBase-0.92/ws/trunk/target/surefire/surefire2081262357070457868tmp>
<https://builds.apache.org/job/HBase-0.92/ws/trunk/target/surefire/surefire1729846548022713826tmp>
Running org.apache.hadoop.hbase.TestAcidGuarantees
Tests run: 3, Failures: 0, Errors: 0, Skipped: 3, Time elapsed: 0.067 sec
Forking command line: /bin/sh -c cd <https://builds.apache.org/job/HBase-0.92/ws/trunk>
&& /home/jenkins/tools/java/jdk1.6.0_20-32/jre/bin/java -enableassertions -Xmx1400m
-jar <https://builds.apache.org/job/HBase-0.92/ws/trunk/target/surefire/surefirebooter2133459476978011409.jar>
<https://builds.apache.org/job/HBase-0.92/ws/trunk/target/surefire/surefire9025942565876159509tmp>
<https://builds.apache.org/job/HBase-0.92/ws/trunk/target/surefire/surefire8449881064706440138tmp>
Running org.apache.hadoop.hbase.TestKeyValue
Tests run: 11, Failures: 0, Errors: 0, Skipped: 0, Time elapsed: 0.131 sec
Forking command line: /bin/sh -c cd <https://builds.apache.org/job/HBase-0.92/ws/trunk>
&& /home/jenkins/tools/java/jdk1.6.0_20-32/jre/bin/java -enableassertions -Xmx1400m
-jar <https://builds.apache.org/job/HBase-0.92/ws/trunk/target/surefire/surefirebooter1909546012044866583.jar>
<https://builds.apache.org/job/HBase-0.92/ws/trunk/target/surefire/surefire3131925057385197872tmp>
<https://builds.apache.org/job/HBase-0.92/ws/trunk/target/surefire/surefire5443874473676596516tmp>
Running org.apache.hadoop.hbase.coprocessor.TestRegionServerCoprocessorExceptionWithRemove
Tests run: 1, Failures: 0, Errors: 0, Skipped: 0, Time elapsed: 28.658 sec
Forking command line: /bin/sh -c cd <https://builds.apache.org/job/HBase-0.92/ws/trunk>
&& /home/jenkins/tools/java/jdk1.6.0_20-32/jre/bin/java -enableassertions -Xmx1400m
-jar <https://builds.apache.org/job/HBase-0.92/ws/trunk/target/surefire/surefirebooter6121437005544290154.jar>
<https://builds.apache.org/job/HBase-0.92/ws/trunk/target/surefire/surefire7198786680558066818tmp>
<https://builds.apache.org/job/HBase-0.92/ws/trunk/target/surefire/surefire123379257951594673tmp>
Running org.apache.hadoop.hbase.coprocessor.TestRegionObserverInterface
Tests run: 5, Failures: 0, Errors: 0, Skipped: 0, Time elapsed: 34.745 sec
Forking command line: /bin/sh -c cd <https://builds.apache.org/job/HBase-0.92/ws/trunk>
&& /home/jenkins/tools/java/jdk1.6.0_20-32/jre/bin/java -enableassertions -Xmx1400m
-jar <https://builds.apache.org/job/HBase-0.92/ws/trunk/target/surefire/surefirebooter2259793387382282064.jar>
<https://builds.apache.org/job/HBase-0.92/ws/trunk/target/surefire/surefire6556353349308257262tmp>
<https://builds.apache.org/job/HBase-0.92/ws/trunk/target/surefire/surefire632647348837165060tmp>
Running org.apache.hadoop.hbase.coprocessor.TestCoprocessorInterface
Tests run: 1, Failures: 0, Errors: 0, Skipped: 0, Time elapsed: 4.077 sec
Forking command line: /bin/sh -c cd <https://builds.apache.org/job/HBase-0.92/ws/trunk>
&& /home/jenkins/tools/java/jdk1.6.0_20-32/jre/bin/java -enableassertions -Xmx1400m
-jar <https://builds.apache.org/job/HBase-0.92/ws/trunk/target/surefire/surefirebooter7031710311296350710.jar>
<https://builds.apache.org/job/HBase-0.92/ws/trunk/target/surefire/surefire6769555592441787065tmp>
<https://builds.apache.org/job/HBase-0.92/ws/trunk/target/surefire/surefire7272025381172126154tmp>
Running org.apache.hadoop.hbase.coprocessor.TestMasterObserver
Tests run: 3, Failures: 0, Errors: 0, Skipped: 0, Time elapsed: 31.596 sec
Forking command line: /bin/sh -c cd <https://builds.apache.org/job/HBase-0.92/ws/trunk>
&& /home/jenkins/tools/java/jdk1.6.0_20-32/jre/bin/java -enableassertions -Xmx1400m
-jar <https://builds.apache.org/job/HBase-0.92/ws/trunk/target/surefire/surefirebooter8676424600983023916.jar>
<https://builds.apache.org/job/HBase-0.92/ws/trunk/target/surefire/surefire918635877254743375tmp>
<https://builds.apache.org/job/HBase-0.92/ws/trunk/target/surefire/surefire8269385204262887150tmp>
Running org.apache.hadoop.hbase.coprocessor.TestCoprocessorEndpoint
Tests run: 2, Failures: 0, Errors: 0, Skipped: 0, Time elapsed: 25.614 sec
Forking command line: /bin/sh -c cd <https://builds.apache.org/job/HBase-0.92/ws/trunk>
&& /home/jenkins/tools/java/jdk1.6.0_20-32/jre/bin/java -enableassertions -Xmx1400m
-jar <https://builds.apache.org/job/HBase-0.92/ws/trunk/target/surefire/surefirebooter2930809726566068919.jar>
<https://builds.apache.org/job/HBase-0.92/ws/trunk/target/surefire/surefire4735568541928607143tmp>
<https://builds.apache.org/job/HBase-0.92/ws/trunk/target/surefire/surefire5997845599172253163tmp>
Running org.apache.hadoop.hbase.coprocessor.TestWALObserver
Tests run: 3, Failures: 0, Errors: 0, Skipped: 0, Time elapsed: 18.051 sec
Forking command line: /bin/sh -c cd <https://builds.apache.org/job/HBase-0.92/ws/trunk>
&& /home/jenkins/tools/java/jdk1.6.0_20-32/jre/bin/java -enableassertions -Xmx1400m
-jar <https://builds.apache.org/job/HBase-0.92/ws/trunk/target/surefire/surefirebooter5145218160475777198.jar>
<https://builds.apache.org/job/HBase-0.92/ws/trunk/target/surefire/surefire8562556440648911958tmp>
<https://builds.apache.org/job/HBase-0.92/ws/trunk/target/surefire/surefire1621468934037836418tmp>
Running org.apache.hadoop.hbase.coprocessor.TestRegionObserverBypass
Tests run: 2, Failures: 0, Errors: 0, Skipped: 0, Time elapsed: 21.359 sec
Forking command line: /bin/sh -c cd <https://builds.apache.org/job/HBase-0.92/ws/trunk>
&& /home/jenkins/tools/java/jdk1.6.0_20-32/jre/bin/java -enableassertions -Xmx1400m
-jar <https://builds.apache.org/job/HBase-0.92/ws/trunk/target/surefire/surefirebooter3283888868718154837.jar>
<https://builds.apache.org/job/HBase-0.92/ws/trunk/target/surefire/surefire485547352240631438tmp>
<https://builds.apache.org/job/HBase-0.92/ws/trunk/target/surefire/surefire394575440988282544tmp>
Running org.apache.hadoop.hbase.coprocessor.TestMasterCoprocessorExceptionWithAbort
Tests run: 1, Failures: 0, Errors: 0, Skipped: 0, Time elapsed: 22.227 sec
Forking command line: /bin/sh -c cd <https://builds.apache.org/job/HBase-0.92/ws/trunk>
&& /home/jenkins/tools/java/jdk1.6.0_20-32/jre/bin/java -enableassertions -Xmx1400m
-jar <https://builds.apache.org/job/HBase-0.92/ws/trunk/target/surefire/surefirebooter1161506506253553705.jar>
<https://builds.apache.org/job/HBase-0.92/ws/trunk/target/surefire/surefire5338873450970253031tmp>
<https://builds.apache.org/job/HBase-0.92/ws/trunk/target/surefire/surefire7705419867889638041tmp>
Running org.apache.hadoop.hbase.coprocessor.TestRegionServerCoprocessorExceptionWithAbort
Tests run: 1, Failures: 0, Errors: 0, Skipped: 0, Time elapsed: 17.466 sec
Forking command line: /bin/sh -c cd <https://builds.apache.org/job/HBase-0.92/ws/trunk>
&& /home/jenkins/tools/java/jdk1.6.0_20-32/jre/bin/java -enableassertions -Xmx1400m
-jar <https://builds.apache.org/job/HBase-0.92/ws/trunk/target/surefire/surefirebooter808218423137703293.jar>
<https://builds.apache.org/job/HBase-0.92/ws/trunk/target/surefire/surefire1816699416682403900tmp>
<https://builds.apache.org/job/HBase-0.92/ws/trunk/target/surefire/surefire7452898808983598021tmp>
Running org.apache.hadoop.hbase.coprocessor.TestAggregateProtocol
Tests run: 44, Failures: 0, Errors: 0, Skipped: 0, Time elapsed: 20.499 sec
Forking command line: /bin/sh -c cd <https://builds.apache.org/job/HBase-0.92/ws/trunk>
&& /home/jenkins/tools/java/jdk1.6.0_20-32/jre/bin/java -enableassertions -Xmx1400m
-jar <https://builds.apache.org/job/HBase-0.92/ws/trunk/target/surefire/surefirebooter6558118745384817736.jar>
<https://builds.apache.org/job/HBase-0.92/ws/trunk/target/surefire/surefire7936282761973830313tmp>
<https://builds.apache.org/job/HBase-0.92/ws/trunk/target/surefire/surefire5587735268776834148tmp>
Running org.apache.hadoop.hbase.coprocessor.TestMasterCoprocessorExceptionWithRemove
Tests run: 1, Failures: 0, Errors: 0, Skipped: 0, Time elapsed: 22.369 sec
Forking command line: /bin/sh -c cd <https://builds.apache.org/job/HBase-0.92/ws/trunk>
&& /home/jenkins/tools/java/jdk1.6.0_20-32/jre/bin/java -enableassertions -Xmx1400m
-jar <https://builds.apache.org/job/HBase-0.92/ws/trunk/target/surefire/surefirebooter6414802163027570155.jar>
<https://builds.apache.org/job/HBase-0.92/ws/trunk/target/surefire/surefire5587664630016210632tmp>
<https://builds.apache.org/job/HBase-0.92/ws/trunk/target/surefire/surefire7501295040702170375tmp>
Running org.apache.hadoop.hbase.coprocessor.TestRegionObserverStacking
Tests run: 1, Failures: 0, Errors: 0, Skipped: 0, Time elapsed: 0.616 sec
Forking command line: /bin/sh -c cd <https://builds.apache.org/job/HBase-0.92/ws/trunk>
&& /home/jenkins/tools/java/jdk1.6.0_20-32/jre/bin/java -enableassertions -Xmx1400m
-jar <https://builds.apache.org/job/HBase-0.92/ws/trunk/target/surefire/surefirebooter386129742353650230.jar>
<https://builds.apache.org/job/HBase-0.92/ws/trunk/target/surefire/surefire672729833181360174tmp>
<https://builds.apache.org/job/HBase-0.92/ws/trunk/target/surefire/surefire1087390946433526147tmp>
Running org.apache.hadoop.hbase.coprocessor.TestClassLoading
Tests run: 3, Failures: 0, Errors: 0, Skipped: 0, Time elapsed: 22.873 sec
Forking command line: /bin/sh -c cd <https://builds.apache.org/job/HBase-0.92/ws/trunk>
&& /home/jenkins/tools/java/jdk1.6.0_20-32/jre/bin/java -enableassertions -Xmx1400m
-jar <https://builds.apache.org/job/HBase-0.92/ws/trunk/target/surefire/surefirebooter457072542205877147.jar>
<https://builds.apache.org/job/HBase-0.92/ws/trunk/target/surefire/surefire8483914279802955391tmp>
<https://builds.apache.org/job/HBase-0.92/ws/trunk/target/surefire/surefire4671993010299647436tmp>
Running org.apache.hadoop.hbase.mapred.TestTableMapReduce
Tests run: 1, Failures: 0, Errors: 0, Skipped: 0, Time elapsed: 40.125 sec
Forking command line: /bin/sh -c cd <https://builds.apache.org/job/HBase-0.92/ws/trunk>
&& /home/jenkins/tools/java/jdk1.6.0_20-32/jre/bin/java -enableassertions -Xmx1400m
-jar <https://builds.apache.org/job/HBase-0.92/ws/trunk/target/surefire/surefirebooter6469181098322854347.jar>
<https://builds.apache.org/job/HBase-0.92/ws/trunk/target/surefire/surefire7007708581942967344tmp>
<https://builds.apache.org/job/HBase-0.92/ws/trunk/target/surefire/surefire9211356737066471979tmp>
Running org.apache.hadoop.hbase.mapred.TestTableInputFormat
Tests run: 6, Failures: 0, Errors: 0, Skipped: 0, Time elapsed: 20.702 sec
Forking command line: /bin/sh -c cd <https://builds.apache.org/job/HBase-0.92/ws/trunk>
&& /home/jenkins/tools/java/jdk1.6.0_20-32/jre/bin/java -enableassertions -Xmx1400m
-jar <https://builds.apache.org/job/HBase-0.92/ws/trunk/target/surefire/surefirebooter5363973274543759577.jar>
<https://builds.apache.org/job/HBase-0.92/ws/trunk/target/surefire/surefire4435310741528802211tmp>
<https://builds.apache.org/job/HBase-0.92/ws/trunk/target/surefire/surefire8148666358933755847tmp>
Running org.apache.hadoop.hbase.TestServerName
Tests run: 2, Failures: 0, Errors: 0, Skipped: 0, Time elapsed: 0.057 sec
Forking command line: /bin/sh -c cd <https://builds.apache.org/job/HBase-0.92/ws/trunk>
&& /home/jenkins/tools/java/jdk1.6.0_20-32/jre/bin/java -enableassertions -Xmx1400m
-jar <https://builds.apache.org/job/HBase-0.92/ws/trunk/target/surefire/surefirebooter6265696740333398759.jar>
<https://builds.apache.org/job/HBase-0.92/ws/trunk/target/surefire/surefire7682829858339645254tmp>
<https://builds.apache.org/job/HBase-0.92/ws/trunk/target/surefire/surefire3235326735318979061tmp>
Running org.apache.hadoop.hbase.master.TestActiveMasterManager
Tests run: 2, Failures: 0, Errors: 0, Skipped: 0, Time elapsed: 0.721 sec
Forking command line: /bin/sh -c cd <https://builds.apache.org/job/HBase-0.92/ws/trunk>
&& /home/jenkins/tools/java/jdk1.6.0_20-32/jre/bin/java -enableassertions -Xmx1400m
-jar <https://builds.apache.org/job/HBase-0.92/ws/trunk/target/surefire/surefirebooter4427938662275788507.jar>
<https://builds.apache.org/job/HBase-0.92/ws/trunk/target/surefire/surefire3523117281814113973tmp>
<https://builds.apache.org/job/HBase-0.92/ws/trunk/target/surefire/surefire5134560596322643417tmp>
Running org.apache.hadoop.hbase.master.TestMasterFailover
Tests run: 4, Failures: 0, Errors: 0, Skipped: 0, Time elapsed: 152.365 sec
Forking command line: /bin/sh -c cd <https://builds.apache.org/job/HBase-0.92/ws/trunk>
&& /home/jenkins/tools/java/jdk1.6.0_20-32/jre/bin/java -enableassertions -Xmx1400m
-jar <https://builds.apache.org/job/HBase-0.92/ws/trunk/target/surefire/surefirebooter606752359021761970.jar>
<https://builds.apache.org/job/HBase-0.92/ws/trunk/target/surefire/surefire7642457632927130571tmp>
<https://builds.apache.org/job/HBase-0.92/ws/trunk/target/surefire/surefire8221804856878248300tmp>
Running org.apache.hadoop.hbase.master.TestMasterRestartAfterDisablingTable
Tests run: 1, Failures: 0, Errors: 0, Skipped: 0, Time elapsed: 30.018 sec
Forking command line: /bin/sh -c cd <https://builds.apache.org/job/HBase-0.92/ws/trunk>
&& /home/jenkins/tools/java/jdk1.6.0_20-32/jre/bin/java -enableassertions -Xmx1400m
-jar <https://builds.apache.org/job/HBase-0.92/ws/trunk/target/surefire/surefirebooter6202313611251200890.jar>
<https://builds.apache.org/job/HBase-0.92/ws/trunk/target/surefire/surefire2175165930084589906tmp>
<https://builds.apache.org/job/HBase-0.92/ws/trunk/target/surefire/surefire4626228247910420943tmp>
Running org.apache.hadoop.hbase.master.TestCatalogJanitor
Tests run: 3, Failures: 0, Errors: 0, Skipped: 0, Time elapsed: 4.372 sec
Forking command line: /bin/sh -c cd <https://builds.apache.org/job/HBase-0.92/ws/trunk>
&& /home/jenkins/tools/java/jdk1.6.0_20-32/jre/bin/java -enableassertions -Xmx1400m
-jar <https://builds.apache.org/job/HBase-0.92/ws/trunk/target/surefire/surefirebooter4024297338092444750.jar>
<https://builds.apache.org/job/HBase-0.92/ws/trunk/target/surefire/surefire7243204200103202908tmp>
<https://builds.apache.org/job/HBase-0.92/ws/trunk/target/surefire/surefire4491839364655785475tmp>
Running org.apache.hadoop.hbase.master.TestRollingRestart
Tests run: 1, Failures: 0, Errors: 0, Skipped: 0, Time elapsed: 62.863 sec
Forking command line: /bin/sh -c cd <https://builds.apache.org/job/HBase-0.92/ws/trunk>
&& /home/jenkins/tools/java/jdk1.6.0_20-32/jre/bin/java -enableassertions -Xmx1400m
-jar <https://builds.apache.org/job/HBase-0.92/ws/trunk/target/surefire/surefirebooter7368596755215928067.jar>
<https://builds.apache.org/job/HBase-0.92/ws/trunk/target/surefire/surefire1252711913137986062tmp>
<https://builds.apache.org/job/HBase-0.92/ws/trunk/target/surefire/surefire6792331329056725829tmp>
Running org.apache.hadoop.hbase.master.TestMasterTransitions
Tests run: 3, Failures: 0, Errors: 0, Skipped: 3, Time elapsed: 34.395 sec
Forking command line: /bin/sh -c cd <https://builds.apache.org/job/HBase-0.92/ws/trunk>
&& /home/jenkins/tools/java/jdk1.6.0_20-32/jre/bin/java -enableassertions -Xmx1400m
-jar <https://builds.apache.org/job/HBase-0.92/ws/trunk/target/surefire/surefirebooter5956703618719747269.jar>
<https://builds.apache.org/job/HBase-0.92/ws/trunk/target/surefire/surefire4588655735885063541tmp>
<https://builds.apache.org/job/HBase-0.92/ws/trunk/target/surefire/surefire8878575000727407050tmp>
Running org.apache.hadoop.hbase.master.TestRestartCluster
Tests run: 2, Failures: 0, Errors: 0, Skipped: 0, Time elapsed: 52.274 sec
Forking command line: /bin/sh -c cd <https://builds.apache.org/job/HBase-0.92/ws/trunk>
&& /home/jenkins/tools/java/jdk1.6.0_20-32/jre/bin/java -enableassertions -Xmx1400m
-jar <https://builds.apache.org/job/HBase-0.92/ws/trunk/target/surefire/surefirebooter4536389545432635851.jar>
<https://builds.apache.org/job/HBase-0.92/ws/trunk/target/surefire/surefire3277768840397692675tmp>
<https://builds.apache.org/job/HBase-0.92/ws/trunk/target/surefire/surefire4680912228828132164tmp>
Running org.apache.hadoop.hbase.master.TestMasterStatusServlet
Tests run: 5, Failures: 0, Errors: 0, Skipped: 0, Time elapsed: 1.245 sec
Forking command line: /bin/sh -c cd <https://builds.apache.org/job/HBase-0.92/ws/trunk>
&& /home/jenkins/tools/java/jdk1.6.0_20-32/jre/bin/java -enableassertions -Xmx1400m
-jar <https://builds.apache.org/job/HBase-0.92/ws/trunk/target/surefire/surefirebooter3856174060835633637.jar>
<https://builds.apache.org/job/HBase-0.92/ws/trunk/target/surefire/surefire194681413953736239tmp>
<https://builds.apache.org/job/HBase-0.92/ws/trunk/target/surefire/surefire532695710677415596tmp>
Running org.apache.hadoop.hbase.master.TestClockSkewDetection
Tests run: 1, Failures: 0, Errors: 0, Skipped: 0, Time elapsed: 0.255 sec
Forking command line: /bin/sh -c cd <https://builds.apache.org/job/HBase-0.92/ws/trunk>
&& /home/jenkins/tools/java/jdk1.6.0_20-32/jre/bin/java -enableassertions -Xmx1400m
-jar <https://builds.apache.org/job/HBase-0.92/ws/trunk/target/surefire/surefirebooter2249226454065298207.jar>
<https://builds.apache.org/job/HBase-0.92/ws/trunk/target/surefire/surefire1648122542995645630tmp>
<https://builds.apache.org/job/HBase-0.92/ws/trunk/target/surefire/surefire6812276635677156272tmp>
Running org.apache.hadoop.hbase.master.TestDefaultLoadBalancer
Tests run: 4, Failures: 0, Errors: 0, Skipped: 0, Time elapsed: 1.583 sec
Forking command line: /bin/sh -c cd <https://builds.apache.org/job/HBase-0.92/ws/trunk>
&& /home/jenkins/tools/java/jdk1.6.0_20-32/jre/bin/java -enableassertions -Xmx1400m
-jar <https://builds.apache.org/job/HBase-0.92/ws/trunk/target/surefire/surefirebooter3305428789004862480.jar>
<https://builds.apache.org/job/HBase-0.92/ws/trunk/target/surefire/surefire475867915064159919tmp>
<https://builds.apache.org/job/HBase-0.92/ws/trunk/target/surefire/surefire8904863182131571590tmp>
Running org.apache.hadoop.hbase.master.TestHMasterRPCException
Tests run: 1, Failures: 0, Errors: 0, Skipped: 0, Time elapsed: 1.051 sec
Forking command line: /bin/sh -c cd <https://builds.apache.org/job/HBase-0.92/ws/trunk>
&& /home/jenkins/tools/java/jdk1.6.0_20-32/jre/bin/java -enableassertions -Xmx1400m
-jar <https://builds.apache.org/job/HBase-0.92/ws/trunk/target/surefire/surefirebooter1586515708488096394.jar>
<https://builds.apache.org/job/HBase-0.92/ws/trunk/target/surefire/surefire7530090022677149291tmp>
<https://builds.apache.org/job/HBase-0.92/ws/trunk/target/surefire/surefire7839483078348800198tmp>
Running org.apache.hadoop.hbase.master.TestDistributedLogSplitting
Tests run: 4, Failures: 0, Errors: 0, Skipped: 0, Time elapsed: 120.933 sec
Forking command line: /bin/sh -c cd <https://builds.apache.org/job/HBase-0.92/ws/trunk>
&& /home/jenkins/tools/java/jdk1.6.0_20-32/jre/bin/java -enableassertions -Xmx1400m
-jar <https://builds.apache.org/job/HBase-0.92/ws/trunk/target/surefire/surefirebooter2742024115928790354.jar>
<https://builds.apache.org/job/HBase-0.92/ws/trunk/target/surefire/surefire5682975411538151847tmp>
<https://builds.apache.org/job/HBase-0.92/ws/trunk/target/surefire/surefire3666878617213697160tmp>
Running org.apache.hadoop.hbase.master.TestMaster
Tests run: 1, Failures: 0, Errors: 0, Skipped: 0, Time elapsed: 81.93 sec
Forking command line: /bin/sh -c cd <https://builds.apache.org/job/HBase-0.92/ws/trunk>
&& /home/jenkins/tools/java/jdk1.6.0_20-32/jre/bin/java -enableassertions -Xmx1400m
-jar <https://builds.apache.org/job/HBase-0.92/ws/trunk/target/surefire/surefirebooter4451929343231325797.jar>
<https://builds.apache.org/job/HBase-0.92/ws/trunk/target/surefire/surefire992209862203533058tmp>
<https://builds.apache.org/job/HBase-0.92/ws/trunk/target/surefire/surefire4244359154093437369tmp>
Running org.apache.hadoop.hbase.master.TestSplitLogManager
Tests run: 10, Failures: 0, Errors: 0, Skipped: 0, Time elapsed: 13.881 sec
Forking command line: /bin/sh -c cd <https://builds.apache.org/job/HBase-0.92/ws/trunk>
&& /home/jenkins/tools/java/jdk1.6.0_20-32/jre/bin/java -enableassertions -Xmx1400m
-jar <https://builds.apache.org/job/HBase-0.92/ws/trunk/target/surefire/surefirebooter2142465159863749403.jar>
<https://builds.apache.org/job/HBase-0.92/ws/trunk/target/surefire/surefire5552419935066856799tmp>
<https://builds.apache.org/job/HBase-0.92/ws/trunk/target/surefire/surefire7630703362422992554tmp>
Running org.apache.hadoop.hbase.master.TestDeadServer
Tests run: 1, Failures: 0, Errors: 0, Skipped: 0, Time elapsed: 0.056 sec
Forking command line: /bin/sh -c cd <https://builds.apache.org/job/HBase-0.92/ws/trunk>
&& /home/jenkins/tools/java/jdk1.6.0_20-32/jre/bin/java -enableassertions -Xmx1400m
-jar <https://builds.apache.org/job/HBase-0.92/ws/trunk/target/surefire/surefirebooter3104728285755131198.jar>
<https://builds.apache.org/job/HBase-0.92/ws/trunk/target/surefire/surefire1358760501142073153tmp>
<https://builds.apache.org/job/HBase-0.92/ws/trunk/target/surefire/surefire2571018072637315798tmp>
Running org.apache.hadoop.hbase.master.TestLogsCleaner
Tests run: 1, Failures: 0, Errors: 0, Skipped: 0, Time elapsed: 1.303 sec
Forking command line: /bin/sh -c cd <https://builds.apache.org/job/HBase-0.92/ws/trunk>
&& /home/jenkins/tools/java/jdk1.6.0_20-32/jre/bin/java -enableassertions -Xmx1400m
-jar <https://builds.apache.org/job/HBase-0.92/ws/trunk/target/surefire/surefirebooter2333095276358150442.jar>
<https://builds.apache.org/job/HBase-0.92/ws/trunk/target/surefire/surefire4145961324152937285tmp>
<https://builds.apache.org/job/HBase-0.92/ws/trunk/target/surefire/surefire2748340950652000262tmp>
Running org.apache.hadoop.hbase.master.TestZKBasedOpenCloseRegion
Tests run: 3, Failures: 0, Errors: 0, Skipped: 0, Time elapsed: 40.903 sec

Results :

Tests in error: 
  testShouldNotCreateTheSameTableDescriptorIfForcefulCreationIsFalse(org.apache.hadoop.hbase.TestFSTableDescriptorForceCreation):
Unable to delete hdfs://localhost:47362/user/jenkins/testAlreadyExists/testAlreadyExists/.tableinfo
while forcefully writing the table descriptor.
  testRemoves(org.apache.hadoop.hbase.util.TestFSTableDescriptors): Unable to delete target/test-data/testRemoves/testRemoves/.tableinfo
while forcefully writing the table descriptor.
  testUpdates(org.apache.hadoop.hbase.util.TestFSTableDescriptors): Unable to delete target/test-data/testUpdates/testUpdates/.tableinfo
while forcefully writing the table descriptor.

Tests run: 1018, Failures: 0, Errors: 3, Skipped: 9

[INFO] ------------------------------------------------------------------------
[INFO] BUILD FAILURE
[INFO] ------------------------------------------------------------------------
[INFO] Total time: 1:49:36.121s
[INFO] Finished at: Fri Oct 07 06:40:28 UTC 2011
[INFO] Final Memory: 35M/570M
[INFO] ------------------------------------------------------------------------
[ERROR] Failed to execute goal org.apache.maven.plugins:maven-surefire-plugin:2.9:test (default-test)
on project hbase: There are test failures.
[ERROR] 
[ERROR] Please refer to <https://builds.apache.org/job/HBase-0.92/ws/trunk/target/surefire-reports>
for the individual test results.
[ERROR] -> [Help 1]
org.apache.maven.lifecycle.LifecycleExecutionException: Failed to execute goal org.apache.maven.plugins:maven-surefire-plugin:2.9:test
(default-test) on project hbase: There are test failures.

Please refer to <https://builds.apache.org/job/HBase-0.92/ws/trunk/target/surefire-reports>
for the individual test results.
	at org.apache.maven.lifecycle.internal.MojoExecutor.execute(MojoExecutor.java:213)
	at org.apache.maven.lifecycle.internal.MojoExecutor.execute(MojoExecutor.java:153)
	at org.apache.maven.lifecycle.internal.MojoExecutor.execute(MojoExecutor.java:145)
	at org.apache.maven.lifecycle.internal.MojoExecutor.executeForkedExecutions(MojoExecutor.java:365)
	at org.apache.maven.lifecycle.internal.MojoExecutor.execute(MojoExecutor.java:199)
	at org.apache.maven.lifecycle.internal.MojoExecutor.execute(MojoExecutor.java:153)
	at org.apache.maven.lifecycle.internal.MojoExecutor.execute(MojoExecutor.java:145)
	at org.apache.maven.lifecycle.internal.LifecycleModuleBuilder.buildProject(LifecycleModuleBuilder.java:84)
	at org.apache.maven.lifecycle.internal.LifecycleModuleBuilder.buildProject(LifecycleModuleBuilder.java:59)
	at org.apache.maven.lifecycle.internal.LifecycleStarter.singleThreadedBuild(LifecycleStarter.java:183)
	at org.apache.maven.lifecycle.internal.LifecycleStarter.execute(LifecycleStarter.java:161)
	at org.apache.maven.DefaultMaven.doExecute(DefaultMaven.java:319)
	at org.apache.maven.DefaultMaven.execute(DefaultMaven.java:156)
	at org.apache.maven.cli.MavenCli.execute(MavenCli.java:537)
	at org.apache.maven.cli.MavenCli.doMain(MavenCli.java:196)
	at org.apache.maven.cli.MavenCli.main(MavenCli.java:141)
	at sun.reflect.NativeMethodAccessorImpl.invoke0(Native Method)
	at sun.reflect.NativeMethodAccessorImpl.invoke(NativeMethodAccessorImpl.java:39)
	at sun.reflect.DelegatingMethodAccessorImpl.invoke(DelegatingMethodAccessorImpl.java:25)
	at java.lang.reflect.Method.invoke(Method.java:597)
	at org.codehaus.plexus.classworlds.launcher.Launcher.launchEnhanced(Launcher.java:290)
	at org.codehaus.plexus.classworlds.launcher.Launcher.launch(Launcher.java:230)
	at org.codehaus.plexus.classworlds.launcher.Launcher.mainWithExitCode(Launcher.java:409)
	at org.codehaus.plexus.classworlds.launcher.Launcher.main(Launcher.java:352)
Caused by: org.apache.maven.plugin.MojoFailureException: There are test failures.

Please refer to <https://builds.apache.org/job/HBase-0.92/ws/trunk/target/surefire-reports>
for the individual test results.
	at org.apache.maven.plugin.surefire.SurefireHelper.reportExecution(SurefireHelper.java:87)
	at org.apache.maven.plugin.surefire.SurefirePlugin.writeSummary(SurefirePlugin.java:631)
	at org.apache.maven.plugin.surefire.SurefirePlugin.handleSummary(SurefirePlugin.java:605)
	at org.apache.maven.plugin.surefire.AbstractSurefireMojo.executeAfterPreconditionsChecked(AbstractSurefireMojo.java:136)
	at org.apache.maven.plugin.surefire.AbstractSurefireMojo.execute(AbstractSurefireMojo.java:97)
	at org.apache.maven.plugin.DefaultBuildPluginManager.executeMojo(DefaultBuildPluginManager.java:101)
	at org.apache.maven.lifecycle.internal.MojoExecutor.execute(MojoExecutor.java:209)
	... 23 more
[ERROR] 
[ERROR] 
[ERROR] For more information about the errors and possible solutions, please read the following
articles:
[ERROR] [Help 1] http://cwiki.apache.org/confluence/display/MAVEN/MojoFailureException
Build step 'Invoke top-level Maven targets' marked build as failure
[locks-and-latches] Releasing all the locks
[locks-and-latches] All the locks released
Archiving artifacts
Recording test results


Mime
View raw message