hbase-dev mailing list archives

Site index · List index
Message view « Date » · « Thread »
Top « Date » · « Thread »
From Apache Jenkins Server <jenk...@builds.apache.org>
Subject Build failed in Jenkins: HBase-0.92 #75
Date Fri, 21 Oct 2011 10:06:45 GMT
See <https://builds.apache.org/job/HBase-0.92/75/changes>

Changes:

[stack] HBASE-4580 Some invalid zk nodes were created when a clean cluster restarts

[stack] HBASE-4595 HFilePrettyPrinter Scanned kv count always 0

[stack] HBASE-4604 hbase.client.TestHTablePool could start a single cluster instead of one
per method

[stack] HBASE-4510 Check and workaround usage of internal HDFS APIs in HBase

[stack] HBASE-4430 Disable TestSlabCache and TestSingleSizedCache temporarily to see if these
are cause of build box failure though all tests pass

[stack] HBASE-4430 Disable TestSlabCache and TestSingleSizedCache temporarily to see if these
are cause of build box failure though all tests pass

[ramkrishna] HBASE-4459 HbaseObjectWritable code is a byte, we will eventually run out of
codes

[stack] HBASE-4378 [hbck] Does not complain about regions with startkey==endkey.

[stack] HBASE-4486 Improve Javadoc for HTableDescriptor

[stack] HBASE-4621 TestAvroServer fails quite often intermittently

[stack] HBASE-4620 I broke the build when I submitted HBASE-3581 (Send length of the rpc response)

[tedyu] HBASE-4585 Revert for 0.92, patch is for TRUNK only

[ramkrishna] HBASE-4585 - Avoid seek operation when current kv is deleted (Liyin Tang)

------------------------------------------
[...truncated 6119 lines...]
Tests run: 2, Failures: 0, Errors: 0, Skipped: 0, Time elapsed: 0.773 sec
Forking command line: /bin/sh -c cd <https://builds.apache.org/job/HBase-0.92/ws/trunk>
&& /home/jenkins/tools/java/jdk1.6.0_27-32/jre/bin/java -enableassertions -Xmx1400m
-jar <https://builds.apache.org/job/HBase-0.92/ws/trunk/target/surefire/surefirebooter9114081268910257723.jar>
<https://builds.apache.org/job/HBase-0.92/ws/trunk/target/surefire/surefire546222304891991614tmp>
<https://builds.apache.org/job/HBase-0.92/ws/trunk/target/surefire/surefire8450998784450638345tmp>
Running org.apache.hadoop.hbase.filter.TestSingleColumnValueFilter
Tests run: 2, Failures: 0, Errors: 0, Skipped: 0, Time elapsed: 0.166 sec
Forking command line: /bin/sh -c cd <https://builds.apache.org/job/HBase-0.92/ws/trunk>
&& /home/jenkins/tools/java/jdk1.6.0_27-32/jre/bin/java -enableassertions -Xmx1400m
-jar <https://builds.apache.org/job/HBase-0.92/ws/trunk/target/surefire/surefirebooter940001169522818796.jar>
<https://builds.apache.org/job/HBase-0.92/ws/trunk/target/surefire/surefire4760596663359868781tmp>
<https://builds.apache.org/job/HBase-0.92/ws/trunk/target/surefire/surefire2309127988568253567tmp>
Running org.apache.hadoop.hbase.filter.TestInclusiveStopFilter
Tests run: 2, Failures: 0, Errors: 0, Skipped: 0, Time elapsed: 0.113 sec
Forking command line: /bin/sh -c cd <https://builds.apache.org/job/HBase-0.92/ws/trunk>
&& /home/jenkins/tools/java/jdk1.6.0_27-32/jre/bin/java -enableassertions -Xmx1400m
-jar <https://builds.apache.org/job/HBase-0.92/ws/trunk/target/surefire/surefirebooter3355243314138681047.jar>
<https://builds.apache.org/job/HBase-0.92/ws/trunk/target/surefire/surefire4291156243739238587tmp>
<https://builds.apache.org/job/HBase-0.92/ws/trunk/target/surefire/surefire758044556822868526tmp>
Running org.apache.hadoop.hbase.filter.TestFilterList
Tests run: 5, Failures: 0, Errors: 0, Skipped: 0, Time elapsed: 0.263 sec
Forking command line: /bin/sh -c cd <https://builds.apache.org/job/HBase-0.92/ws/trunk>
&& /home/jenkins/tools/java/jdk1.6.0_27-32/jre/bin/java -enableassertions -Xmx1400m
-jar <https://builds.apache.org/job/HBase-0.92/ws/trunk/target/surefire/surefirebooter4668628182585333011.jar>
<https://builds.apache.org/job/HBase-0.92/ws/trunk/target/surefire/surefire7098880658084532579tmp>
<https://builds.apache.org/job/HBase-0.92/ws/trunk/target/surefire/surefire4986479448929282212tmp>
Running org.apache.hadoop.hbase.filter.TestFilter
Tests run: 18, Failures: 0, Errors: 0, Skipped: 0, Time elapsed: 3.114 sec
Forking command line: /bin/sh -c cd <https://builds.apache.org/job/HBase-0.92/ws/trunk>
&& /home/jenkins/tools/java/jdk1.6.0_27-32/jre/bin/java -enableassertions -Xmx1400m
-jar <https://builds.apache.org/job/HBase-0.92/ws/trunk/target/surefire/surefirebooter985456896715747879.jar>
<https://builds.apache.org/job/HBase-0.92/ws/trunk/target/surefire/surefire3662304575672789262tmp>
<https://builds.apache.org/job/HBase-0.92/ws/trunk/target/surefire/surefire4706844437276599170tmp>
Running org.apache.hadoop.hbase.filter.TestMultipleColumnPrefixFilter
Tests run: 3, Failures: 0, Errors: 0, Skipped: 0, Time elapsed: 3.357 sec
Forking command line: /bin/sh -c cd <https://builds.apache.org/job/HBase-0.92/ws/trunk>
&& /home/jenkins/tools/java/jdk1.6.0_27-32/jre/bin/java -enableassertions -Xmx1400m
-jar <https://builds.apache.org/job/HBase-0.92/ws/trunk/target/surefire/surefirebooter9169759887174887737.jar>
<https://builds.apache.org/job/HBase-0.92/ws/trunk/target/surefire/surefire7947571776556431689tmp>
<https://builds.apache.org/job/HBase-0.92/ws/trunk/target/surefire/surefire1796719782598841266tmp>
Running org.apache.hadoop.hbase.filter.TestColumnPrefixFilter
Tests run: 2, Failures: 0, Errors: 0, Skipped: 0, Time elapsed: 2.533 sec
Forking command line: /bin/sh -c cd <https://builds.apache.org/job/HBase-0.92/ws/trunk>
&& /home/jenkins/tools/java/jdk1.6.0_27-32/jre/bin/java -enableassertions -Xmx1400m
-jar <https://builds.apache.org/job/HBase-0.92/ws/trunk/target/surefire/surefirebooter4764409385462456556.jar>
<https://builds.apache.org/job/HBase-0.92/ws/trunk/target/surefire/surefire7743537171877648118tmp>
<https://builds.apache.org/job/HBase-0.92/ws/trunk/target/surefire/surefire4279604825011912993tmp>
Running org.apache.hadoop.hbase.filter.TestSingleColumnValueExcludeFilter
Tests run: 1, Failures: 0, Errors: 0, Skipped: 0, Time elapsed: 0.123 sec
Forking command line: /bin/sh -c cd <https://builds.apache.org/job/HBase-0.92/ws/trunk>
&& /home/jenkins/tools/java/jdk1.6.0_27-32/jre/bin/java -enableassertions -Xmx1400m
-jar <https://builds.apache.org/job/HBase-0.92/ws/trunk/target/surefire/surefirebooter3035281157964226040.jar>
<https://builds.apache.org/job/HBase-0.92/ws/trunk/target/surefire/surefire3129926004671494835tmp>
<https://builds.apache.org/job/HBase-0.92/ws/trunk/target/surefire/surefire5951537795038830078tmp>
Running org.apache.hadoop.hbase.TestGlobalMemStoreSize
Tests run: 1, Failures: 0, Errors: 0, Skipped: 0, Time elapsed: 15.101 sec
Forking command line: /bin/sh -c cd <https://builds.apache.org/job/HBase-0.92/ws/trunk>
&& /home/jenkins/tools/java/jdk1.6.0_27-32/jre/bin/java -enableassertions -Xmx1400m
-jar <https://builds.apache.org/job/HBase-0.92/ws/trunk/target/surefire/surefirebooter2644823234639273485.jar>
<https://builds.apache.org/job/HBase-0.92/ws/trunk/target/surefire/surefire6774618199322903974tmp>
<https://builds.apache.org/job/HBase-0.92/ws/trunk/target/surefire/surefire1363883317416498392tmp>
Running org.apache.hadoop.hbase.TestHBaseTestingUtility
Tests run: 6, Failures: 0, Errors: 0, Skipped: 0, Time elapsed: 58.291 sec
Forking command line: /bin/sh -c cd <https://builds.apache.org/job/HBase-0.92/ws/trunk>
&& /home/jenkins/tools/java/jdk1.6.0_27-32/jre/bin/java -enableassertions -Xmx1400m
-jar <https://builds.apache.org/job/HBase-0.92/ws/trunk/target/surefire/surefirebooter3095149361077204927.jar>
<https://builds.apache.org/job/HBase-0.92/ws/trunk/target/surefire/surefire7609421850659822996tmp>
<https://builds.apache.org/job/HBase-0.92/ws/trunk/target/surefire/surefire1734421124106128792tmp>
Running org.apache.hadoop.hbase.security.TestUser
Tests run: 3, Failures: 0, Errors: 0, Skipped: 0, Time elapsed: 0.333 sec
Forking command line: /bin/sh -c cd <https://builds.apache.org/job/HBase-0.92/ws/trunk>
&& /home/jenkins/tools/java/jdk1.6.0_27-32/jre/bin/java -enableassertions -Xmx1400m
-jar <https://builds.apache.org/job/HBase-0.92/ws/trunk/target/surefire/surefirebooter2774085390235688394.jar>
<https://builds.apache.org/job/HBase-0.92/ws/trunk/target/surefire/surefire2181108554495626672tmp>
<https://builds.apache.org/job/HBase-0.92/ws/trunk/target/surefire/surefire4513723037661200582tmp>
Running org.apache.hadoop.hbase.TestMultiVersions
Tests run: 3, Failures: 0, Errors: 0, Skipped: 0, Time elapsed: 32.997 sec
Forking command line: /bin/sh -c cd <https://builds.apache.org/job/HBase-0.92/ws/trunk>
&& /home/jenkins/tools/java/jdk1.6.0_27-32/jre/bin/java -enableassertions -Xmx1400m
-jar <https://builds.apache.org/job/HBase-0.92/ws/trunk/target/surefire/surefirebooter3324782270300738841.jar>
<https://builds.apache.org/job/HBase-0.92/ws/trunk/target/surefire/surefire105934208853513394tmp>
<https://builds.apache.org/job/HBase-0.92/ws/trunk/target/surefire/surefire8005260959374602613tmp>
Running org.apache.hadoop.hbase.TestRegionRebalancing
Tests run: 1, Failures: 0, Errors: 0, Skipped: 0, Time elapsed: 55.316 sec
Forking command line: /bin/sh -c cd <https://builds.apache.org/job/HBase-0.92/ws/trunk>
&& /home/jenkins/tools/java/jdk1.6.0_27-32/jre/bin/java -enableassertions -Xmx1400m
-jar <https://builds.apache.org/job/HBase-0.92/ws/trunk/target/surefire/surefirebooter7535480049429592792.jar>
<https://builds.apache.org/job/HBase-0.92/ws/trunk/target/surefire/surefire971450630666109935tmp>
<https://builds.apache.org/job/HBase-0.92/ws/trunk/target/surefire/surefire3353714029820873609tmp>
Running org.apache.hadoop.hbase.replication.TestReplication
Tests run: 7, Failures: 0, Errors: 0, Skipped: 0, Time elapsed: 93.39 sec
Forking command line: /bin/sh -c cd <https://builds.apache.org/job/HBase-0.92/ws/trunk>
&& /home/jenkins/tools/java/jdk1.6.0_27-32/jre/bin/java -enableassertions -Xmx1400m
-jar <https://builds.apache.org/job/HBase-0.92/ws/trunk/target/surefire/surefirebooter6099439271507538859.jar>
<https://builds.apache.org/job/HBase-0.92/ws/trunk/target/surefire/surefire5417921935618618508tmp>
<https://builds.apache.org/job/HBase-0.92/ws/trunk/target/surefire/surefire446239829257983235tmp>
Running org.apache.hadoop.hbase.replication.TestMasterReplication
Tests run: 2, Failures: 0, Errors: 0, Skipped: 0, Time elapsed: 83.027 sec
Forking command line: /bin/sh -c cd <https://builds.apache.org/job/HBase-0.92/ws/trunk>
&& /home/jenkins/tools/java/jdk1.6.0_27-32/jre/bin/java -enableassertions -Xmx1400m
-jar <https://builds.apache.org/job/HBase-0.92/ws/trunk/target/surefire/surefirebooter6846993234805363463.jar>
<https://builds.apache.org/job/HBase-0.92/ws/trunk/target/surefire/surefire6074899414429631541tmp>
<https://builds.apache.org/job/HBase-0.92/ws/trunk/target/surefire/surefire7735519532747611277tmp>
Running org.apache.hadoop.hbase.replication.regionserver.TestReplicationSourceManager
Tests run: 1, Failures: 0, Errors: 0, Skipped: 0, Time elapsed: 0.849 sec
Forking command line: /bin/sh -c cd <https://builds.apache.org/job/HBase-0.92/ws/trunk>
&& /home/jenkins/tools/java/jdk1.6.0_27-32/jre/bin/java -enableassertions -Xmx1400m
-jar <https://builds.apache.org/job/HBase-0.92/ws/trunk/target/surefire/surefirebooter1877645768334538057.jar>
<https://builds.apache.org/job/HBase-0.92/ws/trunk/target/surefire/surefire7330620467360925994tmp>
<https://builds.apache.org/job/HBase-0.92/ws/trunk/target/surefire/surefire6188526370018748986tmp>
Running org.apache.hadoop.hbase.replication.regionserver.TestReplicationSink
Tests run: 5, Failures: 0, Errors: 0, Skipped: 0, Time elapsed: 26.489 sec
Forking command line: /bin/sh -c cd <https://builds.apache.org/job/HBase-0.92/ws/trunk>
&& /home/jenkins/tools/java/jdk1.6.0_27-32/jre/bin/java -enableassertions -Xmx1400m
-jar <https://builds.apache.org/job/HBase-0.92/ws/trunk/target/surefire/surefirebooter2704971032780087037.jar>
<https://builds.apache.org/job/HBase-0.92/ws/trunk/target/surefire/surefire1250540271260861603tmp>
<https://builds.apache.org/job/HBase-0.92/ws/trunk/target/surefire/surefire1609704643635703876tmp>
Running org.apache.hadoop.hbase.replication.TestReplicationPeer
Tests run: 1, Failures: 0, Errors: 0, Skipped: 0, Time elapsed: 25.519 sec
Forking command line: /bin/sh -c cd <https://builds.apache.org/job/HBase-0.92/ws/trunk>
&& /home/jenkins/tools/java/jdk1.6.0_27-32/jre/bin/java -enableassertions -Xmx1400m
-jar <https://builds.apache.org/job/HBase-0.92/ws/trunk/target/surefire/surefirebooter5691374660821625934.jar>
<https://builds.apache.org/job/HBase-0.92/ws/trunk/target/surefire/surefire2606241403367063658tmp>
<https://builds.apache.org/job/HBase-0.92/ws/trunk/target/surefire/surefire8411730269886665850tmp>
Running org.apache.hadoop.hbase.replication.TestMultiSlaveReplication
Tests run: 1, Failures: 0, Errors: 0, Skipped: 0, Time elapsed: 50.892 sec
Forking command line: /bin/sh -c cd <https://builds.apache.org/job/HBase-0.92/ws/trunk>
&& /home/jenkins/tools/java/jdk1.6.0_27-32/jre/bin/java -enableassertions -Xmx1400m
-jar <https://builds.apache.org/job/HBase-0.92/ws/trunk/target/surefire/surefirebooter7233065834278993404.jar>
<https://builds.apache.org/job/HBase-0.92/ws/trunk/target/surefire/surefire4641049867555767258tmp>
<https://builds.apache.org/job/HBase-0.92/ws/trunk/target/surefire/surefire6230832229929255602tmp>
Running org.apache.hadoop.hbase.replication.TestReplicationSource
Tests run: 1, Failures: 0, Errors: 0, Skipped: 0, Time elapsed: 1.684 sec
Forking command line: /bin/sh -c cd <https://builds.apache.org/job/HBase-0.92/ws/trunk>
&& /home/jenkins/tools/java/jdk1.6.0_27-32/jre/bin/java -enableassertions -Xmx1400m
-jar <https://builds.apache.org/job/HBase-0.92/ws/trunk/target/surefire/surefirebooter2631841833642950491.jar>
<https://builds.apache.org/job/HBase-0.92/ws/trunk/target/surefire/surefire8992738102845534358tmp>
<https://builds.apache.org/job/HBase-0.92/ws/trunk/target/surefire/surefire8390579531553951514tmp>
Running org.apache.hadoop.hbase.avro.TestAvroServer
Tests run: 3, Failures: 0, Errors: 0, Skipped: 0, Time elapsed: 34.234 sec
Forking command line: /bin/sh -c cd <https://builds.apache.org/job/HBase-0.92/ws/trunk>
&& /home/jenkins/tools/java/jdk1.6.0_27-32/jre/bin/java -enableassertions -Xmx1400m
-jar <https://builds.apache.org/job/HBase-0.92/ws/trunk/target/surefire/surefirebooter3631340924794012693.jar>
<https://builds.apache.org/job/HBase-0.92/ws/trunk/target/surefire/surefire3497267914258276618tmp>
<https://builds.apache.org/job/HBase-0.92/ws/trunk/target/surefire/surefire4721299581953810106tmp>
Running org.apache.hadoop.hbase.avro.TestAvroUtil
Tests run: 1, Failures: 0, Errors: 0, Skipped: 0, Time elapsed: 0.668 sec
Forking command line: /bin/sh -c cd <https://builds.apache.org/job/HBase-0.92/ws/trunk>
&& /home/jenkins/tools/java/jdk1.6.0_27-32/jre/bin/java -enableassertions -Xmx1400m
-jar <https://builds.apache.org/job/HBase-0.92/ws/trunk/target/surefire/surefirebooter8960645394421742031.jar>
<https://builds.apache.org/job/HBase-0.92/ws/trunk/target/surefire/surefire8201619717378861489tmp>
<https://builds.apache.org/job/HBase-0.92/ws/trunk/target/surefire/surefire8734675604016788203tmp>
Running org.apache.hadoop.hbase.TestAcidGuarantees
Tests run: 3, Failures: 0, Errors: 0, Skipped: 3, Time elapsed: 0.064 sec
Forking command line: /bin/sh -c cd <https://builds.apache.org/job/HBase-0.92/ws/trunk>
&& /home/jenkins/tools/java/jdk1.6.0_27-32/jre/bin/java -enableassertions -Xmx1400m
-jar <https://builds.apache.org/job/HBase-0.92/ws/trunk/target/surefire/surefirebooter2910214847204734697.jar>
<https://builds.apache.org/job/HBase-0.92/ws/trunk/target/surefire/surefire6549821131354231326tmp>
<https://builds.apache.org/job/HBase-0.92/ws/trunk/target/surefire/surefire5566255459613746130tmp>
Running org.apache.hadoop.hbase.TestKeyValue
Tests run: 11, Failures: 0, Errors: 0, Skipped: 0, Time elapsed: 0.138 sec
Forking command line: /bin/sh -c cd <https://builds.apache.org/job/HBase-0.92/ws/trunk>
&& /home/jenkins/tools/java/jdk1.6.0_27-32/jre/bin/java -enableassertions -Xmx1400m
-jar <https://builds.apache.org/job/HBase-0.92/ws/trunk/target/surefire/surefirebooter2188392300492848905.jar>
<https://builds.apache.org/job/HBase-0.92/ws/trunk/target/surefire/surefire743994281197987825tmp>
<https://builds.apache.org/job/HBase-0.92/ws/trunk/target/surefire/surefire136422753796707825tmp>
Running org.apache.hadoop.hbase.coprocessor.TestRegionServerCoprocessorExceptionWithRemove
Tests run: 1, Failures: 0, Errors: 0, Skipped: 0, Time elapsed: 23.327 sec
Forking command line: /bin/sh -c cd <https://builds.apache.org/job/HBase-0.92/ws/trunk>
&& /home/jenkins/tools/java/jdk1.6.0_27-32/jre/bin/java -enableassertions -Xmx1400m
-jar <https://builds.apache.org/job/HBase-0.92/ws/trunk/target/surefire/surefirebooter6075969793100569308.jar>
<https://builds.apache.org/job/HBase-0.92/ws/trunk/target/surefire/surefire6793029064163849029tmp>
<https://builds.apache.org/job/HBase-0.92/ws/trunk/target/surefire/surefire8327856034318021827tmp>
Running org.apache.hadoop.hbase.coprocessor.TestRegionObserverInterface
Tests run: 5, Failures: 0, Errors: 0, Skipped: 0, Time elapsed: 31.172 sec
Forking command line: /bin/sh -c cd <https://builds.apache.org/job/HBase-0.92/ws/trunk>
&& /home/jenkins/tools/java/jdk1.6.0_27-32/jre/bin/java -enableassertions -Xmx1400m
-jar <https://builds.apache.org/job/HBase-0.92/ws/trunk/target/surefire/surefirebooter3854514451422291591.jar>
<https://builds.apache.org/job/HBase-0.92/ws/trunk/target/surefire/surefire2320432026409407432tmp>
<https://builds.apache.org/job/HBase-0.92/ws/trunk/target/surefire/surefire6380359972130198934tmp>
Running org.apache.hadoop.hbase.coprocessor.TestCoprocessorInterface
Tests run: 1, Failures: 0, Errors: 0, Skipped: 0, Time elapsed: 4.079 sec
Forking command line: /bin/sh -c cd <https://builds.apache.org/job/HBase-0.92/ws/trunk>
&& /home/jenkins/tools/java/jdk1.6.0_27-32/jre/bin/java -enableassertions -Xmx1400m
-jar <https://builds.apache.org/job/HBase-0.92/ws/trunk/target/surefire/surefirebooter1376600940455844119.jar>
<https://builds.apache.org/job/HBase-0.92/ws/trunk/target/surefire/surefire1104553378484120388tmp>
<https://builds.apache.org/job/HBase-0.92/ws/trunk/target/surefire/surefire8189439198331931961tmp>
Running org.apache.hadoop.hbase.coprocessor.TestMasterObserver
Tests run: 3, Failures: 0, Errors: 0, Skipped: 0, Time elapsed: 29.406 sec
Forking command line: /bin/sh -c cd <https://builds.apache.org/job/HBase-0.92/ws/trunk>
&& /home/jenkins/tools/java/jdk1.6.0_27-32/jre/bin/java -enableassertions -Xmx1400m
-jar <https://builds.apache.org/job/HBase-0.92/ws/trunk/target/surefire/surefirebooter1509093661972137927.jar>
<https://builds.apache.org/job/HBase-0.92/ws/trunk/target/surefire/surefire1708787627120770985tmp>
<https://builds.apache.org/job/HBase-0.92/ws/trunk/target/surefire/surefire4313094154949553899tmp>
Running org.apache.hadoop.hbase.coprocessor.TestCoprocessorEndpoint
Tests run: 2, Failures: 0, Errors: 0, Skipped: 0, Time elapsed: 24.364 sec
Forking command line: /bin/sh -c cd <https://builds.apache.org/job/HBase-0.92/ws/trunk>
&& /home/jenkins/tools/java/jdk1.6.0_27-32/jre/bin/java -enableassertions -Xmx1400m
-jar <https://builds.apache.org/job/HBase-0.92/ws/trunk/target/surefire/surefirebooter6742419995435588680.jar>
<https://builds.apache.org/job/HBase-0.92/ws/trunk/target/surefire/surefire8016951014843175547tmp>
<https://builds.apache.org/job/HBase-0.92/ws/trunk/target/surefire/surefire811400487192118680tmp>
Running org.apache.hadoop.hbase.coprocessor.TestWALObserver
Tests run: 3, Failures: 0, Errors: 0, Skipped: 0, Time elapsed: 17.976 sec
Forking command line: /bin/sh -c cd <https://builds.apache.org/job/HBase-0.92/ws/trunk>
&& /home/jenkins/tools/java/jdk1.6.0_27-32/jre/bin/java -enableassertions -Xmx1400m
-jar <https://builds.apache.org/job/HBase-0.92/ws/trunk/target/surefire/surefirebooter4352446285534173348.jar>
<https://builds.apache.org/job/HBase-0.92/ws/trunk/target/surefire/surefire8505594379784858602tmp>
<https://builds.apache.org/job/HBase-0.92/ws/trunk/target/surefire/surefire5094830501122046394tmp>
Running org.apache.hadoop.hbase.coprocessor.TestRegionObserverBypass
Tests run: 2, Failures: 0, Errors: 0, Skipped: 0, Time elapsed: 16.509 sec
Forking command line: /bin/sh -c cd <https://builds.apache.org/job/HBase-0.92/ws/trunk>
&& /home/jenkins/tools/java/jdk1.6.0_27-32/jre/bin/java -enableassertions -Xmx1400m
-jar <https://builds.apache.org/job/HBase-0.92/ws/trunk/target/surefire/surefirebooter2642750343195039364.jar>
<https://builds.apache.org/job/HBase-0.92/ws/trunk/target/surefire/surefire3537727274770786001tmp>
<https://builds.apache.org/job/HBase-0.92/ws/trunk/target/surefire/surefire5527427777145183734tmp>
Running org.apache.hadoop.hbase.coprocessor.TestMasterCoprocessorExceptionWithAbort
Tests run: 1, Failures: 0, Errors: 0, Skipped: 0, Time elapsed: 18.319 sec
Forking command line: /bin/sh -c cd <https://builds.apache.org/job/HBase-0.92/ws/trunk>
&& /home/jenkins/tools/java/jdk1.6.0_27-32/jre/bin/java -enableassertions -Xmx1400m
-jar <https://builds.apache.org/job/HBase-0.92/ws/trunk/target/surefire/surefirebooter2930844148409786751.jar>
<https://builds.apache.org/job/HBase-0.92/ws/trunk/target/surefire/surefire4485248687657183550tmp>
<https://builds.apache.org/job/HBase-0.92/ws/trunk/target/surefire/surefire1402688402008976070tmp>
Running org.apache.hadoop.hbase.coprocessor.TestRegionServerCoprocessorExceptionWithAbort
Tests run: 1, Failures: 0, Errors: 0, Skipped: 0, Time elapsed: 20.648 sec
Forking command line: /bin/sh -c cd <https://builds.apache.org/job/HBase-0.92/ws/trunk>
&& /home/jenkins/tools/java/jdk1.6.0_27-32/jre/bin/java -enableassertions -Xmx1400m
-jar <https://builds.apache.org/job/HBase-0.92/ws/trunk/target/surefire/surefirebooter6521770240369281022.jar>
<https://builds.apache.org/job/HBase-0.92/ws/trunk/target/surefire/surefire9081676706890725832tmp>
<https://builds.apache.org/job/HBase-0.92/ws/trunk/target/surefire/surefire2845165942362276859tmp>
Running org.apache.hadoop.hbase.coprocessor.TestAggregateProtocol
Tests run: 44, Failures: 0, Errors: 0, Skipped: 0, Time elapsed: 21.268 sec
Forking command line: /bin/sh -c cd <https://builds.apache.org/job/HBase-0.92/ws/trunk>
&& /home/jenkins/tools/java/jdk1.6.0_27-32/jre/bin/java -enableassertions -Xmx1400m
-jar <https://builds.apache.org/job/HBase-0.92/ws/trunk/target/surefire/surefirebooter3346000816603119932.jar>
<https://builds.apache.org/job/HBase-0.92/ws/trunk/target/surefire/surefire4915589030811076362tmp>
<https://builds.apache.org/job/HBase-0.92/ws/trunk/target/surefire/surefire947592034941831523tmp>
Running org.apache.hadoop.hbase.coprocessor.TestMasterCoprocessorExceptionWithRemove
Tests run: 1, Failures: 0, Errors: 0, Skipped: 0, Time elapsed: 22.287 sec
Forking command line: /bin/sh -c cd <https://builds.apache.org/job/HBase-0.92/ws/trunk>
&& /home/jenkins/tools/java/jdk1.6.0_27-32/jre/bin/java -enableassertions -Xmx1400m
-jar <https://builds.apache.org/job/HBase-0.92/ws/trunk/target/surefire/surefirebooter8981520367112577504.jar>
<https://builds.apache.org/job/HBase-0.92/ws/trunk/target/surefire/surefire3641749442961036910tmp>
<https://builds.apache.org/job/HBase-0.92/ws/trunk/target/surefire/surefire3035625616222947864tmp>
Running org.apache.hadoop.hbase.coprocessor.TestRegionObserverStacking
Tests run: 1, Failures: 0, Errors: 0, Skipped: 0, Time elapsed: 0.619 sec
Forking command line: /bin/sh -c cd <https://builds.apache.org/job/HBase-0.92/ws/trunk>
&& /home/jenkins/tools/java/jdk1.6.0_27-32/jre/bin/java -enableassertions -Xmx1400m
-jar <https://builds.apache.org/job/HBase-0.92/ws/trunk/target/surefire/surefirebooter6380643238833498122.jar>
<https://builds.apache.org/job/HBase-0.92/ws/trunk/target/surefire/surefire9131987890776702766tmp>
<https://builds.apache.org/job/HBase-0.92/ws/trunk/target/surefire/surefire545164336001334461tmp>
Running org.apache.hadoop.hbase.coprocessor.TestClassLoading
Tests run: 3, Failures: 0, Errors: 0, Skipped: 0, Time elapsed: 21.991 sec
Forking command line: /bin/sh -c cd <https://builds.apache.org/job/HBase-0.92/ws/trunk>
&& /home/jenkins/tools/java/jdk1.6.0_27-32/jre/bin/java -enableassertions -Xmx1400m
-jar <https://builds.apache.org/job/HBase-0.92/ws/trunk/target/surefire/surefirebooter2269790485308650075.jar>
<https://builds.apache.org/job/HBase-0.92/ws/trunk/target/surefire/surefire7614223452850012491tmp>
<https://builds.apache.org/job/HBase-0.92/ws/trunk/target/surefire/surefire2408130249993960528tmp>
Running org.apache.hadoop.hbase.mapred.TestTableMapReduce
Tests run: 1, Failures: 0, Errors: 0, Skipped: 0, Time elapsed: 42.319 sec
Forking command line: /bin/sh -c cd <https://builds.apache.org/job/HBase-0.92/ws/trunk>
&& /home/jenkins/tools/java/jdk1.6.0_27-32/jre/bin/java -enableassertions -Xmx1400m
-jar <https://builds.apache.org/job/HBase-0.92/ws/trunk/target/surefire/surefirebooter5374751853676844897.jar>
<https://builds.apache.org/job/HBase-0.92/ws/trunk/target/surefire/surefire3705324772881757912tmp>
<https://builds.apache.org/job/HBase-0.92/ws/trunk/target/surefire/surefire3432841473175235936tmp>
Running org.apache.hadoop.hbase.mapred.TestTableInputFormat
Tests run: 6, Failures: 0, Errors: 0, Skipped: 0, Time elapsed: 19.713 sec
Forking command line: /bin/sh -c cd <https://builds.apache.org/job/HBase-0.92/ws/trunk>
&& /home/jenkins/tools/java/jdk1.6.0_27-32/jre/bin/java -enableassertions -Xmx1400m
-jar <https://builds.apache.org/job/HBase-0.92/ws/trunk/target/surefire/surefirebooter5876435995456681765.jar>
<https://builds.apache.org/job/HBase-0.92/ws/trunk/target/surefire/surefire2575033503498104574tmp>
<https://builds.apache.org/job/HBase-0.92/ws/trunk/target/surefire/surefire2236112747367069799tmp>
Running org.apache.hadoop.hbase.TestServerName
Tests run: 2, Failures: 0, Errors: 0, Skipped: 0, Time elapsed: 0.058 sec
Forking command line: /bin/sh -c cd <https://builds.apache.org/job/HBase-0.92/ws/trunk>
&& /home/jenkins/tools/java/jdk1.6.0_27-32/jre/bin/java -enableassertions -Xmx1400m
-jar <https://builds.apache.org/job/HBase-0.92/ws/trunk/target/surefire/surefirebooter1689711380257206465.jar>
<https://builds.apache.org/job/HBase-0.92/ws/trunk/target/surefire/surefire1086051519933965393tmp>
<https://builds.apache.org/job/HBase-0.92/ws/trunk/target/surefire/surefire1709526934541543454tmp>
Running org.apache.hadoop.hbase.master.TestOpenedRegionHandler
Tests run: 2, Failures: 0, Errors: 0, Skipped: 0, Time elapsed: 23.205 sec
Forking command line: /bin/sh -c cd <https://builds.apache.org/job/HBase-0.92/ws/trunk>
&& /home/jenkins/tools/java/jdk1.6.0_27-32/jre/bin/java -enableassertions -Xmx1400m
-jar <https://builds.apache.org/job/HBase-0.92/ws/trunk/target/surefire/surefirebooter1506681901121224048.jar>
<https://builds.apache.org/job/HBase-0.92/ws/trunk/target/surefire/surefire3150061030995419213tmp>
<https://builds.apache.org/job/HBase-0.92/ws/trunk/target/surefire/surefire9029914555561701950tmp>
Running org.apache.hadoop.hbase.master.TestActiveMasterManager
Tests run: 2, Failures: 0, Errors: 0, Skipped: 0, Time elapsed: 0.754 sec
Forking command line: /bin/sh -c cd <https://builds.apache.org/job/HBase-0.92/ws/trunk>
&& /home/jenkins/tools/java/jdk1.6.0_27-32/jre/bin/java -enableassertions -Xmx1400m
-jar <https://builds.apache.org/job/HBase-0.92/ws/trunk/target/surefire/surefirebooter8641501843158633486.jar>
<https://builds.apache.org/job/HBase-0.92/ws/trunk/target/surefire/surefire6368317906118069600tmp>
<https://builds.apache.org/job/HBase-0.92/ws/trunk/target/surefire/surefire6380923370283724702tmp>
Running org.apache.hadoop.hbase.master.TestMasterFailover
Tests run: 4, Failures: 0, Errors: 0, Skipped: 0, Time elapsed: 99.99 sec
Forking command line: /bin/sh -c cd <https://builds.apache.org/job/HBase-0.92/ws/trunk>
&& /home/jenkins/tools/java/jdk1.6.0_27-32/jre/bin/java -enableassertions -Xmx1400m
-jar <https://builds.apache.org/job/HBase-0.92/ws/trunk/target/surefire/surefirebooter2774248571667542000.jar>
<https://builds.apache.org/job/HBase-0.92/ws/trunk/target/surefire/surefire1155019739559148811tmp>
<https://builds.apache.org/job/HBase-0.92/ws/trunk/target/surefire/surefire8464996199805684014tmp>
Running org.apache.hadoop.hbase.master.TestMasterRestartAfterDisablingTable
Tests run: 1, Failures: 0, Errors: 0, Skipped: 0, Time elapsed: 23.401 sec
Forking command line: /bin/sh -c cd <https://builds.apache.org/job/HBase-0.92/ws/trunk>
&& /home/jenkins/tools/java/jdk1.6.0_27-32/jre/bin/java -enableassertions -Xmx1400m
-jar <https://builds.apache.org/job/HBase-0.92/ws/trunk/target/surefire/surefirebooter9181233746017944394.jar>
<https://builds.apache.org/job/HBase-0.92/ws/trunk/target/surefire/surefire5842081344674661986tmp>
<https://builds.apache.org/job/HBase-0.92/ws/trunk/target/surefire/surefire6499291942334409937tmp>
Running org.apache.hadoop.hbase.master.TestCatalogJanitor
Tests run: 3, Failures: 0, Errors: 0, Skipped: 0, Time elapsed: 4.215 sec
Forking command line: /bin/sh -c cd <https://builds.apache.org/job/HBase-0.92/ws/trunk>
&& /home/jenkins/tools/java/jdk1.6.0_27-32/jre/bin/java -enableassertions -Xmx1400m
-jar <https://builds.apache.org/job/HBase-0.92/ws/trunk/target/surefire/surefirebooter2136470044060020262.jar>
<https://builds.apache.org/job/HBase-0.92/ws/trunk/target/surefire/surefire6292960954339986874tmp>
<https://builds.apache.org/job/HBase-0.92/ws/trunk/target/surefire/surefire6710077032075441664tmp>
Running org.apache.hadoop.hbase.master.TestRollingRestart
Tests run: 1, Failures: 0, Errors: 0, Skipped: 0, Time elapsed: 61.053 sec
Forking command line: /bin/sh -c cd <https://builds.apache.org/job/HBase-0.92/ws/trunk>
&& /home/jenkins/tools/java/jdk1.6.0_27-32/jre/bin/java -enableassertions -Xmx1400m
-jar <https://builds.apache.org/job/HBase-0.92/ws/trunk/target/surefire/surefirebooter6624337120537812849.jar>
<https://builds.apache.org/job/HBase-0.92/ws/trunk/target/surefire/surefire1025286401023705874tmp>
<https://builds.apache.org/job/HBase-0.92/ws/trunk/target/surefire/surefire5046022722989819463tmp>
Running org.apache.hadoop.hbase.master.TestMasterTransitions
Tests run: 3, Failures: 0, Errors: 0, Skipped: 3, Time elapsed: 20.512 sec
Forking command line: /bin/sh -c cd <https://builds.apache.org/job/HBase-0.92/ws/trunk>
&& /home/jenkins/tools/java/jdk1.6.0_27-32/jre/bin/java -enableassertions -Xmx1400m
-jar <https://builds.apache.org/job/HBase-0.92/ws/trunk/target/surefire/surefirebooter2669176720910177123.jar>
<https://builds.apache.org/job/HBase-0.92/ws/trunk/target/surefire/surefire4018770464248852435tmp>
<https://builds.apache.org/job/HBase-0.92/ws/trunk/target/surefire/surefire5160680580833927667tmp>
Running org.apache.hadoop.hbase.master.TestRestartCluster
Tests run: 2, Failures: 0, Errors: 0, Skipped: 0, Time elapsed: 51.831 sec
Forking command line: /bin/sh -c cd <https://builds.apache.org/job/HBase-0.92/ws/trunk>
&& /home/jenkins/tools/java/jdk1.6.0_27-32/jre/bin/java -enableassertions -Xmx1400m
-jar <https://builds.apache.org/job/HBase-0.92/ws/trunk/target/surefire/surefirebooter8950578294052580329.jar>
<https://builds.apache.org/job/HBase-0.92/ws/trunk/target/surefire/surefire8450069318899204039tmp>
<https://builds.apache.org/job/HBase-0.92/ws/trunk/target/surefire/surefire153386740052443987tmp>
Running org.apache.hadoop.hbase.master.TestMasterStatusServlet
Tests run: 5, Failures: 0, Errors: 0, Skipped: 0, Time elapsed: 0.885 sec
Forking command line: /bin/sh -c cd <https://builds.apache.org/job/HBase-0.92/ws/trunk>
&& /home/jenkins/tools/java/jdk1.6.0_27-32/jre/bin/java -enableassertions -Xmx1400m
-jar <https://builds.apache.org/job/HBase-0.92/ws/trunk/target/surefire/surefirebooter955449926443584519.jar>
<https://builds.apache.org/job/HBase-0.92/ws/trunk/target/surefire/surefire1587666225194469539tmp>
<https://builds.apache.org/job/HBase-0.92/ws/trunk/target/surefire/surefire628944286231854093tmp>
Running org.apache.hadoop.hbase.master.TestClockSkewDetection
Tests run: 1, Failures: 0, Errors: 0, Skipped: 0, Time elapsed: 0.242 sec
Forking command line: /bin/sh -c cd <https://builds.apache.org/job/HBase-0.92/ws/trunk>
&& /home/jenkins/tools/java/jdk1.6.0_27-32/jre/bin/java -enableassertions -Xmx1400m
-jar <https://builds.apache.org/job/HBase-0.92/ws/trunk/target/surefire/surefirebooter6018846552902105088.jar>
<https://builds.apache.org/job/HBase-0.92/ws/trunk/target/surefire/surefire9103060541237611174tmp>
<https://builds.apache.org/job/HBase-0.92/ws/trunk/target/surefire/surefire7162455735453104099tmp>
Running org.apache.hadoop.hbase.master.TestDefaultLoadBalancer
Tests run: 4, Failures: 0, Errors: 0, Skipped: 0, Time elapsed: 1.478 sec
Forking command line: /bin/sh -c cd <https://builds.apache.org/job/HBase-0.92/ws/trunk>
&& /home/jenkins/tools/java/jdk1.6.0_27-32/jre/bin/java -enableassertions -Xmx1400m
-jar <https://builds.apache.org/job/HBase-0.92/ws/trunk/target/surefire/surefirebooter7812408013130188337.jar>
<https://builds.apache.org/job/HBase-0.92/ws/trunk/target/surefire/surefire5422659745394928052tmp>
<https://builds.apache.org/job/HBase-0.92/ws/trunk/target/surefire/surefire1809631318659476303tmp>
Running org.apache.hadoop.hbase.master.TestHMasterRPCException
Tests run: 1, Failures: 0, Errors: 0, Skipped: 0, Time elapsed: 1.056 sec
Forking command line: /bin/sh -c cd <https://builds.apache.org/job/HBase-0.92/ws/trunk>
&& /home/jenkins/tools/java/jdk1.6.0_27-32/jre/bin/java -enableassertions -Xmx1400m
-jar <https://builds.apache.org/job/HBase-0.92/ws/trunk/target/surefire/surefirebooter5280381169892120148.jar>
<https://builds.apache.org/job/HBase-0.92/ws/trunk/target/surefire/surefire491946917803701143tmp>
<https://builds.apache.org/job/HBase-0.92/ws/trunk/target/surefire/surefire3993750034091873455tmp>
Running org.apache.hadoop.hbase.master.TestDistributedLogSplitting
Tests run: 4, Failures: 0, Errors: 0, Skipped: 0, Time elapsed: 113.038 sec
Forking command line: /bin/sh -c cd <https://builds.apache.org/job/HBase-0.92/ws/trunk>
&& /home/jenkins/tools/java/jdk1.6.0_27-32/jre/bin/java -enableassertions -Xmx1400m
-jar <https://builds.apache.org/job/HBase-0.92/ws/trunk/target/surefire/surefirebooter451906300359510315.jar>
<https://builds.apache.org/job/HBase-0.92/ws/trunk/target/surefire/surefire4155943517108395544tmp>
<https://builds.apache.org/job/HBase-0.92/ws/trunk/target/surefire/surefire2343114453215850691tmp>
Running org.apache.hadoop.hbase.master.TestMaster
Tests run: 1, Failures: 0, Errors: 0, Skipped: 0, Time elapsed: 18.591 sec
Forking command line: /bin/sh -c cd <https://builds.apache.org/job/HBase-0.92/ws/trunk>
&& /home/jenkins/tools/java/jdk1.6.0_27-32/jre/bin/java -enableassertions -Xmx1400m
-jar <https://builds.apache.org/job/HBase-0.92/ws/trunk/target/surefire/surefirebooter6021698889559131260.jar>
<https://builds.apache.org/job/HBase-0.92/ws/trunk/target/surefire/surefire2859687922124626036tmp>
<https://builds.apache.org/job/HBase-0.92/ws/trunk/target/surefire/surefire876085504833272510tmp>
Running org.apache.hadoop.hbase.master.TestSplitLogManager
Tests run: 10, Failures: 0, Errors: 0, Skipped: 0, Time elapsed: 13.918 sec
Forking command line: /bin/sh -c cd <https://builds.apache.org/job/HBase-0.92/ws/trunk>
&& /home/jenkins/tools/java/jdk1.6.0_27-32/jre/bin/java -enableassertions -Xmx1400m
-jar <https://builds.apache.org/job/HBase-0.92/ws/trunk/target/surefire/surefirebooter1054756106710260847.jar>
<https://builds.apache.org/job/HBase-0.92/ws/trunk/target/surefire/surefire1396040040285706568tmp>
<https://builds.apache.org/job/HBase-0.92/ws/trunk/target/surefire/surefire5565865343559487304tmp>
Running org.apache.hadoop.hbase.master.TestDeadServer
Tests run: 1, Failures: 0, Errors: 0, Skipped: 0, Time elapsed: 0.059 sec
Forking command line: /bin/sh -c cd <https://builds.apache.org/job/HBase-0.92/ws/trunk>
&& /home/jenkins/tools/java/jdk1.6.0_27-32/jre/bin/java -enableassertions -Xmx1400m
-jar <https://builds.apache.org/job/HBase-0.92/ws/trunk/target/surefire/surefirebooter3547256357515790927.jar>
<https://builds.apache.org/job/HBase-0.92/ws/trunk/target/surefire/surefire472276424573959563tmp>
<https://builds.apache.org/job/HBase-0.92/ws/trunk/target/surefire/surefire2087985811151697380tmp>
Running org.apache.hadoop.hbase.master.TestLogsCleaner
Tests run: 1, Failures: 0, Errors: 0, Skipped: 0, Time elapsed: 1.005 sec
Forking command line: /bin/sh -c cd <https://builds.apache.org/job/HBase-0.92/ws/trunk>
&& /home/jenkins/tools/java/jdk1.6.0_27-32/jre/bin/java -enableassertions -Xmx1400m
-jar <https://builds.apache.org/job/HBase-0.92/ws/trunk/target/surefire/surefirebooter9143704998895792496.jar>
<https://builds.apache.org/job/HBase-0.92/ws/trunk/target/surefire/surefire689320202224931814tmp>
<https://builds.apache.org/job/HBase-0.92/ws/trunk/target/surefire/surefire48934684086835663tmp>
Running org.apache.hadoop.hbase.master.TestZKBasedOpenCloseRegion
Tests run: 3, Failures: 0, Errors: 0, Skipped: 0, Time elapsed: 22.33 sec

Results :

Failed tests:   testRowRange(org.apache.hadoop.hbase.regionserver.TestServerCustomProtocol):
Results should contain region test,,1319187744503.124287e38d555edcc6bf7a6849c64e54. for row
'aaa'

Tests run: 1029, Failures: 1, Errors: 0, Skipped: 9

[INFO] ------------------------------------------------------------------------
[INFO] BUILD FAILURE
[INFO] ------------------------------------------------------------------------
[INFO] Total time: 1:49:28.793s
[INFO] Finished at: Fri Oct 21 10:05:38 UTC 2011
[INFO] Final Memory: 40M/734M
[INFO] ------------------------------------------------------------------------
[ERROR] Failed to execute goal org.apache.maven.plugins:maven-surefire-plugin:2.9:test (default-test)
on project hbase: There are test failures.
[ERROR] 
[ERROR] Please refer to <https://builds.apache.org/job/HBase-0.92/ws/trunk/target/surefire-reports>
for the individual test results.
[ERROR] -> [Help 1]
org.apache.maven.lifecycle.LifecycleExecutionException: Failed to execute goal org.apache.maven.plugins:maven-surefire-plugin:2.9:test
(default-test) on project hbase: There are test failures.

Please refer to <https://builds.apache.org/job/HBase-0.92/ws/trunk/target/surefire-reports>
for the individual test results.
	at org.apache.maven.lifecycle.internal.MojoExecutor.execute(MojoExecutor.java:213)
	at org.apache.maven.lifecycle.internal.MojoExecutor.execute(MojoExecutor.java:153)
	at org.apache.maven.lifecycle.internal.MojoExecutor.execute(MojoExecutor.java:145)
	at org.apache.maven.lifecycle.internal.MojoExecutor.executeForkedExecutions(MojoExecutor.java:365)
	at org.apache.maven.lifecycle.internal.MojoExecutor.execute(MojoExecutor.java:199)
	at org.apache.maven.lifecycle.internal.MojoExecutor.execute(MojoExecutor.java:153)
	at org.apache.maven.lifecycle.internal.MojoExecutor.execute(MojoExecutor.java:145)
	at org.apache.maven.lifecycle.internal.LifecycleModuleBuilder.buildProject(LifecycleModuleBuilder.java:84)
	at org.apache.maven.lifecycle.internal.LifecycleModuleBuilder.buildProject(LifecycleModuleBuilder.java:59)
	at org.apache.maven.lifecycle.internal.LifecycleStarter.singleThreadedBuild(LifecycleStarter.java:183)
	at org.apache.maven.lifecycle.internal.LifecycleStarter.execute(LifecycleStarter.java:161)
	at org.apache.maven.DefaultMaven.doExecute(DefaultMaven.java:319)
	at org.apache.maven.DefaultMaven.execute(DefaultMaven.java:156)
	at org.apache.maven.cli.MavenCli.execute(MavenCli.java:537)
	at org.apache.maven.cli.MavenCli.doMain(MavenCli.java:196)
	at org.apache.maven.cli.MavenCli.main(MavenCli.java:141)
	at sun.reflect.NativeMethodAccessorImpl.invoke0(Native Method)
	at sun.reflect.NativeMethodAccessorImpl.invoke(NativeMethodAccessorImpl.java:39)
	at sun.reflect.DelegatingMethodAccessorImpl.invoke(DelegatingMethodAccessorImpl.java:25)
	at java.lang.reflect.Method.invoke(Method.java:597)
	at org.codehaus.plexus.classworlds.launcher.Launcher.launchEnhanced(Launcher.java:290)
	at org.codehaus.plexus.classworlds.launcher.Launcher.launch(Launcher.java:230)
	at org.codehaus.plexus.classworlds.launcher.Launcher.mainWithExitCode(Launcher.java:409)
	at org.codehaus.plexus.classworlds.launcher.Launcher.main(Launcher.java:352)
Caused by: org.apache.maven.plugin.MojoFailureException: There are test failures.

Please refer to <https://builds.apache.org/job/HBase-0.92/ws/trunk/target/surefire-reports>
for the individual test results.
	at org.apache.maven.plugin.surefire.SurefireHelper.reportExecution(SurefireHelper.java:87)
	at org.apache.maven.plugin.surefire.SurefirePlugin.writeSummary(SurefirePlugin.java:631)
	at org.apache.maven.plugin.surefire.SurefirePlugin.handleSummary(SurefirePlugin.java:605)
	at org.apache.maven.plugin.surefire.AbstractSurefireMojo.executeAfterPreconditionsChecked(AbstractSurefireMojo.java:136)
	at org.apache.maven.plugin.surefire.AbstractSurefireMojo.execute(AbstractSurefireMojo.java:97)
	at org.apache.maven.plugin.DefaultBuildPluginManager.executeMojo(DefaultBuildPluginManager.java:101)
	at org.apache.maven.lifecycle.internal.MojoExecutor.execute(MojoExecutor.java:209)
	... 23 more
[ERROR] 
[ERROR] 
[ERROR] For more information about the errors and possible solutions, please read the following
articles:
[ERROR] [Help 1] http://cwiki.apache.org/confluence/display/MAVEN/MojoFailureException
Build step 'Invoke top-level Maven targets' marked build as failure
[locks-and-latches] Releasing all the locks
[locks-and-latches] All the locks released
Archiving artifacts
Recording test results
Updating HBASE-4585
Updating HBASE-4459
Updating HBASE-4621
Updating HBASE-4620
Updating HBASE-3581
Updating HBASE-4486
Updating HBASE-4604
Updating HBASE-4510
Updating HBASE-4378
Updating HBASE-4430
Updating HBASE-4595
Updating HBASE-4580


Mime
View raw message