hbase-dev mailing list archives

Site index · List index
Message view « Date » · « Thread »
Top « Date » · « Thread »
From Apache Jenkins Server <jenk...@builds.apache.org>
Subject Build failed in Jenkins: HBase-0.92 #47
Date Thu, 06 Oct 2011 02:57:29 GMT
See <https://builds.apache.org/job/HBase-0.92/47/changes>

Changes:

[todd] HBASE-4386  Fix a potential NPE in TaskMonitor

------------------------------------------
[...truncated 6066 lines...]
Running org.apache.hadoop.hbase.rest.TestMultiRowResource
Tests run: 3, Failures: 0, Errors: 0, Skipped: 0, Time elapsed: 27.56 sec
Forking command line: /bin/sh -c cd /x1/jenkins/jenkins-slave/workspace/HBase-0.92/trunk &&
/x1/jenkins/tools/java/jdk1.6.0_20-32/jre/bin/java -enableassertions -Xmx1400m -jar /x1/jenkins/jenkins-slave/workspace/HBase-0.92/trunk/target/surefire/surefirebooter3079776245870560624.jar
/x1/jenkins/jenkins-slave/workspace/HBase-0.92/trunk/target/surefire/surefire6449251533736710246tmp
/x1/jenkins/jenkins-slave/workspace/HBase-0.92/trunk/target/surefire/surefire8856806224018870997tmp
Running org.apache.hadoop.hbase.rest.TestGzipFilter
Tests run: 3, Failures: 0, Errors: 0, Skipped: 0, Time elapsed: 29.542 sec
Forking command line: /bin/sh -c cd /x1/jenkins/jenkins-slave/workspace/HBase-0.92/trunk &&
/x1/jenkins/tools/java/jdk1.6.0_20-32/jre/bin/java -enableassertions -Xmx1400m -jar /x1/jenkins/jenkins-slave/workspace/HBase-0.92/trunk/target/surefire/surefirebooter9002753743589035352.jar
/x1/jenkins/jenkins-slave/workspace/HBase-0.92/trunk/target/surefire/surefire2537616052668427076tmp
/x1/jenkins/jenkins-slave/workspace/HBase-0.92/trunk/target/surefire/surefire7148975392943167970tmp
Running org.apache.hadoop.hbase.rest.TestRowResource
Tests run: 11, Failures: 0, Errors: 0, Skipped: 0, Time elapsed: 28.922 sec
Forking command line: /bin/sh -c cd /x1/jenkins/jenkins-slave/workspace/HBase-0.92/trunk &&
/x1/jenkins/tools/java/jdk1.6.0_20-32/jre/bin/java -enableassertions -Xmx1400m -jar /x1/jenkins/jenkins-slave/workspace/HBase-0.92/trunk/target/surefire/surefirebooter4155247550169528337.jar
/x1/jenkins/jenkins-slave/workspace/HBase-0.92/trunk/target/surefire/surefire3051133907579292005tmp
/x1/jenkins/jenkins-slave/workspace/HBase-0.92/trunk/target/surefire/surefire2758769004284950182tmp
Running org.apache.hadoop.hbase.rest.TestScannerResource
Tests run: 5, Failures: 0, Errors: 0, Skipped: 0, Time elapsed: 41.311 sec
Forking command line: /bin/sh -c cd /x1/jenkins/jenkins-slave/workspace/HBase-0.92/trunk &&
/x1/jenkins/tools/java/jdk1.6.0_20-32/jre/bin/java -enableassertions -Xmx1400m -jar /x1/jenkins/jenkins-slave/workspace/HBase-0.92/trunk/target/surefire/surefirebooter5549613124786126553.jar
/x1/jenkins/jenkins-slave/workspace/HBase-0.92/trunk/target/surefire/surefire3929084809293967377tmp
/x1/jenkins/jenkins-slave/workspace/HBase-0.92/trunk/target/surefire/surefire2062024207890927574tmp
Running org.apache.hadoop.hbase.rest.TestVersionResource
Tests run: 7, Failures: 0, Errors: 0, Skipped: 0, Time elapsed: 29.369 sec
Forking command line: /bin/sh -c cd /x1/jenkins/jenkins-slave/workspace/HBase-0.92/trunk &&
/x1/jenkins/tools/java/jdk1.6.0_20-32/jre/bin/java -enableassertions -Xmx1400m -jar /x1/jenkins/jenkins-slave/workspace/HBase-0.92/trunk/target/surefire/surefirebooter9045350559118944884.jar
/x1/jenkins/jenkins-slave/workspace/HBase-0.92/trunk/target/surefire/surefire3123024997143493309tmp
/x1/jenkins/jenkins-slave/workspace/HBase-0.92/trunk/target/surefire/surefire2728589985248605409tmp
Running org.apache.hadoop.hbase.rest.TestStatusResource
Tests run: 2, Failures: 0, Errors: 0, Skipped: 0, Time elapsed: 35.536 sec
Forking command line: /bin/sh -c cd /x1/jenkins/jenkins-slave/workspace/HBase-0.92/trunk &&
/x1/jenkins/tools/java/jdk1.6.0_20-32/jre/bin/java -enableassertions -Xmx1400m -jar /x1/jenkins/jenkins-slave/workspace/HBase-0.92/trunk/target/surefire/surefirebooter1680970012375623279.jar
/x1/jenkins/jenkins-slave/workspace/HBase-0.92/trunk/target/surefire/surefire5820389279837737884tmp
/x1/jenkins/jenkins-slave/workspace/HBase-0.92/trunk/target/surefire/surefire6662293093443192083tmp
Running org.apache.hadoop.hbase.rest.TestTransform
Tests run: 1, Failures: 0, Errors: 0, Skipped: 0, Time elapsed: 21.189 sec
Forking command line: /bin/sh -c cd /x1/jenkins/jenkins-slave/workspace/HBase-0.92/trunk &&
/x1/jenkins/tools/java/jdk1.6.0_20-32/jre/bin/java -enableassertions -Xmx1400m -jar /x1/jenkins/jenkins-slave/workspace/HBase-0.92/trunk/target/surefire/surefirebooter2284873254537766367.jar
/x1/jenkins/jenkins-slave/workspace/HBase-0.92/trunk/target/surefire/surefire6803045326427378739tmp
/x1/jenkins/jenkins-slave/workspace/HBase-0.92/trunk/target/surefire/surefire7557439369107151394tmp
Running org.apache.hadoop.hbase.rest.TestScannersWithFilters
Tests run: 10, Failures: 0, Errors: 0, Skipped: 0, Time elapsed: 21.297 sec
Forking command line: /bin/sh -c cd /x1/jenkins/jenkins-slave/workspace/HBase-0.92/trunk &&
/x1/jenkins/tools/java/jdk1.6.0_20-32/jre/bin/java -enableassertions -Xmx1400m -jar /x1/jenkins/jenkins-slave/workspace/HBase-0.92/trunk/target/surefire/surefirebooter56523986626860083.jar
/x1/jenkins/jenkins-slave/workspace/HBase-0.92/trunk/target/surefire/surefire2783191029228794771tmp
/x1/jenkins/jenkins-slave/workspace/HBase-0.92/trunk/target/surefire/surefire4621578914063244563tmp
Running org.apache.hadoop.hbase.metrics.TestMetricsMBeanBase
Tests run: 2, Failures: 0, Errors: 0, Skipped: 0, Time elapsed: 0.098 sec
Forking command line: /bin/sh -c cd /x1/jenkins/jenkins-slave/workspace/HBase-0.92/trunk &&
/x1/jenkins/tools/java/jdk1.6.0_20-32/jre/bin/java -enableassertions -Xmx1400m -jar /x1/jenkins/jenkins-slave/workspace/HBase-0.92/trunk/target/surefire/surefirebooter6632208581339214521.jar
/x1/jenkins/jenkins-slave/workspace/HBase-0.92/trunk/target/surefire/surefire3323017221661225468tmp
/x1/jenkins/jenkins-slave/workspace/HBase-0.92/trunk/target/surefire/surefire1064010147526451314tmp
Running org.apache.hadoop.hbase.io.hfile.TestHFileWriterV2
Tests run: 1, Failures: 0, Errors: 0, Skipped: 0, Time elapsed: 0.653 sec
Forking command line: /bin/sh -c cd /x1/jenkins/jenkins-slave/workspace/HBase-0.92/trunk &&
/x1/jenkins/tools/java/jdk1.6.0_20-32/jre/bin/java -enableassertions -Xmx1400m -jar /x1/jenkins/jenkins-slave/workspace/HBase-0.92/trunk/target/surefire/surefirebooter3859611966842351217.jar
/x1/jenkins/jenkins-slave/workspace/HBase-0.92/trunk/target/surefire/surefire8132454632542118313tmp
/x1/jenkins/jenkins-slave/workspace/HBase-0.92/trunk/target/surefire/surefire2342463886518168623tmp
Running org.apache.hadoop.hbase.io.hfile.TestHFile
Tests run: 6, Failures: 0, Errors: 0, Skipped: 0, Time elapsed: 0.639 sec
Forking command line: /bin/sh -c cd /x1/jenkins/jenkins-slave/workspace/HBase-0.92/trunk &&
/x1/jenkins/tools/java/jdk1.6.0_20-32/jre/bin/java -enableassertions -Xmx1400m -jar /x1/jenkins/jenkins-slave/workspace/HBase-0.92/trunk/target/surefire/surefirebooter6060950048804399782.jar
/x1/jenkins/jenkins-slave/workspace/HBase-0.92/trunk/target/surefire/surefire391456109149592969tmp
/x1/jenkins/jenkins-slave/workspace/HBase-0.92/trunk/target/surefire/surefire2096746715083510952tmp
Running org.apache.hadoop.hbase.io.hfile.TestHFileBlockIndex
Tests run: 10, Failures: 0, Errors: 0, Skipped: 0, Time elapsed: 7.775 sec
Forking command line: /bin/sh -c cd /x1/jenkins/jenkins-slave/workspace/HBase-0.92/trunk &&
/x1/jenkins/tools/java/jdk1.6.0_20-32/jre/bin/java -enableassertions -Xmx1400m -jar /x1/jenkins/jenkins-slave/workspace/HBase-0.92/trunk/target/surefire/surefirebooter853311666719514750.jar
/x1/jenkins/jenkins-slave/workspace/HBase-0.92/trunk/target/surefire/surefire1188161560391299535tmp
/x1/jenkins/jenkins-slave/workspace/HBase-0.92/trunk/target/surefire/surefire6843653693256199764tmp
Running org.apache.hadoop.hbase.io.hfile.TestHFileSeek
Tests run: 1, Failures: 0, Errors: 0, Skipped: 0, Time elapsed: 3.953 sec
Forking command line: /bin/sh -c cd /x1/jenkins/jenkins-slave/workspace/HBase-0.92/trunk &&
/x1/jenkins/tools/java/jdk1.6.0_20-32/jre/bin/java -enableassertions -Xmx1400m -jar /x1/jenkins/jenkins-slave/workspace/HBase-0.92/trunk/target/surefire/surefirebooter5788951152213712302.jar
/x1/jenkins/jenkins-slave/workspace/HBase-0.92/trunk/target/surefire/surefire2620978738008600139tmp
/x1/jenkins/jenkins-slave/workspace/HBase-0.92/trunk/target/surefire/surefire4656847272157821205tmp
Running org.apache.hadoop.hbase.io.hfile.TestLruBlockCache
Tests run: 7, Failures: 0, Errors: 0, Skipped: 0, Time elapsed: 1.113 sec
Forking command line: /bin/sh -c cd /x1/jenkins/jenkins-slave/workspace/HBase-0.92/trunk &&
/x1/jenkins/tools/java/jdk1.6.0_20-32/jre/bin/java -enableassertions -Xmx1400m -jar /x1/jenkins/jenkins-slave/workspace/HBase-0.92/trunk/target/surefire/surefirebooter2074519467313872873.jar
/x1/jenkins/jenkins-slave/workspace/HBase-0.92/trunk/target/surefire/surefire2051810280238432889tmp
/x1/jenkins/jenkins-slave/workspace/HBase-0.92/trunk/target/surefire/surefire7825748149483020400tmp
Running org.apache.hadoop.hbase.io.hfile.TestFixedFileTrailer
Tests run: 2, Failures: 0, Errors: 0, Skipped: 0, Time elapsed: 0.402 sec
Forking command line: /bin/sh -c cd /x1/jenkins/jenkins-slave/workspace/HBase-0.92/trunk &&
/x1/jenkins/tools/java/jdk1.6.0_20-32/jre/bin/java -enableassertions -Xmx1400m -jar /x1/jenkins/jenkins-slave/workspace/HBase-0.92/trunk/target/surefire/surefirebooter3991706546192268990.jar
/x1/jenkins/jenkins-slave/workspace/HBase-0.92/trunk/target/surefire/surefire5117906306892017805tmp
/x1/jenkins/jenkins-slave/workspace/HBase-0.92/trunk/target/surefire/surefire62167096200886059tmp
Running org.apache.hadoop.hbase.io.hfile.TestCachedBlockQueue
Tests run: 2, Failures: 0, Errors: 0, Skipped: 0, Time elapsed: 0.079 sec
Forking command line: /bin/sh -c cd /x1/jenkins/jenkins-slave/workspace/HBase-0.92/trunk &&
/x1/jenkins/tools/java/jdk1.6.0_20-32/jre/bin/java -enableassertions -Xmx1400m -jar /x1/jenkins/jenkins-slave/workspace/HBase-0.92/trunk/target/surefire/surefirebooter8990336537255658241.jar
/x1/jenkins/jenkins-slave/workspace/HBase-0.92/trunk/target/surefire/surefire66280034983037999tmp
/x1/jenkins/jenkins-slave/workspace/HBase-0.92/trunk/target/surefire/surefire2765621710695298386tmp
Running org.apache.hadoop.hbase.io.hfile.TestHFilePerformance
Tests run: 1, Failures: 0, Errors: 0, Skipped: 0, Time elapsed: 4.307 sec
Forking command line: /bin/sh -c cd /x1/jenkins/jenkins-slave/workspace/HBase-0.92/trunk &&
/x1/jenkins/tools/java/jdk1.6.0_20-32/jre/bin/java -enableassertions -Xmx1400m -jar /x1/jenkins/jenkins-slave/workspace/HBase-0.92/trunk/target/surefire/surefirebooter2881482163670020347.jar
/x1/jenkins/jenkins-slave/workspace/HBase-0.92/trunk/target/surefire/surefire7913767843767646087tmp
/x1/jenkins/jenkins-slave/workspace/HBase-0.92/trunk/target/surefire/surefire5577768044181451832tmp
Running org.apache.hadoop.hbase.io.hfile.TestCacheOnWrite
Tests run: 6, Failures: 0, Errors: 0, Skipped: 0, Time elapsed: 7.393 sec
Forking command line: /bin/sh -c cd /x1/jenkins/jenkins-slave/workspace/HBase-0.92/trunk &&
/x1/jenkins/tools/java/jdk1.6.0_20-32/jre/bin/java -enableassertions -Xmx1400m -jar /x1/jenkins/jenkins-slave/workspace/HBase-0.92/trunk/target/surefire/surefirebooter260233078767784043.jar
/x1/jenkins/jenkins-slave/workspace/HBase-0.92/trunk/target/surefire/surefire5464161182240925085tmp
/x1/jenkins/jenkins-slave/workspace/HBase-0.92/trunk/target/surefire/surefire5118962925480831245tmp
Running org.apache.hadoop.hbase.io.hfile.TestReseekTo
Tests run: 1, Failures: 0, Errors: 0, Skipped: 0, Time elapsed: 0.43 sec
Forking command line: /bin/sh -c cd /x1/jenkins/jenkins-slave/workspace/HBase-0.92/trunk &&
/x1/jenkins/tools/java/jdk1.6.0_20-32/jre/bin/java -enableassertions -Xmx1400m -jar /x1/jenkins/jenkins-slave/workspace/HBase-0.92/trunk/target/surefire/surefirebooter2210894139715057976.jar
/x1/jenkins/jenkins-slave/workspace/HBase-0.92/trunk/target/surefire/surefire5746561676249583615tmp
/x1/jenkins/jenkins-slave/workspace/HBase-0.92/trunk/target/surefire/surefire4762231287963136194tmp
Running org.apache.hadoop.hbase.io.hfile.TestSeekTo
Tests run: 3, Failures: 0, Errors: 0, Skipped: 0, Time elapsed: 0.483 sec
Forking command line: /bin/sh -c cd /x1/jenkins/jenkins-slave/workspace/HBase-0.92/trunk &&
/x1/jenkins/tools/java/jdk1.6.0_20-32/jre/bin/java -enableassertions -Xmx1400m -jar /x1/jenkins/jenkins-slave/workspace/HBase-0.92/trunk/target/surefire/surefirebooter1199388248108536340.jar
/x1/jenkins/jenkins-slave/workspace/HBase-0.92/trunk/target/surefire/surefire5702413152011408344tmp
/x1/jenkins/jenkins-slave/workspace/HBase-0.92/trunk/target/surefire/surefire4474226968118804796tmp
Running org.apache.hadoop.hbase.io.hfile.TestBlockCacheColumnFamilySummary
Tests run: 4, Failures: 0, Errors: 0, Skipped: 0, Time elapsed: 0.045 sec
Forking command line: /bin/sh -c cd /x1/jenkins/jenkins-slave/workspace/HBase-0.92/trunk &&
/x1/jenkins/tools/java/jdk1.6.0_20-32/jre/bin/java -enableassertions -Xmx1400m -jar /x1/jenkins/jenkins-slave/workspace/HBase-0.92/trunk/target/surefire/surefirebooter6146172866639248320.jar
/x1/jenkins/jenkins-slave/workspace/HBase-0.92/trunk/target/surefire/surefire8969121240265056603tmp
/x1/jenkins/jenkins-slave/workspace/HBase-0.92/trunk/target/surefire/surefire2672608116873476784tmp
Running org.apache.hadoop.hbase.io.hfile.TestHFileBlock
Tests run: 7, Failures: 0, Errors: 0, Skipped: 0, Time elapsed: 27.399 sec
Forking command line: /bin/sh -c cd /x1/jenkins/jenkins-slave/workspace/HBase-0.92/trunk &&
/x1/jenkins/tools/java/jdk1.6.0_20-32/jre/bin/java -enableassertions -Xmx1400m -jar /x1/jenkins/jenkins-slave/workspace/HBase-0.92/trunk/target/surefire/surefirebooter6991546256037682071.jar
/x1/jenkins/jenkins-slave/workspace/HBase-0.92/trunk/target/surefire/surefire8081808726351281858tmp
/x1/jenkins/jenkins-slave/workspace/HBase-0.92/trunk/target/surefire/surefire7562699831782345543tmp
Running org.apache.hadoop.hbase.io.hfile.slab.TestSlabCache
Tests run: 7, Failures: 0, Errors: 0, Skipped: 7, Time elapsed: 0.049 sec
Forking command line: /bin/sh -c cd /x1/jenkins/jenkins-slave/workspace/HBase-0.92/trunk &&
/x1/jenkins/tools/java/jdk1.6.0_20-32/jre/bin/java -enableassertions -Xmx1400m -jar /x1/jenkins/jenkins-slave/workspace/HBase-0.92/trunk/target/surefire/surefirebooter6445921526560229444.jar
/x1/jenkins/jenkins-slave/workspace/HBase-0.92/trunk/target/surefire/surefire8043549157692209287tmp
/x1/jenkins/jenkins-slave/workspace/HBase-0.92/trunk/target/surefire/surefire4979214915126451838tmp
Running org.apache.hadoop.hbase.io.hfile.slab.TestSingleSizeCache
Tests run: 5, Failures: 0, Errors: 0, Skipped: 5, Time elapsed: 0.047 sec
Forking command line: /bin/sh -c cd /x1/jenkins/jenkins-slave/workspace/HBase-0.92/trunk &&
/x1/jenkins/tools/java/jdk1.6.0_20-32/jre/bin/java -enableassertions -Xmx1400m -jar /x1/jenkins/jenkins-slave/workspace/HBase-0.92/trunk/target/surefire/surefirebooter5752528659966599998.jar
/x1/jenkins/jenkins-slave/workspace/HBase-0.92/trunk/target/surefire/surefire3782900618720736434tmp
/x1/jenkins/jenkins-slave/workspace/HBase-0.92/trunk/target/surefire/surefire4521270124042100186tmp
Running org.apache.hadoop.hbase.io.hfile.slab.TestSlab
Tests run: 1, Failures: 0, Errors: 0, Skipped: 0, Time elapsed: 0.109 sec
Forking command line: /bin/sh -c cd /x1/jenkins/jenkins-slave/workspace/HBase-0.92/trunk &&
/x1/jenkins/tools/java/jdk1.6.0_20-32/jre/bin/java -enableassertions -Xmx1400m -jar /x1/jenkins/jenkins-slave/workspace/HBase-0.92/trunk/target/surefire/surefirebooter2367975288388189177.jar
/x1/jenkins/jenkins-slave/workspace/HBase-0.92/trunk/target/surefire/surefire7641254922917659350tmp
/x1/jenkins/jenkins-slave/workspace/HBase-0.92/trunk/target/surefire/surefire7597413557792733836tmp
Running org.apache.hadoop.hbase.io.hfile.TestHFileReaderV1
Tests run: 1, Failures: 0, Errors: 0, Skipped: 0, Time elapsed: 0.418 sec
Forking command line: /bin/sh -c cd /x1/jenkins/jenkins-slave/workspace/HBase-0.92/trunk &&
/x1/jenkins/tools/java/jdk1.6.0_20-32/jre/bin/java -enableassertions -Xmx1400m -jar /x1/jenkins/jenkins-slave/workspace/HBase-0.92/trunk/target/surefire/surefirebooter6155013322677990774.jar
/x1/jenkins/jenkins-slave/workspace/HBase-0.92/trunk/target/surefire/surefire4915596454948052249tmp
/x1/jenkins/jenkins-slave/workspace/HBase-0.92/trunk/target/surefire/surefire2746726717491315126tmp
Running org.apache.hadoop.hbase.io.TestHalfStoreFileReader
Tests run: 1, Failures: 0, Errors: 0, Skipped: 0, Time elapsed: 0.463 sec
Forking command line: /bin/sh -c cd /x1/jenkins/jenkins-slave/workspace/HBase-0.92/trunk &&
/x1/jenkins/tools/java/jdk1.6.0_20-32/jre/bin/java -enableassertions -Xmx1400m -jar /x1/jenkins/jenkins-slave/workspace/HBase-0.92/trunk/target/surefire/surefirebooter68113071843790424.jar
/x1/jenkins/jenkins-slave/workspace/HBase-0.92/trunk/target/surefire/surefire7998362023453635495tmp
/x1/jenkins/jenkins-slave/workspace/HBase-0.92/trunk/target/surefire/surefire6073421081472043474tmp
Running org.apache.hadoop.hbase.io.TestHbaseObjectWritable
Tests run: 3, Failures: 0, Errors: 0, Skipped: 0, Time elapsed: 0.315 sec
Forking command line: /bin/sh -c cd /x1/jenkins/jenkins-slave/workspace/HBase-0.92/trunk &&
/x1/jenkins/tools/java/jdk1.6.0_20-32/jre/bin/java -enableassertions -Xmx1400m -jar /x1/jenkins/jenkins-slave/workspace/HBase-0.92/trunk/target/surefire/surefirebooter1791481717296895373.jar
/x1/jenkins/jenkins-slave/workspace/HBase-0.92/trunk/target/surefire/surefire2652217049663550848tmp
/x1/jenkins/jenkins-slave/workspace/HBase-0.92/trunk/target/surefire/surefire5993384680279454322tmp
Running org.apache.hadoop.hbase.io.TestImmutableBytesWritable
Tests run: 3, Failures: 0, Errors: 0, Skipped: 0, Time elapsed: 0.084 sec
Forking command line: /bin/sh -c cd /x1/jenkins/jenkins-slave/workspace/HBase-0.92/trunk &&
/x1/jenkins/tools/java/jdk1.6.0_20-32/jre/bin/java -enableassertions -Xmx1400m -jar /x1/jenkins/jenkins-slave/workspace/HBase-0.92/trunk/target/surefire/surefirebooter9109051456120562872.jar
/x1/jenkins/jenkins-slave/workspace/HBase-0.92/trunk/target/surefire/surefire5308516371895031495tmp
/x1/jenkins/jenkins-slave/workspace/HBase-0.92/trunk/target/surefire/surefire8787984869342056462tmp
Running org.apache.hadoop.hbase.io.TestHeapSize
Tests run: 2, Failures: 0, Errors: 0, Skipped: 0, Time elapsed: 0.119 sec
Forking command line: /bin/sh -c cd /x1/jenkins/jenkins-slave/workspace/HBase-0.92/trunk &&
/x1/jenkins/tools/java/jdk1.6.0_20-32/jre/bin/java -enableassertions -Xmx1400m -jar /x1/jenkins/jenkins-slave/workspace/HBase-0.92/trunk/target/surefire/surefirebooter1362330398417970489.jar
/x1/jenkins/jenkins-slave/workspace/HBase-0.92/trunk/target/surefire/surefire8386668026117547619tmp
/x1/jenkins/jenkins-slave/workspace/HBase-0.92/trunk/target/surefire/surefire5670551118351579564tmp
Running org.apache.hadoop.hbase.TestRegionRebalancing
Tests run: 1, Failures: 0, Errors: 0, Skipped: 0, Time elapsed: 46.625 sec
Forking command line: /bin/sh -c cd /x1/jenkins/jenkins-slave/workspace/HBase-0.92/trunk &&
/x1/jenkins/tools/java/jdk1.6.0_20-32/jre/bin/java -enableassertions -Xmx1400m -jar /x1/jenkins/jenkins-slave/workspace/HBase-0.92/trunk/target/surefire/surefirebooter4752495992317170665.jar
/x1/jenkins/jenkins-slave/workspace/HBase-0.92/trunk/target/surefire/surefire7375528429997572179tmp
/x1/jenkins/jenkins-slave/workspace/HBase-0.92/trunk/target/surefire/surefire2096223650283799124tmp
Running org.apache.hadoop.hbase.mapred.TestTableInputFormat
Tests run: 6, Failures: 0, Errors: 0, Skipped: 0, Time elapsed: 30.466 sec
Forking command line: /bin/sh -c cd /x1/jenkins/jenkins-slave/workspace/HBase-0.92/trunk &&
/x1/jenkins/tools/java/jdk1.6.0_20-32/jre/bin/java -enableassertions -Xmx1400m -jar /x1/jenkins/jenkins-slave/workspace/HBase-0.92/trunk/target/surefire/surefirebooter275020317366499256.jar
/x1/jenkins/jenkins-slave/workspace/HBase-0.92/trunk/target/surefire/surefire9097058447134909966tmp
/x1/jenkins/jenkins-slave/workspace/HBase-0.92/trunk/target/surefire/surefire7535668803512931359tmp
Running org.apache.hadoop.hbase.mapred.TestTableMapReduce
Tests run: 1, Failures: 0, Errors: 0, Skipped: 0, Time elapsed: 46.769 sec
Forking command line: /bin/sh -c cd /x1/jenkins/jenkins-slave/workspace/HBase-0.92/trunk &&
/x1/jenkins/tools/java/jdk1.6.0_20-32/jre/bin/java -enableassertions -Xmx1400m -jar /x1/jenkins/jenkins-slave/workspace/HBase-0.92/trunk/target/surefire/surefirebooter362102491555440454.jar
/x1/jenkins/jenkins-slave/workspace/HBase-0.92/trunk/target/surefire/surefire1146751070503849246tmp
/x1/jenkins/jenkins-slave/workspace/HBase-0.92/trunk/target/surefire/surefire6167133538463792641tmp
Running org.apache.hadoop.hbase.replication.regionserver.TestReplicationSink
Tests run: 5, Failures: 0, Errors: 0, Skipped: 0, Time elapsed: 24.058 sec
Forking command line: /bin/sh -c cd /x1/jenkins/jenkins-slave/workspace/HBase-0.92/trunk &&
/x1/jenkins/tools/java/jdk1.6.0_20-32/jre/bin/java -enableassertions -Xmx1400m -jar /x1/jenkins/jenkins-slave/workspace/HBase-0.92/trunk/target/surefire/surefirebooter5589893065658279800.jar
/x1/jenkins/jenkins-slave/workspace/HBase-0.92/trunk/target/surefire/surefire9181295041329890832tmp
/x1/jenkins/jenkins-slave/workspace/HBase-0.92/trunk/target/surefire/surefire6250903332181100673tmp
Running org.apache.hadoop.hbase.replication.regionserver.TestReplicationSourceManager
Tests run: 1, Failures: 0, Errors: 0, Skipped: 0, Time elapsed: 0.828 sec
Forking command line: /bin/sh -c cd /x1/jenkins/jenkins-slave/workspace/HBase-0.92/trunk &&
/x1/jenkins/tools/java/jdk1.6.0_20-32/jre/bin/java -enableassertions -Xmx1400m -jar /x1/jenkins/jenkins-slave/workspace/HBase-0.92/trunk/target/surefire/surefirebooter4935125458514774018.jar
/x1/jenkins/jenkins-slave/workspace/HBase-0.92/trunk/target/surefire/surefire8818699199996568975tmp
/x1/jenkins/jenkins-slave/workspace/HBase-0.92/trunk/target/surefire/surefire2509984834648182519tmp
Running org.apache.hadoop.hbase.replication.TestReplicationSource
Tests run: 1, Failures: 0, Errors: 0, Skipped: 0, Time elapsed: 7.783 sec
Forking command line: /bin/sh -c cd /x1/jenkins/jenkins-slave/workspace/HBase-0.92/trunk &&
/x1/jenkins/tools/java/jdk1.6.0_20-32/jre/bin/java -enableassertions -Xmx1400m -jar /x1/jenkins/jenkins-slave/workspace/HBase-0.92/trunk/target/surefire/surefirebooter628697215357452991.jar
/x1/jenkins/jenkins-slave/workspace/HBase-0.92/trunk/target/surefire/surefire3702532039360380269tmp
/x1/jenkins/jenkins-slave/workspace/HBase-0.92/trunk/target/surefire/surefire4295408133839137459tmp
Running org.apache.hadoop.hbase.replication.TestReplication
Tests run: 7, Failures: 0, Errors: 0, Skipped: 0, Time elapsed: 115.223 sec
Forking command line: /bin/sh -c cd /x1/jenkins/jenkins-slave/workspace/HBase-0.92/trunk &&
/x1/jenkins/tools/java/jdk1.6.0_20-32/jre/bin/java -enableassertions -Xmx1400m -jar /x1/jenkins/jenkins-slave/workspace/HBase-0.92/trunk/target/surefire/surefirebooter6073225404620230098.jar
/x1/jenkins/jenkins-slave/workspace/HBase-0.92/trunk/target/surefire/surefire4284841648116249817tmp
/x1/jenkins/jenkins-slave/workspace/HBase-0.92/trunk/target/surefire/surefire8274957405855438459tmp
Running org.apache.hadoop.hbase.replication.TestReplicationPeer
Tests run: 1, Failures: 0, Errors: 0, Skipped: 0, Time elapsed: 25.383 sec
Forking command line: /bin/sh -c cd /x1/jenkins/jenkins-slave/workspace/HBase-0.92/trunk &&
/x1/jenkins/tools/java/jdk1.6.0_20-32/jre/bin/java -enableassertions -Xmx1400m -jar /x1/jenkins/jenkins-slave/workspace/HBase-0.92/trunk/target/surefire/surefirebooter2953392669513163505.jar
/x1/jenkins/jenkins-slave/workspace/HBase-0.92/trunk/target/surefire/surefire8097300099897633172tmp
/x1/jenkins/jenkins-slave/workspace/HBase-0.92/trunk/target/surefire/surefire1523887965960176284tmp
Running org.apache.hadoop.hbase.replication.TestMultiSlaveReplication
Tests run: 1, Failures: 0, Errors: 0, Skipped: 0, Time elapsed: 48.157 sec
Forking command line: /bin/sh -c cd /x1/jenkins/jenkins-slave/workspace/HBase-0.92/trunk &&
/x1/jenkins/tools/java/jdk1.6.0_20-32/jre/bin/java -enableassertions -Xmx1400m -jar /x1/jenkins/jenkins-slave/workspace/HBase-0.92/trunk/target/surefire/surefirebooter1968883279046431386.jar
/x1/jenkins/jenkins-slave/workspace/HBase-0.92/trunk/target/surefire/surefire5457215856481400427tmp
/x1/jenkins/jenkins-slave/workspace/HBase-0.92/trunk/target/surefire/surefire6385574240162855869tmp
Running org.apache.hadoop.hbase.replication.TestMasterReplication
Tests run: 2, Failures: 0, Errors: 0, Skipped: 0, Time elapsed: 84.243 sec
Forking command line: /bin/sh -c cd /x1/jenkins/jenkins-slave/workspace/HBase-0.92/trunk &&
/x1/jenkins/tools/java/jdk1.6.0_20-32/jre/bin/java -enableassertions -Xmx1400m -jar /x1/jenkins/jenkins-slave/workspace/HBase-0.92/trunk/target/surefire/surefirebooter3125935538914330486.jar
/x1/jenkins/jenkins-slave/workspace/HBase-0.92/trunk/target/surefire/surefire4710829086647463174tmp
/x1/jenkins/jenkins-slave/workspace/HBase-0.92/trunk/target/surefire/surefire2132376351710437588tmp
Running org.apache.hadoop.hbase.util.TestHBaseFsckComparator
Tests run: 7, Failures: 0, Errors: 0, Skipped: 0, Time elapsed: 0.13 sec
Forking command line: /bin/sh -c cd /x1/jenkins/jenkins-slave/workspace/HBase-0.92/trunk &&
/x1/jenkins/tools/java/jdk1.6.0_20-32/jre/bin/java -enableassertions -Xmx1400m -jar /x1/jenkins/jenkins-slave/workspace/HBase-0.92/trunk/target/surefire/surefirebooter4852904037588205965.jar
/x1/jenkins/jenkins-slave/workspace/HBase-0.92/trunk/target/surefire/surefire2463737275481822038tmp
/x1/jenkins/jenkins-slave/workspace/HBase-0.92/trunk/target/surefire/surefire3221492584684705218tmp
Running org.apache.hadoop.hbase.util.TestMergeTool
Tests run: 1, Failures: 0, Errors: 0, Skipped: 0, Time elapsed: 99.6 sec
Forking command line: /bin/sh -c cd /x1/jenkins/jenkins-slave/workspace/HBase-0.92/trunk &&
/x1/jenkins/tools/java/jdk1.6.0_20-32/jre/bin/java -enableassertions -Xmx1400m -jar /x1/jenkins/jenkins-slave/workspace/HBase-0.92/trunk/target/surefire/surefirebooter1709638984149642097.jar
/x1/jenkins/jenkins-slave/workspace/HBase-0.92/trunk/target/surefire/surefire4633063402798600193tmp
/x1/jenkins/jenkins-slave/workspace/HBase-0.92/trunk/target/surefire/surefire8165780277885926244tmp
Running org.apache.hadoop.hbase.util.TestFSTableDescriptors
Tests run: 5, Failures: 0, Errors: 0, Skipped: 0, Time elapsed: 0.607 sec
Forking command line: /bin/sh -c cd /x1/jenkins/jenkins-slave/workspace/HBase-0.92/trunk &&
/x1/jenkins/tools/java/jdk1.6.0_20-32/jre/bin/java -enableassertions -Xmx1400m -jar /x1/jenkins/jenkins-slave/workspace/HBase-0.92/trunk/target/surefire/surefirebooter7870409539003622494.jar
/x1/jenkins/jenkins-slave/workspace/HBase-0.92/trunk/target/surefire/surefire4415013602638017597tmp
/x1/jenkins/jenkins-slave/workspace/HBase-0.92/trunk/target/surefire/surefire3832966228037178327tmp
Running org.apache.hadoop.hbase.util.TestIdLock
Tests run: 1, Failures: 0, Errors: 0, Skipped: 0, Time elapsed: 20.165 sec
Forking command line: /bin/sh -c cd /x1/jenkins/jenkins-slave/workspace/HBase-0.92/trunk &&
/x1/jenkins/tools/java/jdk1.6.0_20-32/jre/bin/java -enableassertions -Xmx1400m -jar /x1/jenkins/jenkins-slave/workspace/HBase-0.92/trunk/target/surefire/surefirebooter3734678198139297699.jar
/x1/jenkins/jenkins-slave/workspace/HBase-0.92/trunk/target/surefire/surefire5272681327187849928tmp
/x1/jenkins/jenkins-slave/workspace/HBase-0.92/trunk/target/surefire/surefire8617974525957129261tmp
Running org.apache.hadoop.hbase.util.TestCompressionTest
Tests run: 1, Failures: 0, Errors: 0, Skipped: 0, Time elapsed: 0.277 sec
Forking command line: /bin/sh -c cd /x1/jenkins/jenkins-slave/workspace/HBase-0.92/trunk &&
/x1/jenkins/tools/java/jdk1.6.0_20-32/jre/bin/java -enableassertions -Xmx1400m -jar /x1/jenkins/jenkins-slave/workspace/HBase-0.92/trunk/target/surefire/surefirebooter2824922057725418650.jar
/x1/jenkins/jenkins-slave/workspace/HBase-0.92/trunk/target/surefire/surefire3243087468808366319tmp
/x1/jenkins/jenkins-slave/workspace/HBase-0.92/trunk/target/surefire/surefire3047037402057126727tmp
Running org.apache.hadoop.hbase.util.TestBytes
Tests run: 11, Failures: 0, Errors: 0, Skipped: 0, Time elapsed: 0.103 sec
Forking command line: /bin/sh -c cd /x1/jenkins/jenkins-slave/workspace/HBase-0.92/trunk &&
/x1/jenkins/tools/java/jdk1.6.0_20-32/jre/bin/java -enableassertions -Xmx1400m -jar /x1/jenkins/jenkins-slave/workspace/HBase-0.92/trunk/target/surefire/surefirebooter2293949537825329770.jar
/x1/jenkins/jenkins-slave/workspace/HBase-0.92/trunk/target/surefire/surefire5737729603209733286tmp
/x1/jenkins/jenkins-slave/workspace/HBase-0.92/trunk/target/surefire/surefire7535488375356870681tmp
Running org.apache.hadoop.hbase.util.TestSortedCopyOnWriteSet
Tests run: 2, Failures: 0, Errors: 0, Skipped: 0, Time elapsed: 0.073 sec
Forking command line: /bin/sh -c cd /x1/jenkins/jenkins-slave/workspace/HBase-0.92/trunk &&
/x1/jenkins/tools/java/jdk1.6.0_20-32/jre/bin/java -enableassertions -Xmx1400m -jar /x1/jenkins/jenkins-slave/workspace/HBase-0.92/trunk/target/surefire/surefirebooter4967376040892374154.jar
/x1/jenkins/jenkins-slave/workspace/HBase-0.92/trunk/target/surefire/surefire5464306054581996692tmp
/x1/jenkins/jenkins-slave/workspace/HBase-0.92/trunk/target/surefire/surefire7722563910970496450tmp
Running org.apache.hadoop.hbase.util.TestEnvironmentEdgeManager
Tests run: 2, Failures: 0, Errors: 0, Skipped: 0, Time elapsed: 0.161 sec
Forking command line: /bin/sh -c cd /x1/jenkins/jenkins-slave/workspace/HBase-0.92/trunk &&
/x1/jenkins/tools/java/jdk1.6.0_20-32/jre/bin/java -enableassertions -Xmx1400m -jar /x1/jenkins/jenkins-slave/workspace/HBase-0.92/trunk/target/surefire/surefirebooter907659689952948857.jar
/x1/jenkins/jenkins-slave/workspace/HBase-0.92/trunk/target/surefire/surefire4052249692836453379tmp
/x1/jenkins/jenkins-slave/workspace/HBase-0.92/trunk/target/surefire/surefire4710460968016326392tmp
Running org.apache.hadoop.hbase.util.TestKeying
Tests run: 1, Failures: 0, Errors: 0, Skipped: 0, Time elapsed: 0.037 sec
Forking command line: /bin/sh -c cd /x1/jenkins/jenkins-slave/workspace/HBase-0.92/trunk &&
/x1/jenkins/tools/java/jdk1.6.0_20-32/jre/bin/java -enableassertions -Xmx1400m -jar /x1/jenkins/jenkins-slave/workspace/HBase-0.92/trunk/target/surefire/surefirebooter7693035859789663855.jar
/x1/jenkins/jenkins-slave/workspace/HBase-0.92/trunk/target/surefire/surefire3320103151597306631tmp
/x1/jenkins/jenkins-slave/workspace/HBase-0.92/trunk/target/surefire/surefire8895882506257139065tmp
Running org.apache.hadoop.hbase.util.TestByteBloomFilter
Tests run: 5, Failures: 0, Errors: 0, Skipped: 0, Time elapsed: 0.862 sec
Forking command line: /bin/sh -c cd /x1/jenkins/jenkins-slave/workspace/HBase-0.92/trunk &&
/x1/jenkins/tools/java/jdk1.6.0_20-32/jre/bin/java -enableassertions -Xmx1400m -jar /x1/jenkins/jenkins-slave/workspace/HBase-0.92/trunk/target/surefire/surefirebooter5114053125842197381.jar
/x1/jenkins/jenkins-slave/workspace/HBase-0.92/trunk/target/surefire/surefire2596948184070427833tmp
/x1/jenkins/jenkins-slave/workspace/HBase-0.92/trunk/target/surefire/surefire1038815849805890866tmp
Running org.apache.hadoop.hbase.util.TestRootPath
Tests run: 1, Failures: 0, Errors: 0, Skipped: 0, Time elapsed: 0.082 sec
Forking command line: /bin/sh -c cd /x1/jenkins/jenkins-slave/workspace/HBase-0.92/trunk &&
/x1/jenkins/tools/java/jdk1.6.0_20-32/jre/bin/java -enableassertions -Xmx1400m -jar /x1/jenkins/jenkins-slave/workspace/HBase-0.92/trunk/target/surefire/surefirebooter1070545360253847272.jar
/x1/jenkins/jenkins-slave/workspace/HBase-0.92/trunk/target/surefire/surefire2617016040690673982tmp
/x1/jenkins/jenkins-slave/workspace/HBase-0.92/trunk/target/surefire/surefire1239757718747146155tmp
Running org.apache.hadoop.hbase.util.TestMergeTable
Tests run: 1, Failures: 0, Errors: 0, Skipped: 0, Time elapsed: 35.526 sec
Forking command line: /bin/sh -c cd /x1/jenkins/jenkins-slave/workspace/HBase-0.92/trunk &&
/x1/jenkins/tools/java/jdk1.6.0_20-32/jre/bin/java -enableassertions -Xmx1400m -jar /x1/jenkins/jenkins-slave/workspace/HBase-0.92/trunk/target/surefire/surefirebooter7768176456928612046.jar
/x1/jenkins/jenkins-slave/workspace/HBase-0.92/trunk/target/surefire/surefire8930997864568645573tmp
/x1/jenkins/jenkins-slave/workspace/HBase-0.92/trunk/target/surefire/surefire2161015035087286482tmp
Running org.apache.hadoop.hbase.util.TestHBaseFsck
Tests run: 5, Failures: 0, Errors: 0, Skipped: 0, Time elapsed: 51.435 sec
Forking command line: /bin/sh -c cd /x1/jenkins/jenkins-slave/workspace/HBase-0.92/trunk &&
/x1/jenkins/tools/java/jdk1.6.0_20-32/jre/bin/java -enableassertions -Xmx1400m -jar /x1/jenkins/jenkins-slave/workspace/HBase-0.92/trunk/target/surefire/surefirebooter3527385265461793326.jar
/x1/jenkins/jenkins-slave/workspace/HBase-0.92/trunk/target/surefire/surefire5421624532910477964tmp
/x1/jenkins/jenkins-slave/workspace/HBase-0.92/trunk/target/surefire/surefire4352063600468650250tmp
Running org.apache.hadoop.hbase.util.TestFSUtils
Tests run: 2, Failures: 0, Errors: 0, Skipped: 0, Time elapsed: 24.44 sec
Forking command line: /bin/sh -c cd /x1/jenkins/jenkins-slave/workspace/HBase-0.92/trunk &&
/x1/jenkins/tools/java/jdk1.6.0_20-32/jre/bin/java -enableassertions -Xmx1400m -jar /x1/jenkins/jenkins-slave/workspace/HBase-0.92/trunk/target/surefire/surefirebooter460342804736299114.jar
/x1/jenkins/jenkins-slave/workspace/HBase-0.92/trunk/target/surefire/surefire7156759127465700288tmp
/x1/jenkins/jenkins-slave/workspace/HBase-0.92/trunk/target/surefire/surefire3553954434715192895tmp
Running org.apache.hadoop.hbase.util.TestPoolMap
Tests run: 9, Failures: 0, Errors: 0, Skipped: 0, Time elapsed: 0.036 sec
Forking command line: /bin/sh -c cd /x1/jenkins/jenkins-slave/workspace/HBase-0.92/trunk &&
/x1/jenkins/tools/java/jdk1.6.0_20-32/jre/bin/java -enableassertions -Xmx1400m -jar /x1/jenkins/jenkins-slave/workspace/HBase-0.92/trunk/target/surefire/surefirebooter2604506828552175420.jar
/x1/jenkins/jenkins-slave/workspace/HBase-0.92/trunk/target/surefire/surefire3941909936455305790tmp
/x1/jenkins/jenkins-slave/workspace/HBase-0.92/trunk/target/surefire/surefire3157388035395816220tmp
Running org.apache.hadoop.hbase.util.TestBase64
Tests run: 1, Failures: 0, Errors: 0, Skipped: 0, Time elapsed: 0.09 sec
Forking command line: /bin/sh -c cd /x1/jenkins/jenkins-slave/workspace/HBase-0.92/trunk &&
/x1/jenkins/tools/java/jdk1.6.0_20-32/jre/bin/java -enableassertions -Xmx1400m -jar /x1/jenkins/jenkins-slave/workspace/HBase-0.92/trunk/target/surefire/surefirebooter3201860672973955401.jar
/x1/jenkins/jenkins-slave/workspace/HBase-0.92/trunk/target/surefire/surefire428471523103866815tmp
/x1/jenkins/jenkins-slave/workspace/HBase-0.92/trunk/target/surefire/surefire1433725321030566477tmp
Running org.apache.hadoop.hbase.util.TestDefaultEnvironmentEdge
Tests run: 1, Failures: 0, Errors: 0, Skipped: 0, Time elapsed: 0.051 sec
Forking command line: /bin/sh -c cd /x1/jenkins/jenkins-slave/workspace/HBase-0.92/trunk &&
/x1/jenkins/tools/java/jdk1.6.0_20-32/jre/bin/java -enableassertions -Xmx1400m -jar /x1/jenkins/jenkins-slave/workspace/HBase-0.92/trunk/target/surefire/surefirebooter2647107258487585651.jar
/x1/jenkins/jenkins-slave/workspace/HBase-0.92/trunk/target/surefire/surefire8789084309271453445tmp
/x1/jenkins/jenkins-slave/workspace/HBase-0.92/trunk/target/surefire/surefire6134094421770272605tmp
Running org.apache.hadoop.hbase.util.TestIncrementingEnvironmentEdge
Tests run: 1, Failures: 0, Errors: 0, Skipped: 0, Time elapsed: 0.041 sec
Forking command line: /bin/sh -c cd /x1/jenkins/jenkins-slave/workspace/HBase-0.92/trunk &&
/x1/jenkins/tools/java/jdk1.6.0_20-32/jre/bin/java -enableassertions -Xmx1400m -jar /x1/jenkins/jenkins-slave/workspace/HBase-0.92/trunk/target/surefire/surefirebooter9193724893030769084.jar
/x1/jenkins/jenkins-slave/workspace/HBase-0.92/trunk/target/surefire/surefire8170970111318752213tmp
/x1/jenkins/jenkins-slave/workspace/HBase-0.92/trunk/target/surefire/surefire5198093554172985731tmp
Running org.apache.hadoop.hbase.util.TestRegionSplitCalculator
Tests run: 14, Failures: 0, Errors: 0, Skipped: 0, Time elapsed: 0.152 sec
Forking command line: /bin/sh -c cd /x1/jenkins/jenkins-slave/workspace/HBase-0.92/trunk &&
/x1/jenkins/tools/java/jdk1.6.0_20-32/jre/bin/java -enableassertions -Xmx1400m -jar /x1/jenkins/jenkins-slave/workspace/HBase-0.92/trunk/target/surefire/surefirebooter4861283677093114301.jar
/x1/jenkins/jenkins-slave/workspace/HBase-0.92/trunk/target/surefire/surefire8985837541494121727tmp
/x1/jenkins/jenkins-slave/workspace/HBase-0.92/trunk/target/surefire/surefire5787059951230089143tmp
Running org.apache.hadoop.hbase.TestHRegionLocation
Tests run: 3, Failures: 0, Errors: 0, Skipped: 0, Time elapsed: 0.102 sec
Forking command line: /bin/sh -c cd /x1/jenkins/jenkins-slave/workspace/HBase-0.92/trunk &&
/x1/jenkins/tools/java/jdk1.6.0_20-32/jre/bin/java -enableassertions -Xmx1400m -jar /x1/jenkins/jenkins-slave/workspace/HBase-0.92/trunk/target/surefire/surefirebooter7099481372789959703.jar
/x1/jenkins/jenkins-slave/workspace/HBase-0.92/trunk/target/surefire/surefire8416432094301687895tmp
/x1/jenkins/jenkins-slave/workspace/HBase-0.92/trunk/target/surefire/surefire3456508060349151841tmp
Running org.apache.hadoop.hbase.TestCompare
Tests run: 1, Failures: 0, Errors: 0, Skipped: 0, Time elapsed: 0.168 sec
Forking command line: /bin/sh -c cd /x1/jenkins/jenkins-slave/workspace/HBase-0.92/trunk &&
/x1/jenkins/tools/java/jdk1.6.0_20-32/jre/bin/java -enableassertions -Xmx1400m -jar /x1/jenkins/jenkins-slave/workspace/HBase-0.92/trunk/target/surefire/surefirebooter441489310391004687.jar
/x1/jenkins/jenkins-slave/workspace/HBase-0.92/trunk/target/surefire/surefire3587362389015950575tmp
/x1/jenkins/jenkins-slave/workspace/HBase-0.92/trunk/target/surefire/surefire8371350652497400710tmp
Running org.apache.hadoop.hbase.TestInfoServers
Tests run: 2, Failures: 0, Errors: 0, Skipped: 0, Time elapsed: 16.116 sec
Forking command line: /bin/sh -c cd /x1/jenkins/jenkins-slave/workspace/HBase-0.92/trunk &&
/x1/jenkins/tools/java/jdk1.6.0_20-32/jre/bin/java -enableassertions -Xmx1400m -jar /x1/jenkins/jenkins-slave/workspace/HBase-0.92/trunk/target/surefire/surefirebooter65117521512866041.jar
/x1/jenkins/jenkins-slave/workspace/HBase-0.92/trunk/target/surefire/surefire1781262134137787427tmp
/x1/jenkins/jenkins-slave/workspace/HBase-0.92/trunk/target/surefire/surefire2295080652035995067tmp
Running org.apache.hadoop.hbase.TestHServerAddress
Tests run: 6, Failures: 0, Errors: 0, Skipped: 0, Time elapsed: 0.052 sec
Forking command line: /bin/sh -c cd /x1/jenkins/jenkins-slave/workspace/HBase-0.92/trunk &&
/x1/jenkins/tools/java/jdk1.6.0_20-32/jre/bin/java -enableassertions -Xmx1400m -jar /x1/jenkins/jenkins-slave/workspace/HBase-0.92/trunk/target/surefire/surefirebooter1103208068127499189.jar
/x1/jenkins/jenkins-slave/workspace/HBase-0.92/trunk/target/surefire/surefire1267905004376004594tmp
/x1/jenkins/jenkins-slave/workspace/HBase-0.92/trunk/target/surefire/surefire244755588414745768tmp
Running org.apache.hadoop.hbase.TestServerName
Tests run: 2, Failures: 0, Errors: 0, Skipped: 0, Time elapsed: 0.062 sec

Results :

Failed tests:   testSingleMethod(org.apache.hadoop.hbase.regionserver.TestServerCustomProtocol):
Results should contain region test,,1317868310726.5f77fc362da19a34eaed9cda882aa816. for row
'aaa'

Tests run: 1017, Failures: 1, Errors: 0, Skipped: 21

[INFO] ------------------------------------------------------------------------
[INFO] BUILD FAILURE
[INFO] ------------------------------------------------------------------------
[INFO] Total time: 1:58:57.991s
[INFO] Finished at: Thu Oct 06 02:57:09 UTC 2011
[INFO] Final Memory: 40M/1037M
[INFO] ------------------------------------------------------------------------
[ERROR] Failed to execute goal org.apache.maven.plugins:maven-surefire-plugin:2.9:test (default-test)
on project hbase: Failure or timeout -> [Help 1]
org.apache.maven.lifecycle.LifecycleExecutionException: Failed to execute goal org.apache.maven.plugins:maven-surefire-plugin:2.9:test
(default-test) on project hbase: Failure or timeout
	at org.apache.maven.lifecycle.internal.MojoExecutor.execute(MojoExecutor.java:217)
	at org.apache.maven.lifecycle.internal.MojoExecutor.execute(MojoExecutor.java:153)
	at org.apache.maven.lifecycle.internal.MojoExecutor.execute(MojoExecutor.java:145)
	at org.apache.maven.lifecycle.internal.MojoExecutor.executeForkedExecutions(MojoExecutor.java:365)
	at org.apache.maven.lifecycle.internal.MojoExecutor.execute(MojoExecutor.java:199)
	at org.apache.maven.lifecycle.internal.MojoExecutor.execute(MojoExecutor.java:153)
	at org.apache.maven.lifecycle.internal.MojoExecutor.execute(MojoExecutor.java:145)
	at org.apache.maven.lifecycle.internal.LifecycleModuleBuilder.buildProject(LifecycleModuleBuilder.java:84)
	at org.apache.maven.lifecycle.internal.LifecycleModuleBuilder.buildProject(LifecycleModuleBuilder.java:59)
	at org.apache.maven.lifecycle.internal.LifecycleStarter.singleThreadedBuild(LifecycleStarter.java:183)
	at org.apache.maven.lifecycle.internal.LifecycleStarter.execute(LifecycleStarter.java:161)
	at org.apache.maven.DefaultMaven.doExecute(DefaultMaven.java:319)
	at org.apache.maven.DefaultMaven.execute(DefaultMaven.java:156)
	at org.apache.maven.cli.MavenCli.execute(MavenCli.java:534)
	at org.apache.maven.cli.MavenCli.doMain(MavenCli.java:196)
	at org.apache.maven.cli.MavenCli.main(MavenCli.java:141)
	at sun.reflect.NativeMethodAccessorImpl.invoke0(Native Method)
	at sun.reflect.NativeMethodAccessorImpl.invoke(NativeMethodAccessorImpl.java:39)
	at sun.reflect.DelegatingMethodAccessorImpl.invoke(DelegatingMethodAccessorImpl.java:25)
	at java.lang.reflect.Method.invoke(Method.java:597)
	at org.codehaus.plexus.classworlds.launcher.Launcher.launchEnhanced(Launcher.java:290)
	at org.codehaus.plexus.classworlds.launcher.Launcher.launch(Launcher.java:230)
	at org.codehaus.plexus.classworlds.launcher.Launcher.mainWithExitCode(Launcher.java:409)
	at org.codehaus.plexus.classworlds.launcher.Launcher.main(Launcher.java:352)
Caused by: org.apache.maven.plugin.MojoExecutionException: Failure or timeout
	at org.apache.maven.plugin.surefire.SurefirePlugin.assertNoFailureOrTimeout(SurefirePlugin.java:623)
	at org.apache.maven.plugin.surefire.SurefirePlugin.handleSummary(SurefirePlugin.java:604)
	at org.apache.maven.plugin.surefire.AbstractSurefireMojo.executeAfterPreconditionsChecked(AbstractSurefireMojo.java:136)
	at org.apache.maven.plugin.surefire.AbstractSurefireMojo.execute(AbstractSurefireMojo.java:97)
	at org.apache.maven.plugin.DefaultBuildPluginManager.executeMojo(DefaultBuildPluginManager.java:107)
	at org.apache.maven.lifecycle.internal.MojoExecutor.execute(MojoExecutor.java:209)
	... 23 more
[ERROR] 
[ERROR] 
[ERROR] For more information about the errors and possible solutions, please read the following
articles:
[ERROR] [Help 1] http://cwiki.apache.org/confluence/display/MAVEN/MojoExecutionException
Build step 'Invoke top-level Maven targets' marked build as failure
[locks-and-latches] Releasing all the locks
[locks-and-latches] All the locks released
Archiving artifacts
Recording test results
Updating HBASE-4386


Mime
View raw message