hbase-dev mailing list archives

Site index · List index
Message view « Date » · « Thread »
Top « Date » · « Thread »
From Apache Jenkins Server <jenk...@builds.apache.org>
Subject Build failed in Jenkins: HBase-TRUNK #2287
Date Mon, 03 Oct 2011 23:48:03 GMT
See <https://builds.apache.org/job/HBase-TRUNK/2287/>

------------------------------------------
[...truncated 5655 lines...]
[DEBUG]   Excluded: org.apache.maven:maven-plugin-registry:jar:2.0.6
[DEBUG]   Excluded: org.apache.maven:maven-settings:jar:2.0.6
[DEBUG]   Excluded: org.apache.maven.wagon:wagon-provider-api:jar:1.0-beta-4
[DEBUG]   Excluded: org.codehaus.plexus:plexus-container-default:jar:1.0-alpha-9
[DEBUG]   Excluded: classworlds:classworlds:jar:1.1-alpha-2
[DEBUG] Configuring mojo org.apache.maven.plugins:maven-site-plugin:2.1:site from plugin realm
ClassRealm[plugin>org.apache.maven.plugins:maven-site-plugin:2.1, parent: sun.misc.Launcher$AppClassLoader@16f0472]
[DEBUG] Setting property: classpath.resource.loader.class => 'org.codehaus.plexus.velocity.ContextClassLoaderResourceLoader'.
[DEBUG] Setting property: site.resource.loader.class => 'org.codehaus.plexus.velocity.SiteResourceLoader'.
[DEBUG] Setting property: velocimacro.messages.on => 'false'.
[DEBUG] Setting property: resource.loader => 'classpath,site'.
[DEBUG] Setting property: runtime.log.invalid.references => 'false'.
[DEBUG] Setting property: resource.manager.logwhenfound => 'false'.
[DEBUG] Setting property: velocimacro.permissions.allow.inline.to.replace.global => 'true'.
[DEBUG] *******************************************************************
[DEBUG] Starting Apache Velocity v1.5 (compiled: 2007-02-22 08:52:29)
[DEBUG] RuntimeInstance initializing.
[DEBUG] Default Properties File: org/apache/velocity/runtime/defaults/velocity.properties
[DEBUG] LogSystem has been deprecated. Please use a LogChute implementation.
[DEBUG] Default ResourceManager initializing. (class org.apache.velocity.runtime.resource.ResourceManagerImpl)
[DEBUG] ResourceLoader instantiated: org.codehaus.plexus.velocity.ContextClassLoaderResourceLoader
[DEBUG] ResourceLoader instantiated: org.codehaus.plexus.velocity.SiteResourceLoader
[DEBUG] ResourceCache: initialized (class org.apache.velocity.runtime.resource.ResourceCacheImpl)
[DEBUG] Default ResourceManager initialization complete.
[DEBUG] Loaded System Directive: org.apache.velocity.runtime.directive.Literal
[DEBUG] Loaded System Directive: org.apache.velocity.runtime.directive.Macro
[DEBUG] Loaded System Directive: org.apache.velocity.runtime.directive.Parse
[DEBUG] Loaded System Directive: org.apache.velocity.runtime.directive.Include
[DEBUG] Loaded System Directive: org.apache.velocity.runtime.directive.Foreach
[DEBUG] Created '20' parsers.
[DEBUG] Velocimacro : initialization starting.
[DEBUG] Velocimacro : allowInline = true : VMs can be defined inline in templates
[DEBUG] Velocimacro : allowInlineToOverride = true : VMs defined inline may replace previous
VM definitions
[DEBUG] Velocimacro : allowInlineLocal = false : VMs defined inline will be global in scope
if allowed.
[DEBUG] Velocimacro : autoload off : VM system will not automatically reload global library
macros
[DEBUG] Velocimacro : Velocimacro : initialization complete.
[DEBUG] RuntimeInstance successfully initialized.
[DEBUG] Configuring mojo 'org.apache.maven.plugins:maven-site-plugin:2.1:site' with basic
configurator -->
[DEBUG]   (f) attributes = {}
[DEBUG]   (f) generateReports = true
[DEBUG]   (f) generateSitemap = false
[DEBUG]   (f) generatedSiteDirectory = <https://builds.apache.org/job/HBase-TRUNK/ws/trunk/target/generated-site>
[DEBUG]   (f) inputEncoding = UTF-8
[DEBUG]   (f) localRepository =        id: local
      url: file:///home/jenkins/.m2/repository/
   layout: none

[DEBUG]   (f) outputDirectory = <https://builds.apache.org/job/HBase-TRUNK/ws/trunk/target/site>
[DEBUG]   (f) project = MavenProject: org.apache.hbase:hbase:0.93-SNAPSHOT @ <https://builds.apache.org/job/HBase-TRUNK/ws/trunk/pom.xml>
[DEBUG]   (f) reactorProjects = [MavenProject: org.apache.hbase:hbase:0.93-SNAPSHOT @ <https://builds.apache.org/job/HBase-TRUNK/ws/trunk/pom.xml]>
[DEBUG]   (f) reports = []
[DEBUG]   (f) repositories = [       id: apache release
      url: https://repository.apache.org/content/repositories/releases/
   layout: default
snapshots: [enabled => true, update => daily]
 releases: [enabled => true, update => daily]
,        id: hadoop-non-releases
      url: http://people.apache.org/~rawson/repo/
   layout: default
snapshots: [enabled => false, update => daily]
 releases: [enabled => true, update => daily]
,        id: java.net
      url: http://download.java.net/maven/2/
   layout: default
snapshots: [enabled => false, update => daily]
 releases: [enabled => true, update => daily]
,        id: codehaus
      url: http://repository.codehaus.org/
   layout: default
snapshots: [enabled => false, update => daily]
 releases: [enabled => true, update => daily]
,        id: repository.jboss.org
      url: http://repository.jboss.org/nexus/content/groups/public-jboss/
   layout: default
snapshots: [enabled => false, update => daily]
 releases: [enabled => true, update => daily]
,        id: Nexus
      url: http://repository.apache.org/snapshots
   layout: default
snapshots: [enabled => true, update => daily]
 releases: [enabled => false, update => daily]
,        id: central
      url: http://repo1.maven.org/maven2
   layout: default
snapshots: [enabled => false, update => daily]
 releases: [enabled => true, update => daily]
]
[DEBUG]   (f) siteDirectory = <https://builds.apache.org/job/HBase-TRUNK/ws/trunk/src/site>
[DEBUG]   (f) templateDirectory = <https://builds.apache.org/job/HBase-TRUNK/ws/trunk/src/site>
[DEBUG]   (f) xdocDirectory = <https://builds.apache.org/job/HBase-TRUNK/ws/trunk/xdocs>
[DEBUG] -- end configuration --
[DEBUG] Reading site descriptor from <https://builds.apache.org/job/HBase-TRUNK/2287/artifact/trunk/src/site/site.xml>
[DEBUG] Extension realms for project org.apache:apache:pom:8: (none)
[DEBUG] Looking up lifecyle mappings for packaging pom from ClassRealm[plexus.core, parent:
null]
[INFO] Parent project loaded from repository.
[DEBUG] Parent project loaded ...
[DEBUG] Skipped site descriptor for locale en
[DEBUG] Skipped remote site descriptor check
[DEBUG] Skin used: groupId = 'org.apache.maven.skins'
artifactId = 'maven-stylus-skin'
version = 'null'
[INFO] Parent project loaded from repository.
[DEBUG] Could not find metadata org.apache.maven.skins:maven-stylus-skin/maven-metadata.xml
in local (/home/jenkins/.m2/repository)
[DEBUG] Using connector WagonRepositoryConnector with priority 0 for http://repository.codehaus.org/
[DEBUG] Using connector WagonRepositoryConnector with priority 0 for http://people.apache.org/~rawson/repo/
Downloading: http://repository.codehaus.org/org/apache/maven/skins/maven-stylus-skin/maven-metadata.xml
[DEBUG] Using connector WagonRepositoryConnector with priority 0 for https://repository.apache.org/content/repositories/releases/
Downloading: http://people.apache.org/~rawson/repo/org/apache/maven/skins/maven-stylus-skin/maven-metadata.xml
[DEBUG] Using connector WagonRepositoryConnector with priority 0 for http://download.java.net/maven/2/
Downloading: https://repository.apache.org/content/repositories/releases/org/apache/maven/skins/maven-stylus-skin/maven-metadata.xml
Downloading: http://download.java.net/maven/2/org/apache/maven/skins/maven-stylus-skin/maven-metadata.xml
        
[DEBUG] Reading resolution tracking file /home/jenkins/.m2/repository/org/apache/maven/skins/maven-stylus-skin/resolver-status.properties
[DEBUG] Writing resolution tracking file /home/jenkins/.m2/repository/org/apache/maven/skins/maven-stylus-skin/resolver-status.properties
[DEBUG] Using connector WagonRepositoryConnector with priority 0 for http://repository.jboss.org/nexus/content/groups/public-jboss/
Downloading: http://repository.jboss.org/nexus/content/groups/public-jboss/org/apache/maven/skins/maven-stylus-skin/maven-metadata.xml
        
[DEBUG] Reading resolution tracking file /home/jenkins/.m2/repository/org/apache/maven/skins/maven-stylus-skin/resolver-status.properties
[DEBUG] Writing resolution tracking file /home/jenkins/.m2/repository/org/apache/maven/skins/maven-stylus-skin/resolver-status.properties
[DEBUG] Using connector WagonRepositoryConnector with priority 0 for http://repo1.maven.org/maven2
Downloading: http://repo1.maven.org/maven2/org/apache/maven/skins/maven-stylus-skin/maven-metadata.xml
        
[DEBUG] Reading resolution tracking file /home/jenkins/.m2/repository/org/apache/maven/skins/maven-stylus-skin/resolver-status.properties
[DEBUG] Writing resolution tracking file /home/jenkins/.m2/repository/org/apache/maven/skins/maven-stylus-skin/resolver-status.properties
458 B   
        
Downloaded: http://repo1.maven.org/maven2/org/apache/maven/skins/maven-stylus-skin/maven-metadata.xml
(458 B at 1.4 KB/sec)
[DEBUG] Reading resolution tracking file /home/jenkins/.m2/repository/org/apache/maven/skins/maven-stylus-skin/resolver-status.properties
[DEBUG] Writing resolution tracking file /home/jenkins/.m2/repository/org/apache/maven/skins/maven-stylus-skin/resolver-status.properties
458 B   
        
Downloaded: https://repository.apache.org/content/repositories/releases/org/apache/maven/skins/maven-stylus-skin/maven-metadata.xml
(458 B at 0.5 KB/sec)
[DEBUG] Reading resolution tracking file /home/jenkins/.m2/repository/org/apache/maven/skins/maven-stylus-skin/resolver-status.properties
[DEBUG] Writing resolution tracking file /home/jenkins/.m2/repository/org/apache/maven/skins/maven-stylus-skin/resolver-status.properties
        
[DEBUG] Reading resolution tracking file /home/jenkins/.m2/repository/org/apache/maven/skins/maven-stylus-skin/resolver-status.properties
[DEBUG] Writing resolution tracking file /home/jenkins/.m2/repository/org/apache/maven/skins/maven-stylus-skin/resolver-status.properties
[DEBUG] Could not find metadata org.apache.maven.skins:maven-stylus-skin/maven-metadata.xml
in hadoop-non-releases (http://people.apache.org/~rawson/repo/)
[DEBUG] Could not find metadata org.apache.maven.skins:maven-stylus-skin/maven-metadata.xml
in java.net (http://download.java.net/maven/2/)
[DEBUG] Could not find metadata org.apache.maven.skins:maven-stylus-skin/maven-metadata.xml
in codehaus (http://repository.codehaus.org/)
[DEBUG] Could not find metadata org.apache.maven.skins:maven-stylus-skin/maven-metadata.xml
in repository.jboss.org (http://repository.jboss.org/nexus/content/groups/public-jboss/)
[DEBUG] Generating <https://builds.apache.org/job/HBase-TRUNK/2287/artifact/trunk/target/site/acid-semantics.html>
[DEBUG] Validating the content...
[INFO]                                                                         
[INFO] ------------------------------------------------------------------------
[INFO] Skipping HBase
[INFO] This project has been banned from the build due to previous failures.
[INFO] ------------------------------------------------------------------------
[INFO] ------------------------------------------------------------------------
[INFO] BUILD FAILURE
[INFO] ------------------------------------------------------------------------
[INFO] Total time: 42.287s
[INFO] Finished at: Mon Oct 03 23:48:01 UTC 2011
[INFO] Final Memory: 29M/802M
[INFO] ------------------------------------------------------------------------
[ERROR] Failed to execute goal org.apache.maven.plugins:maven-site-plugin:2.1:site (default-site)
on project hbase: Error during page generation: Error parsing '<https://builds.apache.org/job/HBase-TRUNK/ws/trunk/src/site/xdoc/acid-semantics.xml'>:
line [-1] Error validating the model: Error:
[ERROR] Public ID: null
[ERROR] System ID: null
[ERROR] Line number: 23
[ERROR] Column number: 98
[ERROR] Message: Attribute "xmlns" must be declared for element type "document".
[ERROR] -> [Help 1]
org.apache.maven.lifecycle.LifecycleExecutionException: Failed to execute goal org.apache.maven.plugins:maven-site-plugin:2.1:site
(default-site) on project hbase: Error during page generation
	at org.apache.maven.lifecycle.internal.MojoExecutor.execute(MojoExecutor.java:217)
	at org.apache.maven.lifecycle.internal.MojoExecutor.execute(MojoExecutor.java:153)
	at org.apache.maven.lifecycle.internal.MojoExecutor.execute(MojoExecutor.java:145)
	at org.apache.maven.lifecycle.internal.LifecycleModuleBuilder.buildProject(LifecycleModuleBuilder.java:84)
	at org.apache.maven.lifecycle.internal.LifecycleModuleBuilder.buildProject(LifecycleModuleBuilder.java:59)
	at org.apache.maven.lifecycle.internal.LifecycleStarter.singleThreadedBuild(LifecycleStarter.java:183)
	at org.apache.maven.lifecycle.internal.LifecycleStarter.execute(LifecycleStarter.java:161)
	at org.apache.maven.DefaultMaven.doExecute(DefaultMaven.java:319)
	at org.apache.maven.DefaultMaven.execute(DefaultMaven.java:156)
	at org.apache.maven.cli.MavenCli.execute(MavenCli.java:537)
	at org.apache.maven.cli.MavenCli.doMain(MavenCli.java:196)
	at org.apache.maven.cli.MavenCli.main(MavenCli.java:141)
	at sun.reflect.NativeMethodAccessorImpl.invoke0(Native Method)
	at sun.reflect.NativeMethodAccessorImpl.invoke(NativeMethodAccessorImpl.java:39)
	at sun.reflect.DelegatingMethodAccessorImpl.invoke(DelegatingMethodAccessorImpl.java:25)
	at java.lang.reflect.Method.invoke(Method.java:597)
	at org.codehaus.plexus.classworlds.launcher.Launcher.launchEnhanced(Launcher.java:290)
	at org.codehaus.plexus.classworlds.launcher.Launcher.launch(Launcher.java:230)
	at org.codehaus.plexus.classworlds.launcher.Launcher.mainWithExitCode(Launcher.java:409)
	at org.codehaus.plexus.classworlds.launcher.Launcher.main(Launcher.java:352)
Caused by: org.apache.maven.plugin.MojoExecutionException: Error during page generation
	at org.apache.maven.plugins.site.SiteMojo.execute(SiteMojo.java:114)
	at org.apache.maven.plugin.DefaultBuildPluginManager.executeMojo(DefaultBuildPluginManager.java:101)
	at org.apache.maven.lifecycle.internal.MojoExecutor.execute(MojoExecutor.java:209)
	... 19 more
Caused by: org.apache.maven.doxia.siterenderer.RendererException: Error parsing '<https://builds.apache.org/job/HBase-TRUNK/ws/trunk/src/site/xdoc/acid-semantics.xml'>:
line [-1] Error validating the model: Error:
  Public ID: null
  System ID: null
  Line number: 23
  Column number: 98
  Message: Attribute "xmlns" must be declared for element type "document".

	at org.apache.maven.doxia.siterenderer.DefaultSiteRenderer.renderDocument(DefaultSiteRenderer.java:412)
	at org.apache.maven.doxia.siterenderer.DoxiaDocumentRenderer.renderDocument(DoxiaDocumentRenderer.java:53)
	at org.apache.maven.doxia.siterenderer.DefaultSiteRenderer.renderModule(DefaultSiteRenderer.java:328)
	at org.apache.maven.doxia.siterenderer.DefaultSiteRenderer.render(DefaultSiteRenderer.java:132)
	at org.apache.maven.plugins.site.SiteMojo.renderLocale(SiteMojo.java:142)
	at org.apache.maven.plugins.site.SiteMojo.execute(SiteMojo.java:109)
	... 21 more
Caused by: org.apache.maven.doxia.parser.ParseException: Error validating the model: Error:
  Public ID: null
  System ID: null
  Line number: 23
  Column number: 98
  Message: Attribute "xmlns" must be declared for element type "document".

	at org.apache.maven.doxia.parser.AbstractXmlParser.validate(AbstractXmlParser.java:652)
	at org.apache.maven.doxia.parser.AbstractXmlParser.parse(AbstractXmlParser.java:142)
	at org.apache.maven.doxia.parser.XhtmlBaseParser.parse(XhtmlBaseParser.java:90)
	at org.apache.maven.doxia.module.xdoc.XdocParser.parse(XdocParser.java:104)
	at org.apache.maven.doxia.DefaultDoxia.parse(DefaultDoxia.java:63)
	at org.apache.maven.doxia.siterenderer.DefaultSiteRenderer.renderDocument(DefaultSiteRenderer.java:404)
	... 26 more
Caused by: org.xml.sax.SAXException: Error:
  Public ID: null
  System ID: null
  Line number: 23
  Column number: 98
  Message: Attribute "xmlns" must be declared for element type "document".

	at org.apache.maven.doxia.parser.AbstractXmlParser$MessagesErrorHandler.processException(AbstractXmlParser.java:913)
	at org.apache.maven.doxia.parser.AbstractXmlParser$MessagesErrorHandler.error(AbstractXmlParser.java:857)
	at org.apache.xerces.util.ErrorHandlerWrapper.error(Unknown Source)
	at org.apache.xerces.impl.XMLErrorReporter.reportError(Unknown Source)
	at org.apache.xerces.impl.XMLErrorReporter.reportError(Unknown Source)
	at org.apache.xerces.impl.dtd.XMLDTDValidator.addDTDDefaultAttrsAndValidate(Unknown Source)
	at org.apache.xerces.impl.dtd.XMLDTDValidator.handleStartElement(Unknown Source)
	at org.apache.xerces.impl.dtd.XMLDTDValidator.startElement(Unknown Source)
	at org.apache.xerces.impl.XMLNSDocumentScannerImpl.scanStartElement(Unknown Source)
	at org.apache.xerces.impl.XMLNSDocumentScannerImpl$NSContentDispatcher.scanRootElementHook(Unknown
Source)
	at org.apache.xerces.impl.XMLDocumentFragmentScannerImpl$FragmentContentDispatcher.dispatch(Unknown
Source)
	at org.apache.xerces.impl.XMLDocumentFragmentScannerImpl.scanDocument(Unknown Source)
	at org.apache.xerces.parsers.XML11Configuration.parse(Unknown Source)
	at org.apache.xerces.parsers.XML11Configuration.parse(Unknown Source)
	at org.apache.xerces.parsers.XMLParser.parse(Unknown Source)
	at org.apache.xerces.parsers.AbstractSAXParser.parse(Unknown Source)
	at org.apache.maven.doxia.parser.AbstractXmlParser.validate(AbstractXmlParser.java:635)
	... 31 more
[ERROR] 
[ERROR] 
[ERROR] For more information about the errors and possible solutions, please read the following
articles:
[ERROR] [Help 1] http://cwiki.apache.org/confluence/display/MAVEN/MojoExecutionException
Build step 'Invoke top-level Maven targets' marked build as failure
[locks-and-latches] Releasing all the locks
[locks-and-latches] All the locks released
Archiving artifacts
Recording test results


Mime
View raw message