hbase-dev mailing list archives

Site index · List index
Message view « Date » · « Thread »
Top « Date » · « Thread »
From Apache Jenkins Server <jenk...@builds.apache.org>
Subject Build failed in Jenkins: HBase-TRUNK #2307
Date Sat, 08 Oct 2011 17:01:46 GMT
See <https://builds.apache.org/job/HBase-TRUNK/2307/>

------------------------------------------
[...truncated 1066 lines...]
A         src/main/resources/hbase-webapps/master
A         src/main/resources/hbase-webapps/master/zk.jsp
A         src/main/resources/hbase-webapps/master/tablesDetailed.jsp
A         src/main/resources/hbase-webapps/master/table.jsp
A         src/main/resources/hbase-webapps/master/master.jsp
A         src/main/resources/hbase-webapps/master/index.html
A         src/main/resources/hbase-default.xml
A         src/main/resources/org
A         src/main/resources/org/apache
A         src/main/resources/org/apache/hadoop
A         src/main/resources/org/apache/hadoop/hbase
A         src/main/resources/org/apache/hadoop/hbase/thrift
A         src/main/resources/org/apache/hadoop/hbase/thrift/Hbase.thrift
A         src/main/resources/org/apache/hadoop/hbase/mapreduce
A         src/main/resources/org/apache/hadoop/hbase/mapreduce/RowCounter_Counters.properties
A         src/main/resources/org/apache/hadoop/hbase/mapred
A         src/main/resources/org/apache/hadoop/hbase/mapred/RowCounter_Counters.properties
A         src/main/resources/org/apache/hadoop/hbase/rest
A         src/main/resources/org/apache/hadoop/hbase/rest/protobuf
A         src/main/resources/org/apache/hadoop/hbase/rest/protobuf/TableSchemaMessage.proto
A         src/main/resources/org/apache/hadoop/hbase/rest/protobuf/ScannerMessage.proto
A         src/main/resources/org/apache/hadoop/hbase/rest/protobuf/StorageClusterStatusMessage.proto
A         src/main/resources/org/apache/hadoop/hbase/rest/protobuf/CellSetMessage.proto
A         src/main/resources/org/apache/hadoop/hbase/rest/protobuf/ColumnSchemaMessage.proto
A         src/main/resources/org/apache/hadoop/hbase/rest/protobuf/CellMessage.proto
A         src/main/resources/org/apache/hadoop/hbase/rest/protobuf/TableInfoMessage.proto
A         src/main/resources/org/apache/hadoop/hbase/rest/protobuf/TableListMessage.proto
A         src/main/resources/org/apache/hadoop/hbase/rest/protobuf/VersionMessage.proto
A         src/main/resources/org/apache/hadoop/hbase/rest/XMLSchema.xsd
A         src/main/xslt
A         src/main/xslt/configuration_to_docbook_section.xsl
A         src/site
A         src/site/site.xml
A         src/site/site.vm
A         src/site/resources
A         src/site/resources/images
AU        src/site/resources/images/hfilev2.png
AU        src/site/resources/images/replication_overview.png
AU        src/site/resources/images/hbase_logo.png
AU        src/site/resources/images/architecture.gif
AU        src/site/resources/images/hadoop-logo.jpg
AU        src/site/resources/images/hfile.png
AU        src/site/resources/images/hbase_logo_med.gif
AU        src/site/resources/images/favicon.ico
AU        src/site/resources/images/hbase_small.gif
A         src/site/resources/css
A         src/site/resources/css/freebsd_docbook.css
A         src/site/resources/css/site.css
A         src/site/xdoc
A         src/site/xdoc/cygwin.xml
A         src/site/xdoc/acid-semantics.xml
A         src/site/xdoc/metrics.xml
A         src/site/xdoc/index.xml
A         src/site/xdoc/replication.xml
A         src/site/xdoc/old_news.xml
A         src/site/xdoc/bulk-loads.xml
A         src/site/xdoc/pseudo-distributed.xml
A         src/docbkx
A         src/docbkx/upgrading.xml
A         src/docbkx/performance.xml
A         src/docbkx/developer.xml
A         src/docbkx/preface.xml
A         src/docbkx/configuration.xml
A         src/docbkx/getting_started.xml
A         src/docbkx/shell.xml
A         src/docbkx/troubleshooting.xml
AU        src/docbkx/ops_mgt.xml
A         src/docbkx/book.xml
AU        src/docbkx/external_apis.xml
A         src/docbkx/build.xml
AU        src/saveVersion.sh
A         src/examples
A         src/examples/thrift
A         src/examples/thrift/DemoClient.java
A         src/examples/thrift/DemoClient.cpp
A         src/examples/thrift/DemoClient.rb
A         src/examples/thrift/DemoClient.php
AU        src/examples/thrift/DemoClient.py
A         src/examples/thrift/README.txt
A         src/examples/thrift/DemoClient.pl
A         src/examples/thrift/Makefile
A         src/examples/mapreduce
A         src/examples/mapreduce/org
A         src/examples/mapreduce/org/apache
A         src/examples/mapreduce/org/apache/hadoop
A         src/examples/mapreduce/org/apache/hadoop/hbase
A         src/examples/mapreduce/org/apache/hadoop/hbase/mapreduce
A         src/examples/mapreduce/org/apache/hadoop/hbase/mapreduce/SampleUploader.java
A         src/examples/mapreduce/org/apache/hadoop/hbase/mapreduce/IndexBuilder.java
A         src/examples/mapreduce/index-builder-setup.rb
A         src/examples/README.txt
A         src/packages
A         src/packages/update-hbase-env.sh
A         src/packages/conf-pseudo
A         src/packages/conf-pseudo/hbase-site.xml
A         src/packages/deb
A         src/packages/deb/conf-pseudo.control
A         src/packages/deb/conf-pseudo.control/control
A         src/packages/deb/conf-pseudo.control/postinst
A         src/packages/deb/conf-pseudo.control/conffile
A         src/packages/deb/conf-pseudo.control/prerm
A         src/packages/deb/hbase.control
A         src/packages/deb/hbase.control/control
A         src/packages/deb/hbase.control/postinst
A         src/packages/deb/hbase.control/postrm
A         src/packages/deb/hbase.control/preinst
A         src/packages/deb/hbase.control/conffile
A         src/packages/deb/hbase.control/prerm
A         src/packages/deb/init.d
A         src/packages/deb/init.d/hbase-regionserver
A         src/packages/deb/init.d/hbase-master
A         src/packages/build.xml
A         src/packages/rpm
A         src/packages/rpm/init.d
A         src/packages/rpm/init.d/hbase-regionserver
A         src/packages/rpm/init.d/hbase-master
A         src/packages/rpm/spec
A         src/packages/rpm/spec/conf-pseudo.spec
A         src/packages/rpm/spec/hbase.spec
A         bin
AU        bin/hbase-daemons.sh
A         bin/rename_table.rb
AU        bin/hbase
A         bin/copy_table.rb
A         bin/check_meta.rb
AU        bin/start-hbase.sh
A         bin/hirb.rb
A         bin/set_meta_block_caching.rb
A         bin/loadtable.rb
AU        bin/hbase-daemon.sh
A         bin/region_mover.rb
A         bin/hbase-config.sh
A         bin/local-regionservers.sh
AU        bin/zookeepers.sh
A         bin/local-master-backup.sh
A         bin/add_table.rb
AU        bin/rolling-restart.sh
AU        bin/regionservers.sh
A         bin/graceful_stop.sh
AU        bin/master-backup.sh
A         bin/set_meta_memstore_size.rb
A         bin/replication
A         bin/replication/copy_tables_desc.rb
AU        bin/stop-hbase.sh
A         pom.xml
A         README.txt
 U        .
At revision 1180411
no change for https://svn.apache.org/repos/asf/hbase/trunk since the previous build
[locks-and-latches] Checking to see if we really have the locks
[locks-and-latches] Have all the locks, build can start
[HBase-TRUNK] $ /bin/bash -xe /tmp/hudson1962781617896152385.sh
+ hostname
hemera
[HBase-TRUNK] $ /bin/bash -xe /tmp/hudson8569636713087354222.sh
+ ulimit -a
core file size          (blocks, -c) 0
data seg size           (kbytes, -d) unlimited
scheduling priority             (-e) 20
file size               (blocks, -f) unlimited
pending signals                 (-i) 16382
max locked memory       (kbytes, -l) 64
max memory size         (kbytes, -m) unlimited
open files                      (-n) 40000
pipe size            (512 bytes, -p) 8
POSIX message queues     (bytes, -q) 819200
real-time priority              (-r) 0
stack size              (kbytes, -s) 8192
cpu time               (seconds, -t) unlimited
max user processes              (-u) unlimited
virtual memory          (kbytes, -v) unlimited
file locks                      (-x) unlimited
[trunk] $ /home/hudson/tools/maven/latest3/bin/mvn -e clean -Dmaven.test.redirectTestOutputToFile=true
site assembly:assembly
[INFO] Error stacktraces are turned on.
[INFO] Scanning for projects...
[WARNING] 
[WARNING] Some problems were encountered while building the effective model for org.apache.hbase:hbase:jar:0.93-SNAPSHOT
[WARNING] 'version' contains an expression but should be a constant. @ org.apache.hbase:hbase:${hbase.version},
/x1/jenkins/jenkins-slave/workspace/HBase-TRUNK/trunk/pom.xml, line 19, column 12
[WARNING] 
[WARNING] It is highly recommended to fix these problems because they threaten the stability
of your build.
[WARNING] 
[WARNING] For this reason, future Maven versions might no longer support building such malformed
projects.
[WARNING] 
[INFO]                                                                         
[INFO] ------------------------------------------------------------------------
[INFO] Building HBase 0.93-SNAPSHOT
[INFO] ------------------------------------------------------------------------
[INFO] 
[INFO] --- maven-clean-plugin:2.4.1:clean (default-clean) @ hbase ---
[INFO] Deleting /x1/jenkins/jenkins-slave/workspace/HBase-TRUNK/trunk/target
[INFO]                                                                         
[INFO] ------------------------------------------------------------------------
[INFO] Skipping HBase
[INFO] This project has been banned from the build due to previous failures.
[INFO] ------------------------------------------------------------------------
[INFO] ------------------------------------------------------------------------
[INFO] BUILD FAILURE
[INFO] ------------------------------------------------------------------------
[INFO] Total time: 5.040s
[INFO] Finished at: Sat Oct 08 17:01:45 UTC 2011
[INFO] Final Memory: 8M/79M
[INFO] ------------------------------------------------------------------------
[ERROR] Failed to execute goal org.apache.maven.plugins:maven-clean-plugin:2.4.1:clean (default-clean)
on project hbase: Failed to clean project: Failed to delete /x1/jenkins/jenkins-slave/workspace/HBase-TRUNK/trunk/target/test-data/b33fe3b9-3d70-4c51-8674-64310ed5c6dc/dfs/data
-> [Help 1]
org.apache.maven.lifecycle.LifecycleExecutionException: Failed to execute goal org.apache.maven.plugins:maven-clean-plugin:2.4.1:clean
(default-clean) on project hbase: Failed to clean project: Failed to delete /x1/jenkins/jenkins-slave/workspace/HBase-TRUNK/trunk/target/test-data/b33fe3b9-3d70-4c51-8674-64310ed5c6dc/dfs/data
	at org.apache.maven.lifecycle.internal.MojoExecutor.execute(MojoExecutor.java:217)
	at org.apache.maven.lifecycle.internal.MojoExecutor.execute(MojoExecutor.java:153)
	at org.apache.maven.lifecycle.internal.MojoExecutor.execute(MojoExecutor.java:145)
	at org.apache.maven.lifecycle.internal.LifecycleModuleBuilder.buildProject(LifecycleModuleBuilder.java:84)
	at org.apache.maven.lifecycle.internal.LifecycleModuleBuilder.buildProject(LifecycleModuleBuilder.java:59)
	at org.apache.maven.lifecycle.internal.LifecycleStarter.singleThreadedBuild(LifecycleStarter.java:183)
	at org.apache.maven.lifecycle.internal.LifecycleStarter.execute(LifecycleStarter.java:161)
	at org.apache.maven.DefaultMaven.doExecute(DefaultMaven.java:319)
	at org.apache.maven.DefaultMaven.execute(DefaultMaven.java:156)
	at org.apache.maven.cli.MavenCli.execute(MavenCli.java:534)
	at org.apache.maven.cli.MavenCli.doMain(MavenCli.java:196)
	at org.apache.maven.cli.MavenCli.main(MavenCli.java:141)
	at sun.reflect.NativeMethodAccessorImpl.invoke0(Native Method)
	at sun.reflect.NativeMethodAccessorImpl.invoke(NativeMethodAccessorImpl.java:39)
	at sun.reflect.DelegatingMethodAccessorImpl.invoke(DelegatingMethodAccessorImpl.java:25)
	at java.lang.reflect.Method.invoke(Method.java:597)
	at org.codehaus.plexus.classworlds.launcher.Launcher.launchEnhanced(Launcher.java:290)
	at org.codehaus.plexus.classworlds.launcher.Launcher.launch(Launcher.java:230)
	at org.codehaus.plexus.classworlds.launcher.Launcher.mainWithExitCode(Launcher.java:409)
	at org.codehaus.plexus.classworlds.launcher.Launcher.main(Launcher.java:352)
Caused by: org.apache.maven.plugin.MojoExecutionException: Failed to clean project: Failed
to delete /x1/jenkins/jenkins-slave/workspace/HBase-TRUNK/trunk/target/test-data/b33fe3b9-3d70-4c51-8674-64310ed5c6dc/dfs/data
	at org.apache.maven.plugin.clean.CleanMojo.execute(CleanMojo.java:188)
	at org.apache.maven.plugin.DefaultBuildPluginManager.executeMojo(DefaultBuildPluginManager.java:107)
	at org.apache.maven.lifecycle.internal.MojoExecutor.execute(MojoExecutor.java:209)
	... 19 more
Caused by: java.io.IOException: Failed to delete /x1/jenkins/jenkins-slave/workspace/HBase-TRUNK/trunk/target/test-data/b33fe3b9-3d70-4c51-8674-64310ed5c6dc/dfs/data
	at org.apache.maven.plugin.clean.Cleaner.delete(Cleaner.java:227)
	at org.apache.maven.plugin.clean.Cleaner.delete(Cleaner.java:186)
	at org.apache.maven.plugin.clean.Cleaner.delete(Cleaner.java:154)
	at org.apache.maven.plugin.clean.Cleaner.delete(Cleaner.java:154)
	at org.apache.maven.plugin.clean.Cleaner.delete(Cleaner.java:154)
	at org.apache.maven.plugin.clean.Cleaner.delete(Cleaner.java:154)
	at org.apache.maven.plugin.clean.Cleaner.delete(Cleaner.java:115)
	at org.apache.maven.plugin.clean.CleanMojo.execute(CleanMojo.java:168)
	... 21 more
[ERROR] 
[ERROR] Re-run Maven using the -X switch to enable full debug logging.
[ERROR] 
[ERROR] For more information about the errors and possible solutions, please read the following
articles:
[ERROR] [Help 1] http://cwiki.apache.org/confluence/display/MAVEN/MojoExecutionException
Build step 'Invoke top-level Maven targets' marked build as failure
[locks-and-latches] Releasing all the locks
[locks-and-latches] All the locks released
Archiving artifacts
Recording test results


Mime
View raw message