hbase-dev mailing list archives

Site index · List index
Message view « Date » · « Thread »
Top « Date » · « Thread »
From Apache Jenkins Server <jenk...@builds.apache.org>
Subject Build failed in Jenkins: HBase-0.92 #80
Date Tue, 25 Oct 2011 18:52:07 GMT
See <https://builds.apache.org/job/HBase-0.92/80/>

------------------------------------------
[...truncated 6150 lines...]
Forking command line: /bin/sh -c cd <https://builds.apache.org/job/HBase-0.92/ws/trunk>
&& /home/jenkins/tools/java/jdk1.6.0_27-32/jre/bin/java -enableassertions -Xmx1400m
-jar <https://builds.apache.org/job/HBase-0.92/ws/trunk/target/surefire/surefirebooter5294841666233533114.jar>
<https://builds.apache.org/job/HBase-0.92/ws/trunk/target/surefire/surefire6223521260163138194tmp>
<https://builds.apache.org/job/HBase-0.92/ws/trunk/target/surefire/surefire6974958183883149958tmp>
Running org.apache.hadoop.hbase.rest.TestGzipFilter
Tests run: 3, Failures: 0, Errors: 0, Skipped: 0, Time elapsed: 22.918 sec
Forking command line: /bin/sh -c cd <https://builds.apache.org/job/HBase-0.92/ws/trunk>
&& /home/jenkins/tools/java/jdk1.6.0_27-32/jre/bin/java -enableassertions -Xmx1400m
-jar <https://builds.apache.org/job/HBase-0.92/ws/trunk/target/surefire/surefirebooter3539391236486717219.jar>
<https://builds.apache.org/job/HBase-0.92/ws/trunk/target/surefire/surefire3722989727146368405tmp>
<https://builds.apache.org/job/HBase-0.92/ws/trunk/target/surefire/surefire7692094455076799693tmp>
Running org.apache.hadoop.hbase.rest.TestMultiRowResource
Tests run: 3, Failures: 0, Errors: 0, Skipped: 0, Time elapsed: 25.085 sec
Forking command line: /bin/sh -c cd <https://builds.apache.org/job/HBase-0.92/ws/trunk>
&& /home/jenkins/tools/java/jdk1.6.0_27-32/jre/bin/java -enableassertions -Xmx1400m
-jar <https://builds.apache.org/job/HBase-0.92/ws/trunk/target/surefire/surefirebooter4443365848976167534.jar>
<https://builds.apache.org/job/HBase-0.92/ws/trunk/target/surefire/surefire3213954958356687452tmp>
<https://builds.apache.org/job/HBase-0.92/ws/trunk/target/surefire/surefire6770580968521828998tmp>
Running org.apache.hadoop.hbase.rest.TestScannersWithFilters
Tests run: 10, Failures: 0, Errors: 0, Skipped: 0, Time elapsed: 24.421 sec
Forking command line: /bin/sh -c cd <https://builds.apache.org/job/HBase-0.92/ws/trunk>
&& /home/jenkins/tools/java/jdk1.6.0_27-32/jre/bin/java -enableassertions -Xmx1400m
-jar <https://builds.apache.org/job/HBase-0.92/ws/trunk/target/surefire/surefirebooter173822639289835595.jar>
<https://builds.apache.org/job/HBase-0.92/ws/trunk/target/surefire/surefire9175961163097052899tmp>
<https://builds.apache.org/job/HBase-0.92/ws/trunk/target/surefire/surefire715730171461160597tmp>
Running org.apache.hadoop.hbase.rest.TestRowResource
Tests run: 11, Failures: 0, Errors: 0, Skipped: 0, Time elapsed: 22.604 sec
Forking command line: /bin/sh -c cd <https://builds.apache.org/job/HBase-0.92/ws/trunk>
&& /home/jenkins/tools/java/jdk1.6.0_27-32/jre/bin/java -enableassertions -Xmx1400m
-jar <https://builds.apache.org/job/HBase-0.92/ws/trunk/target/surefire/surefirebooter3647167910968969682.jar>
<https://builds.apache.org/job/HBase-0.92/ws/trunk/target/surefire/surefire3802837271842626226tmp>
<https://builds.apache.org/job/HBase-0.92/ws/trunk/target/surefire/surefire3117102211983424498tmp>
Running org.apache.hadoop.hbase.rest.model.TestCellModel
Tests run: 3, Failures: 0, Errors: 0, Skipped: 0, Time elapsed: 0.388 sec
Forking command line: /bin/sh -c cd <https://builds.apache.org/job/HBase-0.92/ws/trunk>
&& /home/jenkins/tools/java/jdk1.6.0_27-32/jre/bin/java -enableassertions -Xmx1400m
-jar <https://builds.apache.org/job/HBase-0.92/ws/trunk/target/surefire/surefirebooter6013642005703561637.jar>
<https://builds.apache.org/job/HBase-0.92/ws/trunk/target/surefire/surefire1436736544379936895tmp>
<https://builds.apache.org/job/HBase-0.92/ws/trunk/target/surefire/surefire4422297080310719275tmp>
Running org.apache.hadoop.hbase.rest.model.TestCellSetModel
Tests run: 3, Failures: 0, Errors: 0, Skipped: 0, Time elapsed: 0.427 sec
Forking command line: /bin/sh -c cd <https://builds.apache.org/job/HBase-0.92/ws/trunk>
&& /home/jenkins/tools/java/jdk1.6.0_27-32/jre/bin/java -enableassertions -Xmx1400m
-jar <https://builds.apache.org/job/HBase-0.92/ws/trunk/target/surefire/surefirebooter8856963179702668352.jar>
<https://builds.apache.org/job/HBase-0.92/ws/trunk/target/surefire/surefire66640894056725866tmp>
<https://builds.apache.org/job/HBase-0.92/ws/trunk/target/surefire/surefire2327619013550084974tmp>
Running org.apache.hadoop.hbase.rest.model.TestTableListModel
Tests run: 3, Failures: 0, Errors: 0, Skipped: 0, Time elapsed: 0.396 sec
Forking command line: /bin/sh -c cd <https://builds.apache.org/job/HBase-0.92/ws/trunk>
&& /home/jenkins/tools/java/jdk1.6.0_27-32/jre/bin/java -enableassertions -Xmx1400m
-jar <https://builds.apache.org/job/HBase-0.92/ws/trunk/target/surefire/surefirebooter4351533243531701073.jar>
<https://builds.apache.org/job/HBase-0.92/ws/trunk/target/surefire/surefire7912791043064158568tmp>
<https://builds.apache.org/job/HBase-0.92/ws/trunk/target/surefire/surefire7154515160220424259tmp>
Running org.apache.hadoop.hbase.rest.model.TestVersionModel
Tests run: 3, Failures: 0, Errors: 0, Skipped: 0, Time elapsed: 0.37 sec
Forking command line: /bin/sh -c cd <https://builds.apache.org/job/HBase-0.92/ws/trunk>
&& /home/jenkins/tools/java/jdk1.6.0_27-32/jre/bin/java -enableassertions -Xmx1400m
-jar <https://builds.apache.org/job/HBase-0.92/ws/trunk/target/surefire/surefirebooter2882366926088122929.jar>
<https://builds.apache.org/job/HBase-0.92/ws/trunk/target/surefire/surefire954663701996828595tmp>
<https://builds.apache.org/job/HBase-0.92/ws/trunk/target/surefire/surefire1614926065098726613tmp>
Running org.apache.hadoop.hbase.rest.model.TestColumnSchemaModel
Tests run: 2, Failures: 0, Errors: 0, Skipped: 0, Time elapsed: 0.302 sec
Forking command line: /bin/sh -c cd <https://builds.apache.org/job/HBase-0.92/ws/trunk>
&& /home/jenkins/tools/java/jdk1.6.0_27-32/jre/bin/java -enableassertions -Xmx1400m
-jar <https://builds.apache.org/job/HBase-0.92/ws/trunk/target/surefire/surefirebooter2578058369589403298.jar>
<https://builds.apache.org/job/HBase-0.92/ws/trunk/target/surefire/surefire760304578524857071tmp>
<https://builds.apache.org/job/HBase-0.92/ws/trunk/target/surefire/surefire5719473565113896788tmp>
Running org.apache.hadoop.hbase.rest.model.TestTableInfoModel
Tests run: 3, Failures: 0, Errors: 0, Skipped: 0, Time elapsed: 0.417 sec
Forking command line: /bin/sh -c cd <https://builds.apache.org/job/HBase-0.92/ws/trunk>
&& /home/jenkins/tools/java/jdk1.6.0_27-32/jre/bin/java -enableassertions -Xmx1400m
-jar <https://builds.apache.org/job/HBase-0.92/ws/trunk/target/surefire/surefirebooter2361676680430967557.jar>
<https://builds.apache.org/job/HBase-0.92/ws/trunk/target/surefire/surefire4519327463135001259tmp>
<https://builds.apache.org/job/HBase-0.92/ws/trunk/target/surefire/surefire5076892952233243515tmp>
Running org.apache.hadoop.hbase.rest.model.TestRowModel
Tests run: 2, Failures: 0, Errors: 0, Skipped: 0, Time elapsed: 0.392 sec
Forking command line: /bin/sh -c cd <https://builds.apache.org/job/HBase-0.92/ws/trunk>
&& /home/jenkins/tools/java/jdk1.6.0_27-32/jre/bin/java -enableassertions -Xmx1400m
-jar <https://builds.apache.org/job/HBase-0.92/ws/trunk/target/surefire/surefirebooter4630890887347331385.jar>
<https://builds.apache.org/job/HBase-0.92/ws/trunk/target/surefire/surefire2150548033095419374tmp>
<https://builds.apache.org/job/HBase-0.92/ws/trunk/target/surefire/surefire620837453559250650tmp>
Running org.apache.hadoop.hbase.rest.model.TestTableSchemaModel
Tests run: 3, Failures: 0, Errors: 0, Skipped: 0, Time elapsed: 0.432 sec
Forking command line: /bin/sh -c cd <https://builds.apache.org/job/HBase-0.92/ws/trunk>
&& /home/jenkins/tools/java/jdk1.6.0_27-32/jre/bin/java -enableassertions -Xmx1400m
-jar <https://builds.apache.org/job/HBase-0.92/ws/trunk/target/surefire/surefirebooter7177482636365797526.jar>
<https://builds.apache.org/job/HBase-0.92/ws/trunk/target/surefire/surefire4598391079980604251tmp>
<https://builds.apache.org/job/HBase-0.92/ws/trunk/target/surefire/surefire3022192434317563420tmp>
Running org.apache.hadoop.hbase.rest.model.TestStorageClusterVersionModel
Tests run: 2, Failures: 0, Errors: 0, Skipped: 0, Time elapsed: 0.273 sec
Forking command line: /bin/sh -c cd <https://builds.apache.org/job/HBase-0.92/ws/trunk>
&& /home/jenkins/tools/java/jdk1.6.0_27-32/jre/bin/java -enableassertions -Xmx1400m
-jar <https://builds.apache.org/job/HBase-0.92/ws/trunk/target/surefire/surefirebooter6882304808505484391.jar>
<https://builds.apache.org/job/HBase-0.92/ws/trunk/target/surefire/surefire4999578122848647801tmp>
<https://builds.apache.org/job/HBase-0.92/ws/trunk/target/surefire/surefire4370259090405295223tmp>
Running org.apache.hadoop.hbase.rest.model.TestTableRegionModel
Tests run: 4, Failures: 0, Errors: 0, Skipped: 0, Time elapsed: 0.473 sec
Forking command line: /bin/sh -c cd <https://builds.apache.org/job/HBase-0.92/ws/trunk>
&& /home/jenkins/tools/java/jdk1.6.0_27-32/jre/bin/java -enableassertions -Xmx1400m
-jar <https://builds.apache.org/job/HBase-0.92/ws/trunk/target/surefire/surefirebooter5227727516826014285.jar>
<https://builds.apache.org/job/HBase-0.92/ws/trunk/target/surefire/surefire4813367433558590977tmp>
<https://builds.apache.org/job/HBase-0.92/ws/trunk/target/surefire/surefire3802775854669194030tmp>
Running org.apache.hadoop.hbase.rest.model.TestStorageClusterStatusModel
Tests run: 3, Failures: 0, Errors: 0, Skipped: 0, Time elapsed: 0.45 sec
Forking command line: /bin/sh -c cd <https://builds.apache.org/job/HBase-0.92/ws/trunk>
&& /home/jenkins/tools/java/jdk1.6.0_27-32/jre/bin/java -enableassertions -Xmx1400m
-jar <https://builds.apache.org/job/HBase-0.92/ws/trunk/target/surefire/surefirebooter4736748861923935530.jar>
<https://builds.apache.org/job/HBase-0.92/ws/trunk/target/surefire/surefire7807177548738681050tmp>
<https://builds.apache.org/job/HBase-0.92/ws/trunk/target/surefire/surefire3962186673443668193tmp>
Running org.apache.hadoop.hbase.rest.model.TestScannerModel
Tests run: 3, Failures: 0, Errors: 0, Skipped: 0, Time elapsed: 0.412 sec
Forking command line: /bin/sh -c cd <https://builds.apache.org/job/HBase-0.92/ws/trunk>
&& /home/jenkins/tools/java/jdk1.6.0_27-32/jre/bin/java -enableassertions -Xmx1400m
-jar <https://builds.apache.org/job/HBase-0.92/ws/trunk/target/surefire/surefirebooter7946143437056876.jar>
<https://builds.apache.org/job/HBase-0.92/ws/trunk/target/surefire/surefire2518246075548106245tmp>
<https://builds.apache.org/job/HBase-0.92/ws/trunk/target/surefire/surefire5836775839457242043tmp>
Running org.apache.hadoop.hbase.rest.client.TestRemoteAdmin
Tests run: 2, Failures: 0, Errors: 0, Skipped: 0, Time elapsed: 27.277 sec
Forking command line: /bin/sh -c cd <https://builds.apache.org/job/HBase-0.92/ws/trunk>
&& /home/jenkins/tools/java/jdk1.6.0_27-32/jre/bin/java -enableassertions -Xmx1400m
-jar <https://builds.apache.org/job/HBase-0.92/ws/trunk/target/surefire/surefirebooter818815853925830727.jar>
<https://builds.apache.org/job/HBase-0.92/ws/trunk/target/surefire/surefire3934379684175280472tmp>
<https://builds.apache.org/job/HBase-0.92/ws/trunk/target/surefire/surefire5329123510400923970tmp>
Running org.apache.hadoop.hbase.rest.client.TestRemoteTable
Tests run: 3, Failures: 0, Errors: 0, Skipped: 0, Time elapsed: 22.809 sec
Forking command line: /bin/sh -c cd <https://builds.apache.org/job/HBase-0.92/ws/trunk>
&& /home/jenkins/tools/java/jdk1.6.0_27-32/jre/bin/java -enableassertions -Xmx1400m
-jar <https://builds.apache.org/job/HBase-0.92/ws/trunk/target/surefire/surefirebooter1389941206430443747.jar>
<https://builds.apache.org/job/HBase-0.92/ws/trunk/target/surefire/surefire6607619378307258659tmp>
<https://builds.apache.org/job/HBase-0.92/ws/trunk/target/surefire/surefire8533457216142202967tmp>
Running org.apache.hadoop.hbase.rest.TestVersionResource
Tests run: 7, Failures: 0, Errors: 0, Skipped: 0, Time elapsed: 20.377 sec
Forking command line: /bin/sh -c cd <https://builds.apache.org/job/HBase-0.92/ws/trunk>
&& /home/jenkins/tools/java/jdk1.6.0_27-32/jre/bin/java -enableassertions -Xmx1400m
-jar <https://builds.apache.org/job/HBase-0.92/ws/trunk/target/surefire/surefirebooter5277838382437651100.jar>
<https://builds.apache.org/job/HBase-0.92/ws/trunk/target/surefire/surefire2567458551715385223tmp>
<https://builds.apache.org/job/HBase-0.92/ws/trunk/target/surefire/surefire1220799320214230221tmp>
Running org.apache.hadoop.hbase.rest.TestScannerResource
Tests run: 5, Failures: 0, Errors: 0, Skipped: 0, Time elapsed: 47.805 sec
Forking command line: /bin/sh -c cd <https://builds.apache.org/job/HBase-0.92/ws/trunk>
&& /home/jenkins/tools/java/jdk1.6.0_27-32/jre/bin/java -enableassertions -Xmx1400m
-jar <https://builds.apache.org/job/HBase-0.92/ws/trunk/target/surefire/surefirebooter7646834550472931912.jar>
<https://builds.apache.org/job/HBase-0.92/ws/trunk/target/surefire/surefire6384887085493114580tmp>
<https://builds.apache.org/job/HBase-0.92/ws/trunk/target/surefire/surefire5315469957214239916tmp>
Running org.apache.hadoop.hbase.rest.TestTransform
Tests run: 1, Failures: 0, Errors: 0, Skipped: 0, Time elapsed: 25.632 sec
Forking command line: /bin/sh -c cd <https://builds.apache.org/job/HBase-0.92/ws/trunk>
&& /home/jenkins/tools/java/jdk1.6.0_27-32/jre/bin/java -enableassertions -Xmx1400m
-jar <https://builds.apache.org/job/HBase-0.92/ws/trunk/target/surefire/surefirebooter3920087855661457345.jar>
<https://builds.apache.org/job/HBase-0.92/ws/trunk/target/surefire/surefire6088533907499156881tmp>
<https://builds.apache.org/job/HBase-0.92/ws/trunk/target/surefire/surefire1818160037255875560tmp>
Running org.apache.hadoop.hbase.rest.TestTableResource
Tests run: 8, Failures: 0, Errors: 0, Skipped: 0, Time elapsed: 54.003 sec
Forking command line: /bin/sh -c cd <https://builds.apache.org/job/HBase-0.92/ws/trunk>
&& /home/jenkins/tools/java/jdk1.6.0_27-32/jre/bin/java -enableassertions -Xmx1400m
-jar <https://builds.apache.org/job/HBase-0.92/ws/trunk/target/surefire/surefirebooter5839175638832783445.jar>
<https://builds.apache.org/job/HBase-0.92/ws/trunk/target/surefire/surefire2460521363122412440tmp>
<https://builds.apache.org/job/HBase-0.92/ws/trunk/target/surefire/surefire7627706618260557637tmp>
Running org.apache.hadoop.hbase.rest.TestStatusResource
Tests run: 2, Failures: 0, Errors: 0, Skipped: 0, Time elapsed: 21.709 sec
Forking command line: /bin/sh -c cd <https://builds.apache.org/job/HBase-0.92/ws/trunk>
&& /home/jenkins/tools/java/jdk1.6.0_27-32/jre/bin/java -enableassertions -Xmx1400m
-jar <https://builds.apache.org/job/HBase-0.92/ws/trunk/target/surefire/surefirebooter5207600174464074493.jar>
<https://builds.apache.org/job/HBase-0.92/ws/trunk/target/surefire/surefire6938306770485770927tmp>
<https://builds.apache.org/job/HBase-0.92/ws/trunk/target/surefire/surefire860744869830349258tmp>
Running org.apache.hadoop.hbase.rest.TestSchemaResource
Tests run: 2, Failures: 0, Errors: 0, Skipped: 0, Time elapsed: 28.42 sec
Forking command line: /bin/sh -c cd <https://builds.apache.org/job/HBase-0.92/ws/trunk>
&& /home/jenkins/tools/java/jdk1.6.0_27-32/jre/bin/java -enableassertions -Xmx1400m
-jar <https://builds.apache.org/job/HBase-0.92/ws/trunk/target/surefire/surefirebooter2495344148284110356.jar>
<https://builds.apache.org/job/HBase-0.92/ws/trunk/target/surefire/surefire3430881921068464506tmp>
<https://builds.apache.org/job/HBase-0.92/ws/trunk/target/surefire/surefire5557786865417082138tmp>
Running org.apache.hadoop.hbase.thrift.TestThriftServer
Tests run: 1, Failures: 0, Errors: 0, Skipped: 0, Time elapsed: 27.64 sec
Forking command line: /bin/sh -c cd <https://builds.apache.org/job/HBase-0.92/ws/trunk>
&& /home/jenkins/tools/java/jdk1.6.0_27-32/jre/bin/java -enableassertions -Xmx1400m
-jar <https://builds.apache.org/job/HBase-0.92/ws/trunk/target/surefire/surefirebooter7665803788251241436.jar>
<https://builds.apache.org/job/HBase-0.92/ws/trunk/target/surefire/surefire7823825259316421158tmp>
<https://builds.apache.org/job/HBase-0.92/ws/trunk/target/surefire/surefire2310639185041279212tmp>
Running org.apache.hadoop.hbase.io.TestHeapSize
Tests run: 2, Failures: 0, Errors: 0, Skipped: 0, Time elapsed: 0.156 sec
Forking command line: /bin/sh -c cd <https://builds.apache.org/job/HBase-0.92/ws/trunk>
&& /home/jenkins/tools/java/jdk1.6.0_27-32/jre/bin/java -enableassertions -Xmx1400m
-jar <https://builds.apache.org/job/HBase-0.92/ws/trunk/target/surefire/surefirebooter3885136153948177250.jar>
<https://builds.apache.org/job/HBase-0.92/ws/trunk/target/surefire/surefire7254348861177055773tmp>
<https://builds.apache.org/job/HBase-0.92/ws/trunk/target/surefire/surefire3596456441643030520tmp>
Running org.apache.hadoop.hbase.io.hfile.TestHFileSeek
Tests run: 1, Failures: 0, Errors: 0, Skipped: 0, Time elapsed: 5.887 sec
Forking command line: /bin/sh -c cd <https://builds.apache.org/job/HBase-0.92/ws/trunk>
&& /home/jenkins/tools/java/jdk1.6.0_27-32/jre/bin/java -enableassertions -Xmx1400m
-jar <https://builds.apache.org/job/HBase-0.92/ws/trunk/target/surefire/surefirebooter392483615188622800.jar>
<https://builds.apache.org/job/HBase-0.92/ws/trunk/target/surefire/surefire3620259100864263326tmp>
<https://builds.apache.org/job/HBase-0.92/ws/trunk/target/surefire/surefire9120755586497508135tmp>
Running org.apache.hadoop.hbase.io.hfile.slab.TestSlab
Tests run: 1, Failures: 0, Errors: 0, Skipped: 0, Time elapsed: 0.164 sec
Forking command line: /bin/sh -c cd <https://builds.apache.org/job/HBase-0.92/ws/trunk>
&& /home/jenkins/tools/java/jdk1.6.0_27-32/jre/bin/java -enableassertions -Xmx1400m
-jar <https://builds.apache.org/job/HBase-0.92/ws/trunk/target/surefire/surefirebooter5959943824456234068.jar>
<https://builds.apache.org/job/HBase-0.92/ws/trunk/target/surefire/surefire270402111814497957tmp>
<https://builds.apache.org/job/HBase-0.92/ws/trunk/target/surefire/surefire7220034795854848051tmp>
Running org.apache.hadoop.hbase.io.hfile.slab.TestSlabCache
Tests run: 7, Failures: 0, Errors: 0, Skipped: 0, Time elapsed: 20.182 sec
Forking command line: /bin/sh -c cd <https://builds.apache.org/job/HBase-0.92/ws/trunk>
&& /home/jenkins/tools/java/jdk1.6.0_27-32/jre/bin/java -enableassertions -Xmx1400m
-jar <https://builds.apache.org/job/HBase-0.92/ws/trunk/target/surefire/surefirebooter3547663618234345449.jar>
<https://builds.apache.org/job/HBase-0.92/ws/trunk/target/surefire/surefire6447750948718999837tmp>
<https://builds.apache.org/job/HBase-0.92/ws/trunk/target/surefire/surefire7373525299759793776tmp>
Running org.apache.hadoop.hbase.io.hfile.slab.TestSingleSizeCache
Tests run: 5, Failures: 0, Errors: 0, Skipped: 0, Time elapsed: 26.179 sec
Forking command line: /bin/sh -c cd <https://builds.apache.org/job/HBase-0.92/ws/trunk>
&& /home/jenkins/tools/java/jdk1.6.0_27-32/jre/bin/java -enableassertions -Xmx1400m
-jar <https://builds.apache.org/job/HBase-0.92/ws/trunk/target/surefire/surefirebooter8151042566772622637.jar>
<https://builds.apache.org/job/HBase-0.92/ws/trunk/target/surefire/surefire5718634379614051564tmp>
<https://builds.apache.org/job/HBase-0.92/ws/trunk/target/surefire/surefire5176061255667565618tmp>
Running org.apache.hadoop.hbase.io.hfile.TestCachedBlockQueue
Tests run: 2, Failures: 0, Errors: 0, Skipped: 0, Time elapsed: 0.107 sec
Forking command line: /bin/sh -c cd <https://builds.apache.org/job/HBase-0.92/ws/trunk>
&& /home/jenkins/tools/java/jdk1.6.0_27-32/jre/bin/java -enableassertions -Xmx1400m
-jar <https://builds.apache.org/job/HBase-0.92/ws/trunk/target/surefire/surefirebooter7203640956688879430.jar>
<https://builds.apache.org/job/HBase-0.92/ws/trunk/target/surefire/surefire5556896856944876240tmp>
<https://builds.apache.org/job/HBase-0.92/ws/trunk/target/surefire/surefire7456670306774517269tmp>
Running org.apache.hadoop.hbase.io.hfile.TestHFileBlockIndex
Tests run: 10, Failures: 0, Errors: 0, Skipped: 0, Time elapsed: 10.064 sec
Forking command line: /bin/sh -c cd <https://builds.apache.org/job/HBase-0.92/ws/trunk>
&& /home/jenkins/tools/java/jdk1.6.0_27-32/jre/bin/java -enableassertions -Xmx1400m
-jar <https://builds.apache.org/job/HBase-0.92/ws/trunk/target/surefire/surefirebooter4348390386739971462.jar>
<https://builds.apache.org/job/HBase-0.92/ws/trunk/target/surefire/surefire3555614572408897696tmp>
<https://builds.apache.org/job/HBase-0.92/ws/trunk/target/surefire/surefire4624465460475608408tmp>
Running org.apache.hadoop.hbase.io.hfile.TestLruBlockCache
Tests run: 7, Failures: 0, Errors: 0, Skipped: 0, Time elapsed: 1.149 sec
Forking command line: /bin/sh -c cd <https://builds.apache.org/job/HBase-0.92/ws/trunk>
&& /home/jenkins/tools/java/jdk1.6.0_27-32/jre/bin/java -enableassertions -Xmx1400m
-jar <https://builds.apache.org/job/HBase-0.92/ws/trunk/target/surefire/surefirebooter468851453970411108.jar>
<https://builds.apache.org/job/HBase-0.92/ws/trunk/target/surefire/surefire2229348184113925198tmp>
<https://builds.apache.org/job/HBase-0.92/ws/trunk/target/surefire/surefire683146681786710019tmp>
Running org.apache.hadoop.hbase.io.hfile.TestHFilePerformance
Tests run: 1, Failures: 0, Errors: 0, Skipped: 0, Time elapsed: 5.887 sec
Forking command line: /bin/sh -c cd <https://builds.apache.org/job/HBase-0.92/ws/trunk>
&& /home/jenkins/tools/java/jdk1.6.0_27-32/jre/bin/java -enableassertions -Xmx1400m
-jar <https://builds.apache.org/job/HBase-0.92/ws/trunk/target/surefire/surefirebooter5080244445856936615.jar>
<https://builds.apache.org/job/HBase-0.92/ws/trunk/target/surefire/surefire978334380936724842tmp>
<https://builds.apache.org/job/HBase-0.92/ws/trunk/target/surefire/surefire530771158005289053tmp>
Running org.apache.hadoop.hbase.io.hfile.TestFixedFileTrailer
Tests run: 2, Failures: 0, Errors: 0, Skipped: 0, Time elapsed: 0.555 sec
Forking command line: /bin/sh -c cd <https://builds.apache.org/job/HBase-0.92/ws/trunk>
&& /home/jenkins/tools/java/jdk1.6.0_27-32/jre/bin/java -enableassertions -Xmx1400m
-jar <https://builds.apache.org/job/HBase-0.92/ws/trunk/target/surefire/surefirebooter4119669893527811718.jar>
<https://builds.apache.org/job/HBase-0.92/ws/trunk/target/surefire/surefire4176111131951019669tmp>
<https://builds.apache.org/job/HBase-0.92/ws/trunk/target/surefire/surefire393468391216349656tmp>
Running org.apache.hadoop.hbase.io.hfile.TestHFileWriterV2
Tests run: 1, Failures: 0, Errors: 0, Skipped: 0, Time elapsed: 0.983 sec
Forking command line: /bin/sh -c cd <https://builds.apache.org/job/HBase-0.92/ws/trunk>
&& /home/jenkins/tools/java/jdk1.6.0_27-32/jre/bin/java -enableassertions -Xmx1400m
-jar <https://builds.apache.org/job/HBase-0.92/ws/trunk/target/surefire/surefirebooter5354906806896228977.jar>
<https://builds.apache.org/job/HBase-0.92/ws/trunk/target/surefire/surefire4871362544008152394tmp>
<https://builds.apache.org/job/HBase-0.92/ws/trunk/target/surefire/surefire1302928817292770413tmp>
Running org.apache.hadoop.hbase.io.hfile.TestBlockCacheColumnFamilySummary
Tests run: 4, Failures: 0, Errors: 0, Skipped: 0, Time elapsed: 0.058 sec
Forking command line: /bin/sh -c cd <https://builds.apache.org/job/HBase-0.92/ws/trunk>
&& /home/jenkins/tools/java/jdk1.6.0_27-32/jre/bin/java -enableassertions -Xmx1400m
-jar <https://builds.apache.org/job/HBase-0.92/ws/trunk/target/surefire/surefirebooter8785507931250207090.jar>
<https://builds.apache.org/job/HBase-0.92/ws/trunk/target/surefire/surefire6890795747441834558tmp>
<https://builds.apache.org/job/HBase-0.92/ws/trunk/target/surefire/surefire617596248422649969tmp>
Running org.apache.hadoop.hbase.io.hfile.TestHFileReaderV1
Tests run: 1, Failures: 0, Errors: 0, Skipped: 0, Time elapsed: 0.641 sec
Forking command line: /bin/sh -c cd <https://builds.apache.org/job/HBase-0.92/ws/trunk>
&& /home/jenkins/tools/java/jdk1.6.0_27-32/jre/bin/java -enableassertions -Xmx1400m
-jar <https://builds.apache.org/job/HBase-0.92/ws/trunk/target/surefire/surefirebooter2200703793298774065.jar>
<https://builds.apache.org/job/HBase-0.92/ws/trunk/target/surefire/surefire6592298430200211218tmp>
<https://builds.apache.org/job/HBase-0.92/ws/trunk/target/surefire/surefire415031456811525417tmp>
Running org.apache.hadoop.hbase.io.hfile.TestHFile
Tests run: 6, Failures: 0, Errors: 0, Skipped: 0, Time elapsed: 0.852 sec
Forking command line: /bin/sh -c cd <https://builds.apache.org/job/HBase-0.92/ws/trunk>
&& /home/jenkins/tools/java/jdk1.6.0_27-32/jre/bin/java -enableassertions -Xmx1400m
-jar <https://builds.apache.org/job/HBase-0.92/ws/trunk/target/surefire/surefirebooter4371623832658837499.jar>
<https://builds.apache.org/job/HBase-0.92/ws/trunk/target/surefire/surefire4172349526710130925tmp>
<https://builds.apache.org/job/HBase-0.92/ws/trunk/target/surefire/surefire4765930391459388753tmp>
Running org.apache.hadoop.hbase.io.hfile.TestReseekTo
Tests run: 1, Failures: 0, Errors: 0, Skipped: 0, Time elapsed: 0.658 sec
Forking command line: /bin/sh -c cd <https://builds.apache.org/job/HBase-0.92/ws/trunk>
&& /home/jenkins/tools/java/jdk1.6.0_27-32/jre/bin/java -enableassertions -Xmx1400m
-jar <https://builds.apache.org/job/HBase-0.92/ws/trunk/target/surefire/surefirebooter6408202152523467490.jar>
<https://builds.apache.org/job/HBase-0.92/ws/trunk/target/surefire/surefire8743004209996199215tmp>
<https://builds.apache.org/job/HBase-0.92/ws/trunk/target/surefire/surefire2270254852199964832tmp>
Running org.apache.hadoop.hbase.io.hfile.TestHFileBlock
Tests run: 7, Failures: 0, Errors: 0, Skipped: 0, Time elapsed: 29.53 sec
Forking command line: /bin/sh -c cd <https://builds.apache.org/job/HBase-0.92/ws/trunk>
&& /home/jenkins/tools/java/jdk1.6.0_27-32/jre/bin/java -enableassertions -Xmx1400m
-jar <https://builds.apache.org/job/HBase-0.92/ws/trunk/target/surefire/surefirebooter4234469352309798771.jar>
<https://builds.apache.org/job/HBase-0.92/ws/trunk/target/surefire/surefire8200597795337615215tmp>
<https://builds.apache.org/job/HBase-0.92/ws/trunk/target/surefire/surefire8095368284643786657tmp>
Running org.apache.hadoop.hbase.io.hfile.TestSeekTo
Tests run: 3, Failures: 0, Errors: 0, Skipped: 0, Time elapsed: 0.674 sec
Forking command line: /bin/sh -c cd <https://builds.apache.org/job/HBase-0.92/ws/trunk>
&& /home/jenkins/tools/java/jdk1.6.0_27-32/jre/bin/java -enableassertions -Xmx1400m
-jar <https://builds.apache.org/job/HBase-0.92/ws/trunk/target/surefire/surefirebooter1757015989244668529.jar>
<https://builds.apache.org/job/HBase-0.92/ws/trunk/target/surefire/surefire4625638588040142499tmp>
<https://builds.apache.org/job/HBase-0.92/ws/trunk/target/surefire/surefire40852471509269947tmp>
Running org.apache.hadoop.hbase.io.hfile.TestCacheOnWrite
Tests run: 6, Failures: 0, Errors: 0, Skipped: 0, Time elapsed: 8.208 sec
Forking command line: /bin/sh -c cd <https://builds.apache.org/job/HBase-0.92/ws/trunk>
&& /home/jenkins/tools/java/jdk1.6.0_27-32/jre/bin/java -enableassertions -Xmx1400m
-jar <https://builds.apache.org/job/HBase-0.92/ws/trunk/target/surefire/surefirebooter5492951084437487218.jar>
<https://builds.apache.org/job/HBase-0.92/ws/trunk/target/surefire/surefire1755492611930009920tmp>
<https://builds.apache.org/job/HBase-0.92/ws/trunk/target/surefire/surefire5981733660898531286tmp>
Running org.apache.hadoop.hbase.io.TestHbaseObjectWritable
Tests run: 4, Failures: 0, Errors: 0, Skipped: 0, Time elapsed: 0.487 sec
Forking command line: /bin/sh -c cd <https://builds.apache.org/job/HBase-0.92/ws/trunk>
&& /home/jenkins/tools/java/jdk1.6.0_27-32/jre/bin/java -enableassertions -Xmx1400m
-jar <https://builds.apache.org/job/HBase-0.92/ws/trunk/target/surefire/surefirebooter724350976523446486.jar>
<https://builds.apache.org/job/HBase-0.92/ws/trunk/target/surefire/surefire2675876298607259966tmp>
<https://builds.apache.org/job/HBase-0.92/ws/trunk/target/surefire/surefire7118336422880147537tmp>
Running org.apache.hadoop.hbase.io.TestImmutableBytesWritable
Tests run: 3, Failures: 0, Errors: 0, Skipped: 0, Time elapsed: 0.113 sec
Forking command line: /bin/sh -c cd <https://builds.apache.org/job/HBase-0.92/ws/trunk>
&& /home/jenkins/tools/java/jdk1.6.0_27-32/jre/bin/java -enableassertions -Xmx1400m
-jar <https://builds.apache.org/job/HBase-0.92/ws/trunk/target/surefire/surefirebooter974397904625553315.jar>
<https://builds.apache.org/job/HBase-0.92/ws/trunk/target/surefire/surefire3935868597711395511tmp>
<https://builds.apache.org/job/HBase-0.92/ws/trunk/target/surefire/surefire6407104017111130748tmp>
Running org.apache.hadoop.hbase.io.TestHalfStoreFileReader
Tests run: 1, Failures: 0, Errors: 0, Skipped: 0, Time elapsed: 0.702 sec
Forking command line: /bin/sh -c cd <https://builds.apache.org/job/HBase-0.92/ws/trunk>
&& /home/jenkins/tools/java/jdk1.6.0_27-32/jre/bin/java -enableassertions -Xmx1400m
-jar <https://builds.apache.org/job/HBase-0.92/ws/trunk/target/surefire/surefirebooter6925592939496106162.jar>
<https://builds.apache.org/job/HBase-0.92/ws/trunk/target/surefire/surefire6566384459453443894tmp>
<https://builds.apache.org/job/HBase-0.92/ws/trunk/target/surefire/surefire6932662783133729057tmp>
Running org.apache.hadoop.hbase.TestFSTableDescriptorForceCreation
Tests run: 3, Failures: 0, Errors: 0, Skipped: 0, Time elapsed: 9.43 sec
Forking command line: /bin/sh -c cd <https://builds.apache.org/job/HBase-0.92/ws/trunk>
&& /home/jenkins/tools/java/jdk1.6.0_27-32/jre/bin/java -enableassertions -Xmx1400m
-jar <https://builds.apache.org/job/HBase-0.92/ws/trunk/target/surefire/surefirebooter5173784868415014676.jar>
<https://builds.apache.org/job/HBase-0.92/ws/trunk/target/surefire/surefire7186157885985385018tmp>
<https://builds.apache.org/job/HBase-0.92/ws/trunk/target/surefire/surefire2602691426754790780tmp>
Running org.apache.hadoop.hbase.avro.TestAvroUtil
Tests run: 1, Failures: 0, Errors: 0, Skipped: 0, Time elapsed: 0.698 sec
Forking command line: /bin/sh -c cd <https://builds.apache.org/job/HBase-0.92/ws/trunk>
&& /home/jenkins/tools/java/jdk1.6.0_27-32/jre/bin/java -enableassertions -Xmx1400m
-jar <https://builds.apache.org/job/HBase-0.92/ws/trunk/target/surefire/surefirebooter5891390918362114284.jar>
<https://builds.apache.org/job/HBase-0.92/ws/trunk/target/surefire/surefire2731719941970715381tmp>
<https://builds.apache.org/job/HBase-0.92/ws/trunk/target/surefire/surefire8563289367333807650tmp>
Running org.apache.hadoop.hbase.avro.TestAvroServer
Tests run: 3, Failures: 0, Errors: 0, Skipped: 0, Time elapsed: 34.708 sec
Forking command line: /bin/sh -c cd <https://builds.apache.org/job/HBase-0.92/ws/trunk>
&& /home/jenkins/tools/java/jdk1.6.0_27-32/jre/bin/java -enableassertions -Xmx1400m
-jar <https://builds.apache.org/job/HBase-0.92/ws/trunk/target/surefire/surefirebooter648724918346996847.jar>
<https://builds.apache.org/job/HBase-0.92/ws/trunk/target/surefire/surefire5584238982134482246tmp>
<https://builds.apache.org/job/HBase-0.92/ws/trunk/target/surefire/surefire2579286751892875717tmp>
Running org.apache.hadoop.hbase.TestKeyValue
Tests run: 11, Failures: 0, Errors: 0, Skipped: 0, Time elapsed: 0.129 sec
Forking command line: /bin/sh -c cd <https://builds.apache.org/job/HBase-0.92/ws/trunk>
&& /home/jenkins/tools/java/jdk1.6.0_27-32/jre/bin/java -enableassertions -Xmx1400m
-jar <https://builds.apache.org/job/HBase-0.92/ws/trunk/target/surefire/surefirebooter6715939164268571125.jar>
<https://builds.apache.org/job/HBase-0.92/ws/trunk/target/surefire/surefire6534120889482269228tmp>
<https://builds.apache.org/job/HBase-0.92/ws/trunk/target/surefire/surefire5210315152614734694tmp>
Running org.apache.hadoop.hbase.replication.TestMultiSlaveReplication
Tests run: 1, Failures: 0, Errors: 0, Skipped: 0, Time elapsed: 63.356 sec
Forking command line: /bin/sh -c cd <https://builds.apache.org/job/HBase-0.92/ws/trunk>
&& /home/jenkins/tools/java/jdk1.6.0_27-32/jre/bin/java -enableassertions -Xmx1400m
-jar <https://builds.apache.org/job/HBase-0.92/ws/trunk/target/surefire/surefirebooter3525193127190492874.jar>
<https://builds.apache.org/job/HBase-0.92/ws/trunk/target/surefire/surefire2204818850939967119tmp>
<https://builds.apache.org/job/HBase-0.92/ws/trunk/target/surefire/surefire7195133927761826760tmp>
Running org.apache.hadoop.hbase.replication.regionserver.TestReplicationSourceManager
Tests run: 1, Failures: 0, Errors: 0, Skipped: 0, Time elapsed: 0.937 sec
Forking command line: /bin/sh -c cd <https://builds.apache.org/job/HBase-0.92/ws/trunk>
&& /home/jenkins/tools/java/jdk1.6.0_27-32/jre/bin/java -enableassertions -Xmx1400m
-jar <https://builds.apache.org/job/HBase-0.92/ws/trunk/target/surefire/surefirebooter8695073300136436527.jar>
<https://builds.apache.org/job/HBase-0.92/ws/trunk/target/surefire/surefire468688038025879264tmp>
<https://builds.apache.org/job/HBase-0.92/ws/trunk/target/surefire/surefire7524191857064134743tmp>
Running org.apache.hadoop.hbase.replication.regionserver.TestReplicationSink
Tests run: 5, Failures: 0, Errors: 0, Skipped: 0, Time elapsed: 24.222 sec
Forking command line: /bin/sh -c cd <https://builds.apache.org/job/HBase-0.92/ws/trunk>
&& /home/jenkins/tools/java/jdk1.6.0_27-32/jre/bin/java -enableassertions -Xmx1400m
-jar <https://builds.apache.org/job/HBase-0.92/ws/trunk/target/surefire/surefirebooter3309556185983982948.jar>
<https://builds.apache.org/job/HBase-0.92/ws/trunk/target/surefire/surefire6399774228014021738tmp>
<https://builds.apache.org/job/HBase-0.92/ws/trunk/target/surefire/surefire3141379891137559158tmp>
Running org.apache.hadoop.hbase.replication.TestMasterReplication
Tests run: 2, Failures: 0, Errors: 0, Skipped: 0, Time elapsed: 107.682 sec
Forking command line: /bin/sh -c cd <https://builds.apache.org/job/HBase-0.92/ws/trunk>
&& /home/jenkins/tools/java/jdk1.6.0_27-32/jre/bin/java -enableassertions -Xmx1400m
-jar <https://builds.apache.org/job/HBase-0.92/ws/trunk/target/surefire/surefirebooter8042258333166860825.jar>
<https://builds.apache.org/job/HBase-0.92/ws/trunk/target/surefire/surefire126613685725114341tmp>
<https://builds.apache.org/job/HBase-0.92/ws/trunk/target/surefire/surefire24585894516381741tmp>
Running org.apache.hadoop.hbase.replication.TestReplicationSource
Tests run: 1, Failures: 0, Errors: 0, Skipped: 0, Time elapsed: 2.614 sec
Forking command line: /bin/sh -c cd <https://builds.apache.org/job/HBase-0.92/ws/trunk>
&& /home/jenkins/tools/java/jdk1.6.0_27-32/jre/bin/java -enableassertions -Xmx1400m
-jar <https://builds.apache.org/job/HBase-0.92/ws/trunk/target/surefire/surefirebooter1570112336093863606.jar>
<https://builds.apache.org/job/HBase-0.92/ws/trunk/target/surefire/surefire8225942286091686548tmp>
<https://builds.apache.org/job/HBase-0.92/ws/trunk/target/surefire/surefire1719899426662467486tmp>
Running org.apache.hadoop.hbase.replication.TestReplicationPeer
Tests run: 1, Failures: 0, Errors: 0, Skipped: 0, Time elapsed: 25.542 sec
Forking command line: /bin/sh -c cd <https://builds.apache.org/job/HBase-0.92/ws/trunk>
&& /home/jenkins/tools/java/jdk1.6.0_27-32/jre/bin/java -enableassertions -Xmx1400m
-jar <https://builds.apache.org/job/HBase-0.92/ws/trunk/target/surefire/surefirebooter7339309457546310223.jar>
<https://builds.apache.org/job/HBase-0.92/ws/trunk/target/surefire/surefire1871421488698624743tmp>
<https://builds.apache.org/job/HBase-0.92/ws/trunk/target/surefire/surefire8357586943665307657tmp>
Running org.apache.hadoop.hbase.replication.TestReplication
Tests run: 7, Failures: 0, Errors: 0, Skipped: 0, Time elapsed: 157.664 sec
Forking command line: /bin/sh -c cd <https://builds.apache.org/job/HBase-0.92/ws/trunk>
&& /home/jenkins/tools/java/jdk1.6.0_27-32/jre/bin/java -enableassertions -Xmx1400m
-jar <https://builds.apache.org/job/HBase-0.92/ws/trunk/target/surefire/surefirebooter4215114269966507175.jar>
<https://builds.apache.org/job/HBase-0.92/ws/trunk/target/surefire/surefire3532778363726531206tmp>
<https://builds.apache.org/job/HBase-0.92/ws/trunk/target/surefire/surefire6045063087937153696tmp>
Running org.apache.hadoop.hbase.ipc.TestDelayedRpc
Tests run: 4, Failures: 0, Errors: 0, Skipped: 0, Time elapsed: 2.588 sec
Forking command line: /bin/sh -c cd <https://builds.apache.org/job/HBase-0.92/ws/trunk>
&& /home/jenkins/tools/java/jdk1.6.0_27-32/jre/bin/java -enableassertions -Xmx1400m
-jar <https://builds.apache.org/job/HBase-0.92/ws/trunk/target/surefire/surefirebooter2807547824359989877.jar>
<https://builds.apache.org/job/HBase-0.92/ws/trunk/target/surefire/surefire5289469658376154318tmp>
<https://builds.apache.org/job/HBase-0.92/ws/trunk/target/surefire/surefire2028742551014732996tmp>
Running org.apache.hadoop.hbase.TestCompare
Tests run: 1, Failures: 0, Errors: 0, Skipped: 0, Time elapsed: 0.241 sec
Forking command line: /bin/sh -c cd <https://builds.apache.org/job/HBase-0.92/ws/trunk>
&& /home/jenkins/tools/java/jdk1.6.0_27-32/jre/bin/java -enableassertions -Xmx1400m
-jar <https://builds.apache.org/job/HBase-0.92/ws/trunk/target/surefire/surefirebooter7175445852646762465.jar>
<https://builds.apache.org/job/HBase-0.92/ws/trunk/target/surefire/surefire6828837361196445875tmp>
<https://builds.apache.org/job/HBase-0.92/ws/trunk/target/surefire/surefire7474091126816556173tmp>
Running org.apache.hadoop.hbase.TestZooKeeper
Tests run: 7, Failures: 0, Errors: 0, Skipped: 0, Time elapsed: 87.572 sec
Forking command line: /bin/sh -c cd <https://builds.apache.org/job/HBase-0.92/ws/trunk>
&& /home/jenkins/tools/java/jdk1.6.0_27-32/jre/bin/java -enableassertions -Xmx1400m
-jar <https://builds.apache.org/job/HBase-0.92/ws/trunk/target/surefire/surefirebooter6018523825192454128.jar>
<https://builds.apache.org/job/HBase-0.92/ws/trunk/target/surefire/surefire1143684836202894754tmp>
<https://builds.apache.org/job/HBase-0.92/ws/trunk/target/surefire/surefire8242596572749632615tmp>
Running org.apache.hadoop.hbase.TestHBaseTestingUtility
Tests run: 6, Failures: 0, Errors: 0, Skipped: 0, Time elapsed: 74.657 sec

Results :

Tests in error: 
  testRegionTransitionOperations(org.apache.hadoop.hbase.coprocessor.TestMasterObserver):
74bc341b655fa93a5d54174d52329f97

Tests run: 1031, Failures: 0, Errors: 1, Skipped: 9

[INFO] ------------------------------------------------------------------------
[INFO] BUILD FAILURE
[INFO] ------------------------------------------------------------------------
[INFO] Total time: 1:50:48.385s
[INFO] Finished at: Tue Oct 25 18:51:13 UTC 2011
[INFO] Final Memory: 40M/739M
[INFO] ------------------------------------------------------------------------
[ERROR] Failed to execute goal org.apache.maven.plugins:maven-surefire-plugin:2.9:test (default-test)
on project hbase: There are test failures.
[ERROR] 
[ERROR] Please refer to <https://builds.apache.org/job/HBase-0.92/ws/trunk/target/surefire-reports>
for the individual test results.
[ERROR] -> [Help 1]
org.apache.maven.lifecycle.LifecycleExecutionException: Failed to execute goal org.apache.maven.plugins:maven-surefire-plugin:2.9:test
(default-test) on project hbase: There are test failures.

Please refer to <https://builds.apache.org/job/HBase-0.92/ws/trunk/target/surefire-reports>
for the individual test results.
	at org.apache.maven.lifecycle.internal.MojoExecutor.execute(MojoExecutor.java:213)
	at org.apache.maven.lifecycle.internal.MojoExecutor.execute(MojoExecutor.java:153)
	at org.apache.maven.lifecycle.internal.MojoExecutor.execute(MojoExecutor.java:145)
	at org.apache.maven.lifecycle.internal.MojoExecutor.executeForkedExecutions(MojoExecutor.java:365)
	at org.apache.maven.lifecycle.internal.MojoExecutor.execute(MojoExecutor.java:199)
	at org.apache.maven.lifecycle.internal.MojoExecutor.execute(MojoExecutor.java:153)
	at org.apache.maven.lifecycle.internal.MojoExecutor.execute(MojoExecutor.java:145)
	at org.apache.maven.lifecycle.internal.LifecycleModuleBuilder.buildProject(LifecycleModuleBuilder.java:84)
	at org.apache.maven.lifecycle.internal.LifecycleModuleBuilder.buildProject(LifecycleModuleBuilder.java:59)
	at org.apache.maven.lifecycle.internal.LifecycleStarter.singleThreadedBuild(LifecycleStarter.java:183)
	at org.apache.maven.lifecycle.internal.LifecycleStarter.execute(LifecycleStarter.java:161)
	at org.apache.maven.DefaultMaven.doExecute(DefaultMaven.java:319)
	at org.apache.maven.DefaultMaven.execute(DefaultMaven.java:156)
	at org.apache.maven.cli.MavenCli.execute(MavenCli.java:537)
	at org.apache.maven.cli.MavenCli.doMain(MavenCli.java:196)
	at org.apache.maven.cli.MavenCli.main(MavenCli.java:141)
	at sun.reflect.NativeMethodAccessorImpl.invoke0(Native Method)
	at sun.reflect.NativeMethodAccessorImpl.invoke(NativeMethodAccessorImpl.java:39)
	at sun.reflect.DelegatingMethodAccessorImpl.invoke(DelegatingMethodAccessorImpl.java:25)
	at java.lang.reflect.Method.invoke(Method.java:597)
	at org.codehaus.plexus.classworlds.launcher.Launcher.launchEnhanced(Launcher.java:290)
	at org.codehaus.plexus.classworlds.launcher.Launcher.launch(Launcher.java:230)
	at org.codehaus.plexus.classworlds.launcher.Launcher.mainWithExitCode(Launcher.java:409)
	at org.codehaus.plexus.classworlds.launcher.Launcher.main(Launcher.java:352)
Caused by: org.apache.maven.plugin.MojoFailureException: There are test failures.

Please refer to <https://builds.apache.org/job/HBase-0.92/ws/trunk/target/surefire-reports>
for the individual test results.
	at org.apache.maven.plugin.surefire.SurefireHelper.reportExecution(SurefireHelper.java:87)
	at org.apache.maven.plugin.surefire.SurefirePlugin.writeSummary(SurefirePlugin.java:631)
	at org.apache.maven.plugin.surefire.SurefirePlugin.handleSummary(SurefirePlugin.java:605)
	at org.apache.maven.plugin.surefire.AbstractSurefireMojo.executeAfterPreconditionsChecked(AbstractSurefireMojo.java:136)
	at org.apache.maven.plugin.surefire.AbstractSurefireMojo.execute(AbstractSurefireMojo.java:97)
	at org.apache.maven.plugin.DefaultBuildPluginManager.executeMojo(DefaultBuildPluginManager.java:101)
	at org.apache.maven.lifecycle.internal.MojoExecutor.execute(MojoExecutor.java:209)
	... 23 more
[ERROR] 
[ERROR] 
[ERROR] For more information about the errors and possible solutions, please read the following
articles:
[ERROR] [Help 1] http://cwiki.apache.org/confluence/display/MAVEN/MojoFailureException
Build step 'Invoke top-level Maven targets' marked build as failure
[locks-and-latches] Releasing all the locks
[locks-and-latches] All the locks released
Archiving artifacts
Recording test results


Mime
View raw message