hbase-dev mailing list archives

Site index · List index
Message view « Date » · « Thread »
Top « Date » · « Thread »
From Apache Jenkins Server <jenk...@builds.apache.org>
Subject Build failed in Jenkins: HBase-TRUNK #2381
Date Sat, 29 Oct 2011 02:39:27 GMT
See <https://builds.apache.org/job/HBase-TRUNK/2381/changes>

Changes:

[kannan] go hbase!

[stack] HBASE-4436 Remove trivial 0.90 deprecated code from 0.92 and trunk.

[stack] HBASE-4694 Some cleanup of log messages in RS and M

[stack] HBASE-4699 Cleanup the UIs

[larsh] HBASE-4691  Remove more unnecessary byte[] copies from KeyValues

------------------------------------------
[...truncated 1713 lines...]
Tests run: 3, Failures: 0, Errors: 0, Skipped: 0, Time elapsed: 0.389 sec
Running org.apache.hadoop.hbase.TestFullLogReconstruction
Tests run: 1, Failures: 0, Errors: 0, Skipped: 0, Time elapsed: 66.739 sec
Running org.apache.hadoop.hbase.ipc.TestDelayedRpc
Tests run: 4, Failures: 0, Errors: 0, Skipped: 0, Time elapsed: 2.296 sec
Running org.apache.hadoop.hbase.TestGlobalMemStoreSize
Tests run: 1, Failures: 0, Errors: 0, Skipped: 0, Time elapsed: 16.492 sec
Running org.apache.hadoop.hbase.TestKeyValue
Tests run: 11, Failures: 0, Errors: 0, Skipped: 0, Time elapsed: 0.1 sec
Running org.apache.hadoop.hbase.rest.TestSchemaResource
Tests run: 2, Failures: 0, Errors: 0, Skipped: 0, Time elapsed: 36.493 sec
Running org.apache.hadoop.hbase.rest.client.TestRemoteAdmin
Tests run: 2, Failures: 0, Errors: 0, Skipped: 0, Time elapsed: 26.093 sec
Running org.apache.hadoop.hbase.rest.client.TestRemoteTable
Tests run: 3, Failures: 0, Errors: 0, Skipped: 0, Time elapsed: 24.006 sec
Running org.apache.hadoop.hbase.rest.model.TestVersionModel
Tests run: 3, Failures: 0, Errors: 0, Skipped: 0, Time elapsed: 0.278 sec
Running org.apache.hadoop.hbase.rest.model.TestTableRegionModel
Tests run: 4, Failures: 0, Errors: 0, Skipped: 0, Time elapsed: 0.362 sec
Running org.apache.hadoop.hbase.rest.model.TestTableListModel
Tests run: 3, Failures: 0, Errors: 0, Skipped: 0, Time elapsed: 0.298 sec
Running org.apache.hadoop.hbase.rest.model.TestStorageClusterStatusModel
Tests run: 3, Failures: 0, Errors: 0, Skipped: 0, Time elapsed: 0.358 sec
Running org.apache.hadoop.hbase.rest.model.TestColumnSchemaModel
Tests run: 2, Failures: 0, Errors: 0, Skipped: 0, Time elapsed: 0.225 sec
Running org.apache.hadoop.hbase.rest.model.TestCellSetModel
Tests run: 3, Failures: 0, Errors: 0, Skipped: 0, Time elapsed: 0.317 sec
Running org.apache.hadoop.hbase.rest.model.TestTableSchemaModel
Tests run: 3, Failures: 0, Errors: 0, Skipped: 0, Time elapsed: 0.305 sec
Running org.apache.hadoop.hbase.rest.model.TestStorageClusterVersionModel
Tests run: 2, Failures: 0, Errors: 0, Skipped: 0, Time elapsed: 0.206 sec
Running org.apache.hadoop.hbase.rest.model.TestTableInfoModel
Tests run: 3, Failures: 0, Errors: 0, Skipped: 0, Time elapsed: 0.302 sec
Running org.apache.hadoop.hbase.rest.model.TestCellModel
Tests run: 3, Failures: 0, Errors: 0, Skipped: 0, Time elapsed: 0.294 sec
Running org.apache.hadoop.hbase.rest.model.TestRowModel
Tests run: 2, Failures: 0, Errors: 0, Skipped: 0, Time elapsed: 0.282 sec
Running org.apache.hadoop.hbase.rest.model.TestScannerModel
Tests run: 3, Failures: 0, Errors: 0, Skipped: 0, Time elapsed: 0.308 sec
Running org.apache.hadoop.hbase.rest.TestTableResource
Tests run: 8, Failures: 0, Errors: 0, Skipped: 0, Time elapsed: 51.93 sec
Running org.apache.hadoop.hbase.rest.TestMultiRowResource
Tests run: 3, Failures: 0, Errors: 0, Skipped: 0, Time elapsed: 22.513 sec
Running org.apache.hadoop.hbase.rest.TestGzipFilter
Tests run: 3, Failures: 0, Errors: 0, Skipped: 0, Time elapsed: 22.219 sec
Running org.apache.hadoop.hbase.rest.TestRowResource
Tests run: 11, Failures: 0, Errors: 0, Skipped: 0, Time elapsed: 23.791 sec
Running org.apache.hadoop.hbase.rest.TestScannerResource
Tests run: 5, Failures: 0, Errors: 0, Skipped: 0, Time elapsed: 53.229 sec
Running org.apache.hadoop.hbase.rest.TestVersionResource
Tests run: 7, Failures: 0, Errors: 0, Skipped: 0, Time elapsed: 20.753 sec
Running org.apache.hadoop.hbase.rest.TestStatusResource
Tests run: 2, Failures: 0, Errors: 0, Skipped: 0, Time elapsed: 21.673 sec
Running org.apache.hadoop.hbase.rest.TestTransform
Tests run: 1, Failures: 0, Errors: 0, Skipped: 0, Time elapsed: 24.716 sec
Running org.apache.hadoop.hbase.rest.TestScannersWithFilters
Tests run: 10, Failures: 0, Errors: 0, Skipped: 0, Time elapsed: 24.237 sec
Running org.apache.hadoop.hbase.metrics.TestMetricsMBeanBase
Tests run: 2, Failures: 0, Errors: 0, Skipped: 0, Time elapsed: 1.106 sec
Running org.apache.hadoop.hbase.io.hfile.TestHFileWriterV2
Tests run: 1, Failures: 0, Errors: 0, Skipped: 0, Time elapsed: 0.691 sec
Running org.apache.hadoop.hbase.io.hfile.TestHFile
Tests run: 6, Failures: 0, Errors: 0, Skipped: 0, Time elapsed: 0.773 sec
Running org.apache.hadoop.hbase.io.hfile.TestHFileBlockIndex
Tests run: 10, Failures: 0, Errors: 0, Skipped: 0, Time elapsed: 6.995 sec
Running org.apache.hadoop.hbase.io.hfile.TestHFileSeek
Tests run: 1, Failures: 0, Errors: 0, Skipped: 0, Time elapsed: 4.171 sec
Running org.apache.hadoop.hbase.io.hfile.TestLruBlockCache
Tests run: 7, Failures: 0, Errors: 0, Skipped: 0, Time elapsed: 1.107 sec
Running org.apache.hadoop.hbase.io.hfile.TestFixedFileTrailer
Tests run: 2, Failures: 0, Errors: 0, Skipped: 0, Time elapsed: 0.428 sec
Running org.apache.hadoop.hbase.io.hfile.TestCachedBlockQueue
Tests run: 2, Failures: 0, Errors: 0, Skipped: 0, Time elapsed: 0.089 sec
Running org.apache.hadoop.hbase.io.hfile.TestHFilePerformance
Tests run: 1, Failures: 0, Errors: 0, Skipped: 0, Time elapsed: 3.951 sec
Running org.apache.hadoop.hbase.io.hfile.TestCacheOnWrite
Tests run: 6, Failures: 0, Errors: 0, Skipped: 0, Time elapsed: 5.323 sec
Running org.apache.hadoop.hbase.io.hfile.TestReseekTo
Tests run: 1, Failures: 0, Errors: 0, Skipped: 0, Time elapsed: 0.496 sec
Running org.apache.hadoop.hbase.io.hfile.TestSeekTo
Tests run: 3, Failures: 0, Errors: 0, Skipped: 0, Time elapsed: 0.508 sec
Running org.apache.hadoop.hbase.io.hfile.TestBlockCacheColumnFamilySummary
Tests run: 4, Failures: 0, Errors: 0, Skipped: 0, Time elapsed: 0.043 sec
Running org.apache.hadoop.hbase.io.hfile.TestHFileBlock
Tests run: 7, Failures: 0, Errors: 0, Skipped: 0, Time elapsed: 26.848 sec
Running org.apache.hadoop.hbase.io.hfile.slab.TestSlabCache
Tests run: 7, Failures: 0, Errors: 0, Skipped: 0, Time elapsed: 14.013 sec
Running org.apache.hadoop.hbase.io.hfile.slab.TestSingleSizeCache
Tests run: 5, Failures: 0, Errors: 0, Skipped: 0, Time elapsed: 17.853 sec
Running org.apache.hadoop.hbase.io.hfile.slab.TestSlab
Tests run: 1, Failures: 0, Errors: 0, Skipped: 0, Time elapsed: 0.108 sec
Running org.apache.hadoop.hbase.io.hfile.TestHFileReaderV1
Tests run: 1, Failures: 0, Errors: 0, Skipped: 0, Time elapsed: 0.449 sec
Running org.apache.hadoop.hbase.io.TestHalfStoreFileReader
Tests run: 1, Failures: 0, Errors: 0, Skipped: 0, Time elapsed: 0.518 sec
Running org.apache.hadoop.hbase.io.TestHbaseObjectWritable
Tests run: 4, Failures: 0, Errors: 0, Skipped: 0, Time elapsed: 0.353 sec
Running org.apache.hadoop.hbase.io.TestImmutableBytesWritable
Tests run: 3, Failures: 0, Errors: 0, Skipped: 0, Time elapsed: 0.092 sec
Running org.apache.hadoop.hbase.io.TestHeapSize
Tests run: 2, Failures: 0, Errors: 0, Skipped: 0, Time elapsed: 0.128 sec
Running org.apache.hadoop.hbase.TestRegionRebalancing
Tests run: 1, Failures: 0, Errors: 1, Skipped: 0, Time elapsed: 34.894 sec <<< FAILURE!
Running org.apache.hadoop.hbase.mapred.TestTableInputFormat
Tests run: 6, Failures: 0, Errors: 0, Skipped: 0, Time elapsed: 27.722 sec
Running org.apache.hadoop.hbase.mapred.TestTableMapReduce
Tests run: 1, Failures: 0, Errors: 0, Skipped: 0, Time elapsed: 69.401 sec
Running org.apache.hadoop.hbase.replication.regionserver.TestReplicationSink
Tests run: 5, Failures: 0, Errors: 0, Skipped: 0, Time elapsed: 24.519 sec
Running org.apache.hadoop.hbase.replication.regionserver.TestReplicationSourceManager
Tests run: 1, Failures: 0, Errors: 0, Skipped: 0, Time elapsed: 0.748 sec
Running org.apache.hadoop.hbase.replication.TestReplicationSource
Tests run: 1, Failures: 0, Errors: 0, Skipped: 0, Time elapsed: 11.715 sec
Running org.apache.hadoop.hbase.replication.TestReplication
Tests run: 7, Failures: 0, Errors: 0, Skipped: 0, Time elapsed: 186.506 sec
Running org.apache.hadoop.hbase.replication.TestReplicationPeer
Tests run: 1, Failures: 0, Errors: 0, Skipped: 0, Time elapsed: 25.461 sec
Running org.apache.hadoop.hbase.replication.TestMultiSlaveReplication
Tests run: 1, Failures: 0, Errors: 0, Skipped: 0, Time elapsed: 82.466 sec
Running org.apache.hadoop.hbase.replication.TestMasterReplication
Tests run: 2, Failures: 0, Errors: 0, Skipped: 0, Time elapsed: 101.523 sec
Running org.apache.hadoop.hbase.util.TestHBaseFsckComparator
Tests run: 7, Failures: 0, Errors: 0, Skipped: 0, Time elapsed: 0.138 sec
Running org.apache.hadoop.hbase.util.TestMergeTool
Tests run: 1, Failures: 0, Errors: 0, Skipped: 0, Time elapsed: 252.396 sec
Running org.apache.hadoop.hbase.util.TestFSTableDescriptors
Tests run: 5, Failures: 0, Errors: 0, Skipped: 0, Time elapsed: 0.595 sec
Running org.apache.hadoop.hbase.util.TestIdLock
Tests run: 1, Failures: 0, Errors: 0, Skipped: 0, Time elapsed: 20.187 sec
Running org.apache.hadoop.hbase.util.TestCompressionTest
Tests run: 1, Failures: 0, Errors: 0, Skipped: 0, Time elapsed: 0.298 sec
Running org.apache.hadoop.hbase.util.TestBytes
Tests run: 13, Failures: 0, Errors: 0, Skipped: 0, Time elapsed: 0.103 sec
Running org.apache.hadoop.hbase.util.TestSortedCopyOnWriteSet
Tests run: 2, Failures: 0, Errors: 0, Skipped: 0, Time elapsed: 0.06 sec
Running org.apache.hadoop.hbase.util.TestEnvironmentEdgeManager
Tests run: 2, Failures: 0, Errors: 0, Skipped: 0, Time elapsed: 0.183 sec
Running org.apache.hadoop.hbase.util.TestKeying
Tests run: 1, Failures: 0, Errors: 0, Skipped: 0, Time elapsed: 0.025 sec
Running org.apache.hadoop.hbase.util.TestByteBloomFilter
Tests run: 5, Failures: 0, Errors: 0, Skipped: 0, Time elapsed: 0.864 sec
Running org.apache.hadoop.hbase.util.TestRootPath
Tests run: 1, Failures: 0, Errors: 0, Skipped: 0, Time elapsed: 0.099 sec
Running org.apache.hadoop.hbase.util.TestMergeTable
Tests run: 1, Failures: 0, Errors: 0, Skipped: 0, Time elapsed: 52.015 sec
Running org.apache.hadoop.hbase.util.TestHBaseFsck
Tests run: 6, Failures: 0, Errors: 0, Skipped: 0, Time elapsed: 61.12 sec
Running org.apache.hadoop.hbase.util.TestFSUtils
Tests run: 2, Failures: 0, Errors: 0, Skipped: 0, Time elapsed: 18.939 sec
Running org.apache.hadoop.hbase.util.TestPoolMap
Tests run: 9, Failures: 0, Errors: 0, Skipped: 0, Time elapsed: 0.047 sec
Running org.apache.hadoop.hbase.util.TestRegionSplitter
Tests run: 4, Failures: 0, Errors: 0, Skipped: 0, Time elapsed: 56.722 sec
Running org.apache.hadoop.hbase.util.TestBase64
Tests run: 1, Failures: 0, Errors: 0, Skipped: 0, Time elapsed: 0.089 sec
Running org.apache.hadoop.hbase.util.TestDefaultEnvironmentEdge
Tests run: 1, Failures: 0, Errors: 0, Skipped: 0, Time elapsed: 0.056 sec
Running org.apache.hadoop.hbase.util.TestIncrementingEnvironmentEdge
Tests run: 1, Failures: 0, Errors: 0, Skipped: 0, Time elapsed: 0.047 sec
Running org.apache.hadoop.hbase.util.TestRegionSplitCalculator
Tests run: 14, Failures: 0, Errors: 0, Skipped: 0, Time elapsed: 0.147 sec
Running org.apache.hadoop.hbase.TestHRegionLocation
Tests run: 3, Failures: 0, Errors: 0, Skipped: 0, Time elapsed: 0.111 sec
Running org.apache.hadoop.hbase.migration.TestMigrationFrom090To092
Tests run: 1, Failures: 0, Errors: 0, Skipped: 0, Time elapsed: 0.237 sec
Running org.apache.hadoop.hbase.TestCompare
Tests run: 1, Failures: 0, Errors: 0, Skipped: 0, Time elapsed: 0.205 sec
Running org.apache.hadoop.hbase.TestInfoServers
Tests run: 2, Failures: 0, Errors: 0, Skipped: 0, Time elapsed: 34.652 sec
Running org.apache.hadoop.hbase.TestHServerAddress
Tests run: 6, Failures: 0, Errors: 0, Skipped: 0, Time elapsed: 0.055 sec
Running org.apache.hadoop.hbase.TestServerName
Tests run: 4, Failures: 0, Errors: 0, Skipped: 0, Time elapsed: 0.117 sec

Results :

Tests in error: 
  testFlushCommitsNoAbort(org.apache.hadoop.hbase.client.TestMultiParallel)
  testExceptionFromCoprocessorDuringPut(org.apache.hadoop.hbase.coprocessor.TestRegionServerCoprocessorExceptionWithAbort):
-1
  testRegionTransitionOperations(org.apache.hadoop.hbase.coprocessor.TestMasterObserver):
b7fe0a27263c9bd99936522beac83aad
  testExceptionFromCoprocessorDuringPut(org.apache.hadoop.hbase.coprocessor.TestRegionServerCoprocessorExceptionWithRemove):
-1
  testBalanceCluster(org.apache.hadoop.hbase.master.TestDefaultLoadBalancer)
  testRebalanceOnRegionServerNumberChange(org.apache.hadoop.hbase.TestRegionRebalancing)

Tests run: 1069, Failures: 0, Errors: 6, Skipped: 9

[INFO] ------------------------------------------------------------------------
[INFO] BUILD FAILURE
[INFO] ------------------------------------------------------------------------
[INFO] Total time: 1:49:10.712s
[INFO] Finished at: Sat Oct 29 02:39:13 UTC 2011
[INFO] Final Memory: 19M/863M
[INFO] ------------------------------------------------------------------------
[ERROR] Failed to execute goal org.apache.maven.plugins:maven-surefire-plugin:2.9:test (default-test)
on project hbase: There are test failures.
[ERROR] 
[ERROR] Please refer to /x1/jenkins/jenkins-slave/workspace/HBase-TRUNK/trunk/target/surefire-reports
for the individual test results.
[ERROR] -> [Help 1]
org.apache.maven.lifecycle.LifecycleExecutionException: Failed to execute goal org.apache.maven.plugins:maven-surefire-plugin:2.9:test
(default-test) on project hbase: There are test failures.

Please refer to /x1/jenkins/jenkins-slave/workspace/HBase-TRUNK/trunk/target/surefire-reports
for the individual test results.
	at org.apache.maven.lifecycle.internal.MojoExecutor.execute(MojoExecutor.java:213)
	at org.apache.maven.lifecycle.internal.MojoExecutor.execute(MojoExecutor.java:153)
	at org.apache.maven.lifecycle.internal.MojoExecutor.execute(MojoExecutor.java:145)
	at org.apache.maven.lifecycle.internal.MojoExecutor.executeForkedExecutions(MojoExecutor.java:365)
	at org.apache.maven.lifecycle.internal.MojoExecutor.execute(MojoExecutor.java:199)
	at org.apache.maven.lifecycle.internal.MojoExecutor.execute(MojoExecutor.java:153)
	at org.apache.maven.lifecycle.internal.MojoExecutor.execute(MojoExecutor.java:145)
	at org.apache.maven.lifecycle.internal.LifecycleModuleBuilder.buildProject(LifecycleModuleBuilder.java:84)
	at org.apache.maven.lifecycle.internal.LifecycleModuleBuilder.buildProject(LifecycleModuleBuilder.java:59)
	at org.apache.maven.lifecycle.internal.LifecycleStarter.singleThreadedBuild(LifecycleStarter.java:183)
	at org.apache.maven.lifecycle.internal.LifecycleStarter.execute(LifecycleStarter.java:161)
	at org.apache.maven.DefaultMaven.doExecute(DefaultMaven.java:319)
	at org.apache.maven.DefaultMaven.execute(DefaultMaven.java:156)
	at org.apache.maven.cli.MavenCli.execute(MavenCli.java:534)
	at org.apache.maven.cli.MavenCli.doMain(MavenCli.java:196)
	at org.apache.maven.cli.MavenCli.main(MavenCli.java:141)
	at sun.reflect.NativeMethodAccessorImpl.invoke0(Native Method)
	at sun.reflect.NativeMethodAccessorImpl.invoke(NativeMethodAccessorImpl.java:39)
	at sun.reflect.DelegatingMethodAccessorImpl.invoke(DelegatingMethodAccessorImpl.java:25)
	at java.lang.reflect.Method.invoke(Method.java:597)
	at org.codehaus.plexus.classworlds.launcher.Launcher.launchEnhanced(Launcher.java:290)
	at org.codehaus.plexus.classworlds.launcher.Launcher.launch(Launcher.java:230)
	at org.codehaus.plexus.classworlds.launcher.Launcher.mainWithExitCode(Launcher.java:409)
	at org.codehaus.plexus.classworlds.launcher.Launcher.main(Launcher.java:352)
Caused by: org.apache.maven.plugin.MojoFailureException: There are test failures.

Please refer to /x1/jenkins/jenkins-slave/workspace/HBase-TRUNK/trunk/target/surefire-reports
for the individual test results.
	at org.apache.maven.plugin.surefire.SurefireHelper.reportExecution(SurefireHelper.java:87)
	at org.apache.maven.plugin.surefire.SurefirePlugin.writeSummary(SurefirePlugin.java:631)
	at org.apache.maven.plugin.surefire.SurefirePlugin.handleSummary(SurefirePlugin.java:605)
	at org.apache.maven.plugin.surefire.AbstractSurefireMojo.executeAfterPreconditionsChecked(AbstractSurefireMojo.java:136)
	at org.apache.maven.plugin.surefire.AbstractSurefireMojo.execute(AbstractSurefireMojo.java:97)
	at org.apache.maven.plugin.DefaultBuildPluginManager.executeMojo(DefaultBuildPluginManager.java:107)
	at org.apache.maven.lifecycle.internal.MojoExecutor.execute(MojoExecutor.java:209)
	... 23 more
[ERROR] 
[ERROR] Re-run Maven using the -X switch to enable full debug logging.
[ERROR] 
[ERROR] For more information about the errors and possible solutions, please read the following
articles:
[ERROR] [Help 1] http://cwiki.apache.org/confluence/display/MAVEN/MojoFailureException
Build step 'Invoke top-level Maven targets' marked build as failure
[locks-and-latches] Releasing all the locks
[locks-and-latches] All the locks released
Archiving artifacts
Recording test results
Updating HBASE-4699
Updating HBASE-4694
Updating HBASE-4691
Updating HBASE-4436


Mime
View raw message