hbase-dev mailing list archives

Site index · List index
Message view « Date » · « Thread »
Top « Date » · « Thread »
From Apache Jenkins Server <jenk...@builds.apache.org>
Subject Build failed in Jenkins: HBase-0.92 #59
Date Thu, 13 Oct 2011 07:52:03 GMT
See <https://builds.apache.org/job/HBase-0.92/59/>

------------------------------------------
[...truncated 6052 lines...]
Running org.apache.hadoop.hbase.regionserver.TestStoreFile
Tests run: 8, Failures: 0, Errors: 0, Skipped: 0, Time elapsed: 65.742 sec
Forking command line: /bin/sh -c cd <https://builds.apache.org/job/HBase-0.92/ws/trunk>
&& /home/hudson/tools/java/jdk1.6.0_20-32/jre/bin/java -enableassertions -Xmx1400m
-jar <https://builds.apache.org/job/HBase-0.92/ws/trunk/target/surefire/surefirebooter1749276907435203581.jar>
<https://builds.apache.org/job/HBase-0.92/ws/trunk/target/surefire/surefire348876639827719586tmp>
<https://builds.apache.org/job/HBase-0.92/ws/trunk/target/surefire/surefire6748434705493571140tmp>
Running org.apache.hadoop.hbase.regionserver.TestKeyValueSkipListSet
Tests run: 4, Failures: 0, Errors: 0, Skipped: 0, Time elapsed: 0.119 sec
Forking command line: /bin/sh -c cd <https://builds.apache.org/job/HBase-0.92/ws/trunk>
&& /home/hudson/tools/java/jdk1.6.0_20-32/jre/bin/java -enableassertions -Xmx1400m
-jar <https://builds.apache.org/job/HBase-0.92/ws/trunk/target/surefire/surefirebooter5119344135401276462.jar>
<https://builds.apache.org/job/HBase-0.92/ws/trunk/target/surefire/surefire8081819081286905232tmp>
<https://builds.apache.org/job/HBase-0.92/ws/trunk/target/surefire/surefire4397363822325182920tmp>
Running org.apache.hadoop.hbase.regionserver.TestExplicitColumnTracker
Tests run: 4, Failures: 0, Errors: 0, Skipped: 0, Time elapsed: 0.852 sec
Forking command line: /bin/sh -c cd <https://builds.apache.org/job/HBase-0.92/ws/trunk>
&& /home/hudson/tools/java/jdk1.6.0_20-32/jre/bin/java -enableassertions -Xmx1400m
-jar <https://builds.apache.org/job/HBase-0.92/ws/trunk/target/surefire/surefirebooter131676461246402407.jar>
<https://builds.apache.org/job/HBase-0.92/ws/trunk/target/surefire/surefire1485730358894334172tmp>
<https://builds.apache.org/job/HBase-0.92/ws/trunk/target/surefire/surefire2915140142977504829tmp>
Running org.apache.hadoop.hbase.regionserver.TestMemStoreLAB
Tests run: 3, Failures: 0, Errors: 0, Skipped: 0, Time elapsed: 1.42 sec
Forking command line: /bin/sh -c cd <https://builds.apache.org/job/HBase-0.92/ws/trunk>
&& /home/hudson/tools/java/jdk1.6.0_20-32/jre/bin/java -enableassertions -Xmx1400m
-jar <https://builds.apache.org/job/HBase-0.92/ws/trunk/target/surefire/surefirebooter3881770521042586893.jar>
<https://builds.apache.org/job/HBase-0.92/ws/trunk/target/surefire/surefire3446438878014042333tmp>
<https://builds.apache.org/job/HBase-0.92/ws/trunk/target/surefire/surefire4760810651785662400tmp>
Running org.apache.hadoop.hbase.regionserver.TestSplitLogWorker
Tests run: 5, Failures: 0, Errors: 0, Skipped: 0, Time elapsed: 2.539 sec
Forking command line: /bin/sh -c cd <https://builds.apache.org/job/HBase-0.92/ws/trunk>
&& /home/hudson/tools/java/jdk1.6.0_20-32/jre/bin/java -enableassertions -Xmx1400m
-jar <https://builds.apache.org/job/HBase-0.92/ws/trunk/target/surefire/surefirebooter9186855112749353912.jar>
<https://builds.apache.org/job/HBase-0.92/ws/trunk/target/surefire/surefire4252787185792068234tmp>
<https://builds.apache.org/job/HBase-0.92/ws/trunk/target/surefire/surefire5080627100853092729tmp>
Running org.apache.hadoop.hbase.regionserver.TestMultiColumnScanner
Tests run: 6, Failures: 0, Errors: 0, Skipped: 0, Time elapsed: 22.618 sec
Forking command line: /bin/sh -c cd <https://builds.apache.org/job/HBase-0.92/ws/trunk>
&& /home/hudson/tools/java/jdk1.6.0_20-32/jre/bin/java -enableassertions -Xmx1400m
-jar <https://builds.apache.org/job/HBase-0.92/ws/trunk/target/surefire/surefirebooter2080917895464953039.jar>
<https://builds.apache.org/job/HBase-0.92/ws/trunk/target/surefire/surefire4563379199884194026tmp>
<https://builds.apache.org/job/HBase-0.92/ws/trunk/target/surefire/surefire7458204355361618169tmp>
Running org.apache.hadoop.hbase.regionserver.TestSplitTransaction
Tests run: 6, Failures: 0, Errors: 0, Skipped: 0, Time elapsed: 4.499 sec
Forking command line: /bin/sh -c cd <https://builds.apache.org/job/HBase-0.92/ws/trunk>
&& /home/hudson/tools/java/jdk1.6.0_20-32/jre/bin/java -enableassertions -Xmx1400m
-jar <https://builds.apache.org/job/HBase-0.92/ws/trunk/target/surefire/surefirebooter2025534681977731864.jar>
<https://builds.apache.org/job/HBase-0.92/ws/trunk/target/surefire/surefire918542891197969661tmp>
<https://builds.apache.org/job/HBase-0.92/ws/trunk/target/surefire/surefire318605922724691747tmp>
Running org.apache.hadoop.hbase.regionserver.TestCompoundBloomFilter
Tests run: 3, Failures: 0, Errors: 0, Skipped: 0, Time elapsed: 25.008 sec
Forking command line: /bin/sh -c cd <https://builds.apache.org/job/HBase-0.92/ws/trunk>
&& /home/hudson/tools/java/jdk1.6.0_20-32/jre/bin/java -enableassertions -Xmx1400m
-jar <https://builds.apache.org/job/HBase-0.92/ws/trunk/target/surefire/surefirebooter2619877041536373055.jar>
<https://builds.apache.org/job/HBase-0.92/ws/trunk/target/surefire/surefire871620168801296tmp>
<https://builds.apache.org/job/HBase-0.92/ws/trunk/target/surefire/surefire3977652972646285265tmp>
Running org.apache.hadoop.hbase.regionserver.TestEndToEndSplitTransaction
Tests run: 1, Failures: 0, Errors: 0, Skipped: 0, Time elapsed: 91.308 sec
Forking command line: /bin/sh -c cd <https://builds.apache.org/job/HBase-0.92/ws/trunk>
&& /home/hudson/tools/java/jdk1.6.0_20-32/jre/bin/java -enableassertions -Xmx1400m
-jar <https://builds.apache.org/job/HBase-0.92/ws/trunk/target/surefire/surefirebooter6558343667374914707.jar>
<https://builds.apache.org/job/HBase-0.92/ws/trunk/target/surefire/surefire2783749431869137791tmp>
<https://builds.apache.org/job/HBase-0.92/ws/trunk/target/surefire/surefire3752135439084374079tmp>
Running org.apache.hadoop.hbase.regionserver.TestWideScanner
Tests run: 1, Failures: 0, Errors: 0, Skipped: 0, Time elapsed: 78.429 sec
Forking command line: /bin/sh -c cd <https://builds.apache.org/job/HBase-0.92/ws/trunk>
&& /home/hudson/tools/java/jdk1.6.0_20-32/jre/bin/java -enableassertions -Xmx1400m
-jar <https://builds.apache.org/job/HBase-0.92/ws/trunk/target/surefire/surefirebooter8808364929102624443.jar>
<https://builds.apache.org/job/HBase-0.92/ws/trunk/target/surefire/surefire600895170934003097tmp>
<https://builds.apache.org/job/HBase-0.92/ws/trunk/target/surefire/surefire6133958650405234289tmp>
Running org.apache.hadoop.hbase.regionserver.TestHRegion
Tests run: 57, Failures: 0, Errors: 0, Skipped: 0, Time elapsed: 88.736 sec
Forking command line: /bin/sh -c cd <https://builds.apache.org/job/HBase-0.92/ws/trunk>
&& /home/hudson/tools/java/jdk1.6.0_20-32/jre/bin/java -enableassertions -Xmx1400m
-jar <https://builds.apache.org/job/HBase-0.92/ws/trunk/target/surefire/surefirebooter578202786312141204.jar>
<https://builds.apache.org/job/HBase-0.92/ws/trunk/target/surefire/surefire9035918356066673590tmp>
<https://builds.apache.org/job/HBase-0.92/ws/trunk/target/surefire/surefire7099396801440990762tmp>
Running org.apache.hadoop.hbase.regionserver.TestMinVersions
Tests run: 6, Failures: 0, Errors: 0, Skipped: 0, Time elapsed: 1.478 sec
Forking command line: /bin/sh -c cd <https://builds.apache.org/job/HBase-0.92/ws/trunk>
&& /home/hudson/tools/java/jdk1.6.0_20-32/jre/bin/java -enableassertions -Xmx1400m
-jar <https://builds.apache.org/job/HBase-0.92/ws/trunk/target/surefire/surefirebooter1709572602087760317.jar>
<https://builds.apache.org/job/HBase-0.92/ws/trunk/target/surefire/surefire2027281873808187786tmp>
<https://builds.apache.org/job/HBase-0.92/ws/trunk/target/surefire/surefire4819949388814685265tmp>
Running org.apache.hadoop.hbase.client.TestGet
Tests run: 2, Failures: 0, Errors: 0, Skipped: 0, Time elapsed: 0.133 sec
Forking command line: /bin/sh -c cd <https://builds.apache.org/job/HBase-0.92/ws/trunk>
&& /home/hudson/tools/java/jdk1.6.0_20-32/jre/bin/java -enableassertions -Xmx1400m
-jar <https://builds.apache.org/job/HBase-0.92/ws/trunk/target/surefire/surefirebooter391630334751273466.jar>
<https://builds.apache.org/job/HBase-0.92/ws/trunk/target/surefire/surefire9002127098101778521tmp>
<https://builds.apache.org/job/HBase-0.92/ws/trunk/target/surefire/surefire6188721154546320806tmp>
Running org.apache.hadoop.hbase.client.TestAttributes
Tests run: 3, Failures: 0, Errors: 0, Skipped: 0, Time elapsed: 0.136 sec
Forking command line: /bin/sh -c cd <https://builds.apache.org/job/HBase-0.92/ws/trunk>
&& /home/hudson/tools/java/jdk1.6.0_20-32/jre/bin/java -enableassertions -Xmx1400m
-jar <https://builds.apache.org/job/HBase-0.92/ws/trunk/target/surefire/surefirebooter3328510115765917885.jar>
<https://builds.apache.org/job/HBase-0.92/ws/trunk/target/surefire/surefire4532190500346857492tmp>
<https://builds.apache.org/job/HBase-0.92/ws/trunk/target/surefire/surefire852495739114306795tmp>
Running org.apache.hadoop.hbase.client.TestMetaMigration
Tests run: 4, Failures: 0, Errors: 0, Skipped: 0, Time elapsed: 102.512 sec
Forking command line: /bin/sh -c cd <https://builds.apache.org/job/HBase-0.92/ws/trunk>
&& /home/hudson/tools/java/jdk1.6.0_20-32/jre/bin/java -enableassertions -Xmx1400m
-jar <https://builds.apache.org/job/HBase-0.92/ws/trunk/target/surefire/surefirebooter2682928292855495051.jar>
<https://builds.apache.org/job/HBase-0.92/ws/trunk/target/surefire/surefire1103148113405780379tmp>
<https://builds.apache.org/job/HBase-0.92/ws/trunk/target/surefire/surefire5611936258756234541tmp>
Running org.apache.hadoop.hbase.client.TestResult
Tests run: 2, Failures: 0, Errors: 0, Skipped: 0, Time elapsed: 0.142 sec
Forking command line: /bin/sh -c cd <https://builds.apache.org/job/HBase-0.92/ws/trunk>
&& /home/hudson/tools/java/jdk1.6.0_20-32/jre/bin/java -enableassertions -Xmx1400m
-jar <https://builds.apache.org/job/HBase-0.92/ws/trunk/target/surefire/surefirebooter8452359022328054167.jar>
<https://builds.apache.org/job/HBase-0.92/ws/trunk/target/surefire/surefire5477431958456137057tmp>
<https://builds.apache.org/job/HBase-0.92/ws/trunk/target/surefire/surefire712798501058587294tmp>
Running org.apache.hadoop.hbase.client.replication.TestReplicationAdmin
Tests run: 1, Failures: 0, Errors: 0, Skipped: 0, Time elapsed: 0.883 sec
Forking command line: /bin/sh -c cd <https://builds.apache.org/job/HBase-0.92/ws/trunk>
&& /home/hudson/tools/java/jdk1.6.0_20-32/jre/bin/java -enableassertions -Xmx1400m
-jar <https://builds.apache.org/job/HBase-0.92/ws/trunk/target/surefire/surefirebooter1019352573164516819.jar>
<https://builds.apache.org/job/HBase-0.92/ws/trunk/target/surefire/surefire6624087681143951578tmp>
<https://builds.apache.org/job/HBase-0.92/ws/trunk/target/surefire/surefire1244027285326634775tmp>
Running org.apache.hadoop.hbase.client.TestTimestampsFilter
Tests run: 3, Failures: 0, Errors: 0, Skipped: 0, Time elapsed: 81.705 sec
Forking command line: /bin/sh -c cd <https://builds.apache.org/job/HBase-0.92/ws/trunk>
&& /home/hudson/tools/java/jdk1.6.0_20-32/jre/bin/java -enableassertions -Xmx1400m
-jar <https://builds.apache.org/job/HBase-0.92/ws/trunk/target/surefire/surefirebooter2877556054660995654.jar>
<https://builds.apache.org/job/HBase-0.92/ws/trunk/target/surefire/surefire4790512938147302114tmp>
<https://builds.apache.org/job/HBase-0.92/ws/trunk/target/surefire/surefire84852993738997021tmp>
Running org.apache.hadoop.hbase.client.TestMultipleTimestamps
Tests run: 8, Failures: 0, Errors: 0, Skipped: 0, Time elapsed: 130.996 sec
Forking command line: /bin/sh -c cd <https://builds.apache.org/job/HBase-0.92/ws/trunk>
&& /home/hudson/tools/java/jdk1.6.0_20-32/jre/bin/java -enableassertions -Xmx1400m
-jar <https://builds.apache.org/job/HBase-0.92/ws/trunk/target/surefire/surefirebooter4782714495503645680.jar>
<https://builds.apache.org/job/HBase-0.92/ws/trunk/target/surefire/surefire8560676065160776677tmp>
<https://builds.apache.org/job/HBase-0.92/ws/trunk/target/surefire/surefire4951192514265865860tmp>
Running org.apache.hadoop.hbase.client.TestFromClientSide
Tests run: 45, Failures: 0, Errors: 0, Skipped: 3, Time elapsed: 208.58 sec
Forking command line: /bin/sh -c cd <https://builds.apache.org/job/HBase-0.92/ws/trunk>
&& /home/hudson/tools/java/jdk1.6.0_20-32/jre/bin/java -enableassertions -Xmx1400m
-jar <https://builds.apache.org/job/HBase-0.92/ws/trunk/target/surefire/surefirebooter5173638424638292579.jar>
<https://builds.apache.org/job/HBase-0.92/ws/trunk/target/surefire/surefire684564940382829488tmp>
<https://builds.apache.org/job/HBase-0.92/ws/trunk/target/surefire/surefire6883895794527137976tmp>
Running org.apache.hadoop.hbase.client.TestHCM
Tests run: 3, Failures: 0, Errors: 0, Skipped: 0, Time elapsed: 70.533 sec
Forking command line: /bin/sh -c cd <https://builds.apache.org/job/HBase-0.92/ws/trunk>
&& /home/hudson/tools/java/jdk1.6.0_20-32/jre/bin/java -enableassertions -Xmx1400m
-jar <https://builds.apache.org/job/HBase-0.92/ws/trunk/target/surefire/surefirebooter905869112758261815.jar>
<https://builds.apache.org/job/HBase-0.92/ws/trunk/target/surefire/surefire6885629497088248834tmp>
<https://builds.apache.org/job/HBase-0.92/ws/trunk/target/surefire/surefire4462945869288569215tmp>
Running org.apache.hadoop.hbase.client.TestHTablePool
Tests run: 18, Failures: 0, Errors: 0, Skipped: 0, Time elapsed: 406.404 sec
Forking command line: /bin/sh -c cd <https://builds.apache.org/job/HBase-0.92/ws/trunk>
&& /home/hudson/tools/java/jdk1.6.0_20-32/jre/bin/java -enableassertions -Xmx1400m
-jar <https://builds.apache.org/job/HBase-0.92/ws/trunk/target/surefire/surefirebooter4435137736219873204.jar>
<https://builds.apache.org/job/HBase-0.92/ws/trunk/target/surefire/surefire7022537220713833802tmp>
<https://builds.apache.org/job/HBase-0.92/ws/trunk/target/surefire/surefire5652888925104844601tmp>
Running org.apache.hadoop.hbase.client.TestHTableUtil
Tests run: 2, Failures: 0, Errors: 0, Skipped: 0, Time elapsed: 26.639 sec
Forking command line: /bin/sh -c cd <https://builds.apache.org/job/HBase-0.92/ws/trunk>
&& /home/hudson/tools/java/jdk1.6.0_20-32/jre/bin/java -enableassertions -Xmx1400m
-jar <https://builds.apache.org/job/HBase-0.92/ws/trunk/target/surefire/surefirebooter4185304537031295271.jar>
<https://builds.apache.org/job/HBase-0.92/ws/trunk/target/surefire/surefire2474574406290941928tmp>
<https://builds.apache.org/job/HBase-0.92/ws/trunk/target/surefire/surefire2234276478486466525tmp>
Running org.apache.hadoop.hbase.client.TestScan
Tests run: 2, Failures: 0, Errors: 0, Skipped: 0, Time elapsed: 0.138 sec
Forking command line: /bin/sh -c cd <https://builds.apache.org/job/HBase-0.92/ws/trunk>
&& /home/hudson/tools/java/jdk1.6.0_20-32/jre/bin/java -enableassertions -Xmx1400m
-jar <https://builds.apache.org/job/HBase-0.92/ws/trunk/target/surefire/surefirebooter3924077642495889786.jar>
<https://builds.apache.org/job/HBase-0.92/ws/trunk/target/surefire/surefire5318417648807820716tmp>
<https://builds.apache.org/job/HBase-0.92/ws/trunk/target/surefire/surefire6517483439606961149tmp>
Running org.apache.hadoop.hbase.client.TestAdmin
Tests run: 32, Failures: 0, Errors: 0, Skipped: 0, Time elapsed: 488.998 sec
Forking command line: /bin/sh -c cd <https://builds.apache.org/job/HBase-0.92/ws/trunk>
&& /home/hudson/tools/java/jdk1.6.0_20-32/jre/bin/java -enableassertions -Xmx1400m
-jar <https://builds.apache.org/job/HBase-0.92/ws/trunk/target/surefire/surefirebooter5457196738315898838.jar>
<https://builds.apache.org/job/HBase-0.92/ws/trunk/target/surefire/surefire830426118424703744tmp>
<https://builds.apache.org/job/HBase-0.92/ws/trunk/target/surefire/surefire3350568399111397338tmp>
Running org.apache.hadoop.hbase.client.TestMetaScanner
Tests run: 1, Failures: 0, Errors: 0, Skipped: 0, Time elapsed: 19.528 sec
Forking command line: /bin/sh -c cd <https://builds.apache.org/job/HBase-0.92/ws/trunk>
&& /home/hudson/tools/java/jdk1.6.0_20-32/jre/bin/java -enableassertions -Xmx1400m
-jar <https://builds.apache.org/job/HBase-0.92/ws/trunk/target/surefire/surefirebooter2067556431795824692.jar>
<https://builds.apache.org/job/HBase-0.92/ws/trunk/target/surefire/surefire9054388310802724172tmp>
<https://builds.apache.org/job/HBase-0.92/ws/trunk/target/surefire/surefire7407960928161543934tmp>
Running org.apache.hadoop.hbase.client.TestShell
Tests run: 1, Failures: 0, Errors: 1, Skipped: 0, Time elapsed: 322.138 sec <<< FAILURE!
Forking command line: /bin/sh -c cd <https://builds.apache.org/job/HBase-0.92/ws/trunk>
&& /home/hudson/tools/java/jdk1.6.0_20-32/jre/bin/java -enableassertions -Xmx1400m
-jar <https://builds.apache.org/job/HBase-0.92/ws/trunk/target/surefire/surefirebooter9072704176784874923.jar>
<https://builds.apache.org/job/HBase-0.92/ws/trunk/target/surefire/surefire939501068867516686tmp>
<https://builds.apache.org/job/HBase-0.92/ws/trunk/target/surefire/surefire2379461288699919705tmp>
Running org.apache.hadoop.hbase.client.TestScannerTimeout
Tests run: 4, Failures: 0, Errors: 0, Skipped: 0, Time elapsed: 53.568 sec
Forking command line: /bin/sh -c cd <https://builds.apache.org/job/HBase-0.92/ws/trunk>
&& /home/hudson/tools/java/jdk1.6.0_20-32/jre/bin/java -enableassertions -Xmx1400m
-jar <https://builds.apache.org/job/HBase-0.92/ws/trunk/target/surefire/surefirebooter1573871074650051159.jar>
<https://builds.apache.org/job/HBase-0.92/ws/trunk/target/surefire/surefire3856922720300940336tmp>
<https://builds.apache.org/job/HBase-0.92/ws/trunk/target/surefire/surefire1143856778200869899tmp>
Running org.apache.hadoop.hbase.client.TestOperation
Tests run: 1, Failures: 0, Errors: 0, Skipped: 0, Time elapsed: 0.574 sec
Forking command line: /bin/sh -c cd <https://builds.apache.org/job/HBase-0.92/ws/trunk>
&& /home/hudson/tools/java/jdk1.6.0_20-32/jre/bin/java -enableassertions -Xmx1400m
-jar <https://builds.apache.org/job/HBase-0.92/ws/trunk/target/surefire/surefirebooter3368437151045562015.jar>
<https://builds.apache.org/job/HBase-0.92/ws/trunk/target/surefire/surefire9063423619785056234tmp>
<https://builds.apache.org/job/HBase-0.92/ws/trunk/target/surefire/surefire2852569723006140278tmp>
Running org.apache.hadoop.hbase.client.TestMultiParallel
Tests run: 10, Failures: 0, Errors: 0, Skipped: 0, Time elapsed: 39.54 sec
Forking command line: /bin/sh -c cd <https://builds.apache.org/job/HBase-0.92/ws/trunk>
&& /home/hudson/tools/java/jdk1.6.0_20-32/jre/bin/java -enableassertions -Xmx1400m
-jar <https://builds.apache.org/job/HBase-0.92/ws/trunk/target/surefire/surefirebooter932320108592709961.jar>
<https://builds.apache.org/job/HBase-0.92/ws/trunk/target/surefire/surefire3889816792750929033tmp>
<https://builds.apache.org/job/HBase-0.92/ws/trunk/target/surefire/surefire4374331988152389957tmp>
Running org.apache.hadoop.hbase.TestMultiVersions
Tests run: 3, Failures: 0, Errors: 0, Skipped: 0, Time elapsed: 76.787 sec
Forking command line: /bin/sh -c cd <https://builds.apache.org/job/HBase-0.92/ws/trunk>
&& /home/hudson/tools/java/jdk1.6.0_20-32/jre/bin/java -enableassertions -Xmx1400m
-jar <https://builds.apache.org/job/HBase-0.92/ws/trunk/target/surefire/surefirebooter775017115212064166.jar>
<https://builds.apache.org/job/HBase-0.92/ws/trunk/target/surefire/surefire5511858257794287800tmp>
<https://builds.apache.org/job/HBase-0.92/ws/trunk/target/surefire/surefire5188135783211313618tmp>
Running org.apache.hadoop.hbase.thrift.TestThriftServer
Tests run: 1, Failures: 0, Errors: 0, Skipped: 0, Time elapsed: 124.677 sec
Forking command line: /bin/sh -c cd <https://builds.apache.org/job/HBase-0.92/ws/trunk>
&& /home/hudson/tools/java/jdk1.6.0_20-32/jre/bin/java -enableassertions -Xmx1400m
-jar <https://builds.apache.org/job/HBase-0.92/ws/trunk/target/surefire/surefirebooter816890296186533223.jar>
<https://builds.apache.org/job/HBase-0.92/ws/trunk/target/surefire/surefire7592894240297461798tmp>
<https://builds.apache.org/job/HBase-0.92/ws/trunk/target/surefire/surefire1209601745950263253tmp>
Running org.apache.hadoop.hbase.master.TestRollingRestart
Tests run: 1, Failures: 0, Errors: 0, Skipped: 0, Time elapsed: 278.099 sec
Forking command line: /bin/sh -c cd <https://builds.apache.org/job/HBase-0.92/ws/trunk>
&& /home/hudson/tools/java/jdk1.6.0_20-32/jre/bin/java -enableassertions -Xmx1400m
-jar <https://builds.apache.org/job/HBase-0.92/ws/trunk/target/surefire/surefirebooter3414358561188475866.jar>
<https://builds.apache.org/job/HBase-0.92/ws/trunk/target/surefire/surefire6710078713303121615tmp>
<https://builds.apache.org/job/HBase-0.92/ws/trunk/target/surefire/surefire869548238852336307tmp>
Running org.apache.hadoop.hbase.master.TestActiveMasterManager
Tests run: 2, Failures: 0, Errors: 0, Skipped: 0, Time elapsed: 1.78 sec
Forking command line: /bin/sh -c cd <https://builds.apache.org/job/HBase-0.92/ws/trunk>
&& /home/hudson/tools/java/jdk1.6.0_20-32/jre/bin/java -enableassertions -Xmx1400m
-jar <https://builds.apache.org/job/HBase-0.92/ws/trunk/target/surefire/surefirebooter803966220210890605.jar>
<https://builds.apache.org/job/HBase-0.92/ws/trunk/target/surefire/surefire8944708312113552920tmp>
<https://builds.apache.org/job/HBase-0.92/ws/trunk/target/surefire/surefire8420217200742095522tmp>
Running org.apache.hadoop.hbase.master.TestDeadServer
Tests run: 1, Failures: 0, Errors: 0, Skipped: 0, Time elapsed: 0.058 sec
Forking command line: /bin/sh -c cd <https://builds.apache.org/job/HBase-0.92/ws/trunk>
&& /home/hudson/tools/java/jdk1.6.0_20-32/jre/bin/java -enableassertions -Xmx1400m
-jar <https://builds.apache.org/job/HBase-0.92/ws/trunk/target/surefire/surefirebooter3226794887727668061.jar>
<https://builds.apache.org/job/HBase-0.92/ws/trunk/target/surefire/surefire8080547300678233877tmp>
<https://builds.apache.org/job/HBase-0.92/ws/trunk/target/surefire/surefire8428523331963690682tmp>
Running org.apache.hadoop.hbase.master.TestLogsCleaner
Tests run: 1, Failures: 0, Errors: 0, Skipped: 0, Time elapsed: 1.549 sec
Forking command line: /bin/sh -c cd <https://builds.apache.org/job/HBase-0.92/ws/trunk>
&& /home/hudson/tools/java/jdk1.6.0_20-32/jre/bin/java -enableassertions -Xmx1400m
-jar <https://builds.apache.org/job/HBase-0.92/ws/trunk/target/surefire/surefirebooter1048661489479135771.jar>
<https://builds.apache.org/job/HBase-0.92/ws/trunk/target/surefire/surefire21442039080043402tmp>
<https://builds.apache.org/job/HBase-0.92/ws/trunk/target/surefire/surefire2317963348839739778tmp>
Running org.apache.hadoop.hbase.master.TestZKBasedOpenCloseRegion
Tests run: 3, Failures: 0, Errors: 0, Skipped: 0, Time elapsed: 29.904 sec
Forking command line: /bin/sh -c cd <https://builds.apache.org/job/HBase-0.92/ws/trunk>
&& /home/hudson/tools/java/jdk1.6.0_20-32/jre/bin/java -enableassertions -Xmx1400m
-jar <https://builds.apache.org/job/HBase-0.92/ws/trunk/target/surefire/surefirebooter8169497243838012675.jar>
<https://builds.apache.org/job/HBase-0.92/ws/trunk/target/surefire/surefire706086425096003300tmp>
<https://builds.apache.org/job/HBase-0.92/ws/trunk/target/surefire/surefire5295332814338741051tmp>
Running org.apache.hadoop.hbase.master.TestMaster
Tests run: 1, Failures: 0, Errors: 0, Skipped: 0, Time elapsed: 101.748 sec
Forking command line: /bin/sh -c cd <https://builds.apache.org/job/HBase-0.92/ws/trunk>
&& /home/hudson/tools/java/jdk1.6.0_20-32/jre/bin/java -enableassertions -Xmx1400m
-jar <https://builds.apache.org/job/HBase-0.92/ws/trunk/target/surefire/surefirebooter877548544043165402.jar>
<https://builds.apache.org/job/HBase-0.92/ws/trunk/target/surefire/surefire7480627661967465288tmp>
<https://builds.apache.org/job/HBase-0.92/ws/trunk/target/surefire/surefire4533588174448001241tmp>
Running org.apache.hadoop.hbase.master.TestMasterTransitions
Tests run: 3, Failures: 0, Errors: 0, Skipped: 3, Time elapsed: 81.5 sec
Forking command line: /bin/sh -c cd <https://builds.apache.org/job/HBase-0.92/ws/trunk>
&& /home/hudson/tools/java/jdk1.6.0_20-32/jre/bin/java -enableassertions -Xmx1400m
-jar <https://builds.apache.org/job/HBase-0.92/ws/trunk/target/surefire/surefirebooter1327914288646640436.jar>
<https://builds.apache.org/job/HBase-0.92/ws/trunk/target/surefire/surefire5900453634541628190tmp>
<https://builds.apache.org/job/HBase-0.92/ws/trunk/target/surefire/surefire6393855160733870927tmp>
Running org.apache.hadoop.hbase.master.TestOpenedRegionHandler
Tests run: 2, Failures: 0, Errors: 0, Skipped: 0, Time elapsed: 146.471 sec
Forking command line: /bin/sh -c cd <https://builds.apache.org/job/HBase-0.92/ws/trunk>
&& /home/hudson/tools/java/jdk1.6.0_20-32/jre/bin/java -enableassertions -Xmx1400m
-jar <https://builds.apache.org/job/HBase-0.92/ws/trunk/target/surefire/surefirebooter2265442111889837724.jar>
<https://builds.apache.org/job/HBase-0.92/ws/trunk/target/surefire/surefire2972173068783983137tmp>
<https://builds.apache.org/job/HBase-0.92/ws/trunk/target/surefire/surefire3067916345554404607tmp>
Running org.apache.hadoop.hbase.master.TestClockSkewDetection
Tests run: 1, Failures: 0, Errors: 0, Skipped: 0, Time elapsed: 0.237 sec
Forking command line: /bin/sh -c cd <https://builds.apache.org/job/HBase-0.92/ws/trunk>
&& /home/hudson/tools/java/jdk1.6.0_20-32/jre/bin/java -enableassertions -Xmx1400m
-jar <https://builds.apache.org/job/HBase-0.92/ws/trunk/target/surefire/surefirebooter926923082105205.jar>
<https://builds.apache.org/job/HBase-0.92/ws/trunk/target/surefire/surefire7651925445427403308tmp>
<https://builds.apache.org/job/HBase-0.92/ws/trunk/target/surefire/surefire526121593396442207tmp>
Running org.apache.hadoop.hbase.master.TestCatalogJanitor
Tests run: 3, Failures: 0, Errors: 0, Skipped: 0, Time elapsed: 4.359 sec
Forking command line: /bin/sh -c cd <https://builds.apache.org/job/HBase-0.92/ws/trunk>
&& /home/hudson/tools/java/jdk1.6.0_20-32/jre/bin/java -enableassertions -Xmx1400m
-jar <https://builds.apache.org/job/HBase-0.92/ws/trunk/target/surefire/surefirebooter3574680747371405136.jar>
<https://builds.apache.org/job/HBase-0.92/ws/trunk/target/surefire/surefire8321970351912815203tmp>
<https://builds.apache.org/job/HBase-0.92/ws/trunk/target/surefire/surefire6220044930977712812tmp>
Running org.apache.hadoop.hbase.master.TestSplitLogManager
Tests run: 10, Failures: 0, Errors: 0, Skipped: 0, Time elapsed: 15.173 sec
Forking command line: /bin/sh -c cd <https://builds.apache.org/job/HBase-0.92/ws/trunk>
&& /home/hudson/tools/java/jdk1.6.0_20-32/jre/bin/java -enableassertions -Xmx1400m
-jar <https://builds.apache.org/job/HBase-0.92/ws/trunk/target/surefire/surefirebooter8914846234971649396.jar>
<https://builds.apache.org/job/HBase-0.92/ws/trunk/target/surefire/surefire6708812632969931705tmp>
<https://builds.apache.org/job/HBase-0.92/ws/trunk/target/surefire/surefire3949632546501285227tmp>
Running org.apache.hadoop.hbase.master.TestMasterRestartAfterDisablingTable
Tests run: 1, Failures: 0, Errors: 0, Skipped: 0, Time elapsed: 26.116 sec
Forking command line: /bin/sh -c cd <https://builds.apache.org/job/HBase-0.92/ws/trunk>
&& /home/hudson/tools/java/jdk1.6.0_20-32/jre/bin/java -enableassertions -Xmx1400m
-jar <https://builds.apache.org/job/HBase-0.92/ws/trunk/target/surefire/surefirebooter6467179146482421184.jar>
<https://builds.apache.org/job/HBase-0.92/ws/trunk/target/surefire/surefire718311421023710975tmp>
<https://builds.apache.org/job/HBase-0.92/ws/trunk/target/surefire/surefire419996174361365827tmp>
Running org.apache.hadoop.hbase.master.TestDistributedLogSplitting
Tests run: 4, Failures: 0, Errors: 0, Skipped: 0, Time elapsed: 244.054 sec
Forking command line: /bin/sh -c cd <https://builds.apache.org/job/HBase-0.92/ws/trunk>
&& /home/hudson/tools/java/jdk1.6.0_20-32/jre/bin/java -enableassertions -Xmx1400m
-jar <https://builds.apache.org/job/HBase-0.92/ws/trunk/target/surefire/surefirebooter6693606045987045812.jar>
<https://builds.apache.org/job/HBase-0.92/ws/trunk/target/surefire/surefire1699284122915947574tmp>
<https://builds.apache.org/job/HBase-0.92/ws/trunk/target/surefire/surefire9065558492806033575tmp>
Running org.apache.hadoop.hbase.master.TestDefaultLoadBalancer
Tests run: 4, Failures: 0, Errors: 0, Skipped: 0, Time elapsed: 1.583 sec
Forking command line: /bin/sh -c cd <https://builds.apache.org/job/HBase-0.92/ws/trunk>
&& /home/hudson/tools/java/jdk1.6.0_20-32/jre/bin/java -enableassertions -Xmx1400m
-jar <https://builds.apache.org/job/HBase-0.92/ws/trunk/target/surefire/surefirebooter7826057136564420945.jar>
<https://builds.apache.org/job/HBase-0.92/ws/trunk/target/surefire/surefire7270992425536996385tmp>
<https://builds.apache.org/job/HBase-0.92/ws/trunk/target/surefire/surefire6079903745426132202tmp>
Running org.apache.hadoop.hbase.master.TestMasterStatusServlet
Tests run: 5, Failures: 0, Errors: 0, Skipped: 0, Time elapsed: 1.041 sec
Forking command line: /bin/sh -c cd <https://builds.apache.org/job/HBase-0.92/ws/trunk>
&& /home/hudson/tools/java/jdk1.6.0_20-32/jre/bin/java -enableassertions -Xmx1400m
-jar <https://builds.apache.org/job/HBase-0.92/ws/trunk/target/surefire/surefirebooter7153251288654638976.jar>
<https://builds.apache.org/job/HBase-0.92/ws/trunk/target/surefire/surefire8111512635626149648tmp>
<https://builds.apache.org/job/HBase-0.92/ws/trunk/target/surefire/surefire3823942474662694055tmp>
Running org.apache.hadoop.hbase.master.TestHMasterRPCException
Tests run: 1, Failures: 0, Errors: 0, Skipped: 0, Time elapsed: 1.684 sec
Forking command line: /bin/sh -c cd <https://builds.apache.org/job/HBase-0.92/ws/trunk>
&& /home/hudson/tools/java/jdk1.6.0_20-32/jre/bin/java -enableassertions -Xmx1400m
-jar <https://builds.apache.org/job/HBase-0.92/ws/trunk/target/surefire/surefirebooter4963777805584262353.jar>
<https://builds.apache.org/job/HBase-0.92/ws/trunk/target/surefire/surefire1791055538037104217tmp>
<https://builds.apache.org/job/HBase-0.92/ws/trunk/target/surefire/surefire3714538346225277799tmp>
Running org.apache.hadoop.hbase.master.TestMasterFailover
Tests run: 4, Failures: 0, Errors: 0, Skipped: 0, Time elapsed: 141.473 sec
Forking command line: /bin/sh -c cd <https://builds.apache.org/job/HBase-0.92/ws/trunk>
&& /home/hudson/tools/java/jdk1.6.0_20-32/jre/bin/java -enableassertions -Xmx1400m
-jar <https://builds.apache.org/job/HBase-0.92/ws/trunk/target/surefire/surefirebooter4455334324179509911.jar>
<https://builds.apache.org/job/HBase-0.92/ws/trunk/target/surefire/surefire4868183614189252460tmp>
<https://builds.apache.org/job/HBase-0.92/ws/trunk/target/surefire/surefire7376261520496190638tmp>
Running org.apache.hadoop.hbase.master.TestRestartCluster
Tests run: 2, Failures: 0, Errors: 0, Skipped: 0, Time elapsed: 62.207 sec
Forking command line: /bin/sh -c cd <https://builds.apache.org/job/HBase-0.92/ws/trunk>
&& /home/hudson/tools/java/jdk1.6.0_20-32/jre/bin/java -enableassertions -Xmx1400m
-jar <https://builds.apache.org/job/HBase-0.92/ws/trunk/target/surefire/surefirebooter7070507156457362959.jar>
<https://builds.apache.org/job/HBase-0.92/ws/trunk/target/surefire/surefire7722346838984221074tmp>
<https://builds.apache.org/job/HBase-0.92/ws/trunk/target/surefire/surefire6834812163839256847tmp>
Running org.apache.hadoop.hbase.TestRegionRebalancing
Tests run: 1, Failures: 0, Errors: 0, Skipped: 0, Time elapsed: 67.541 sec
Forking command line: /bin/sh -c cd <https://builds.apache.org/job/HBase-0.92/ws/trunk>
&& /home/hudson/tools/java/jdk1.6.0_20-32/jre/bin/java -enableassertions -Xmx1400m
-jar <https://builds.apache.org/job/HBase-0.92/ws/trunk/target/surefire/surefirebooter5238136901365067572.jar>
<https://builds.apache.org/job/HBase-0.92/ws/trunk/target/surefire/surefire4205609898991839990tmp>
<https://builds.apache.org/job/HBase-0.92/ws/trunk/target/surefire/surefire3777354320313555123tmp>
Running org.apache.hadoop.hbase.avro.TestAvroUtil
Tests run: 1, Failures: 0, Errors: 0, Skipped: 0, Time elapsed: 0.744 sec
Forking command line: /bin/sh -c cd <https://builds.apache.org/job/HBase-0.92/ws/trunk>
&& /home/hudson/tools/java/jdk1.6.0_20-32/jre/bin/java -enableassertions -Xmx1400m
-jar <https://builds.apache.org/job/HBase-0.92/ws/trunk/target/surefire/surefirebooter2754724558317374093.jar>
<https://builds.apache.org/job/HBase-0.92/ws/trunk/target/surefire/surefire7842718775511754370tmp>
<https://builds.apache.org/job/HBase-0.92/ws/trunk/target/surefire/surefire4985346255714977267tmp>
Running org.apache.hadoop.hbase.avro.TestAvroServer
Tests run: 3, Failures: 1, Errors: 2, Skipped: 0, Time elapsed: 25.61 sec <<< FAILURE!
Forking command line: /bin/sh -c cd <https://builds.apache.org/job/HBase-0.92/ws/trunk>
&& /home/hudson/tools/java/jdk1.6.0_20-32/jre/bin/java -enableassertions -Xmx1400m
-jar <https://builds.apache.org/job/HBase-0.92/ws/trunk/target/surefire/surefirebooter7064825742706246493.jar>
<https://builds.apache.org/job/HBase-0.92/ws/trunk/target/surefire/surefire9215591396626191477tmp>
<https://builds.apache.org/job/HBase-0.92/ws/trunk/target/surefire/surefire8910794143569050360tmp>
Running org.apache.hadoop.hbase.TestAcidGuarantees
Tests run: 3, Failures: 0, Errors: 0, Skipped: 3, Time elapsed: 0.078 sec
Forking command line: /bin/sh -c cd <https://builds.apache.org/job/HBase-0.92/ws/trunk>
&& /home/hudson/tools/java/jdk1.6.0_20-32/jre/bin/java -enableassertions -Xmx1400m
-jar <https://builds.apache.org/job/HBase-0.92/ws/trunk/target/surefire/surefirebooter3453197720853975139.jar>
<https://builds.apache.org/job/HBase-0.92/ws/trunk/target/surefire/surefire5785232126726593093tmp>
<https://builds.apache.org/job/HBase-0.92/ws/trunk/target/surefire/surefire8223948692764096442tmp>
Running org.apache.hadoop.hbase.TestHRegionLocation
Tests run: 3, Failures: 0, Errors: 0, Skipped: 0, Time elapsed: 0.141 sec
Forking command line: /bin/sh -c cd <https://builds.apache.org/job/HBase-0.92/ws/trunk>
&& /home/hudson/tools/java/jdk1.6.0_20-32/jre/bin/java -enableassertions -Xmx1400m
-jar <https://builds.apache.org/job/HBase-0.92/ws/trunk/target/surefire/surefirebooter1824130694619145050.jar>
<https://builds.apache.org/job/HBase-0.92/ws/trunk/target/surefire/surefire2622002015250285198tmp>
<https://builds.apache.org/job/HBase-0.92/ws/trunk/target/surefire/surefire1032744949101158865tmp>
Running org.apache.hadoop.hbase.TestZooKeeper
Tests run: 7, Failures: 0, Errors: 0, Skipped: 0, Time elapsed: 90.707 sec
Forking command line: /bin/sh -c cd <https://builds.apache.org/job/HBase-0.92/ws/trunk>
&& /home/hudson/tools/java/jdk1.6.0_20-32/jre/bin/java -enableassertions -Xmx1400m
-jar <https://builds.apache.org/job/HBase-0.92/ws/trunk/target/surefire/surefirebooter1052738437804732045.jar>
<https://builds.apache.org/job/HBase-0.92/ws/trunk/target/surefire/surefire7753863128895777306tmp>
<https://builds.apache.org/job/HBase-0.92/ws/trunk/target/surefire/surefire8722654362445058656tmp>
Running org.apache.hadoop.hbase.TestCompare
Tests run: 1, Failures: 0, Errors: 0, Skipped: 0, Time elapsed: 0.235 sec
Forking command line: /bin/sh -c cd <https://builds.apache.org/job/HBase-0.92/ws/trunk>
&& /home/hudson/tools/java/jdk1.6.0_20-32/jre/bin/java -enableassertions -Xmx1400m
-jar <https://builds.apache.org/job/HBase-0.92/ws/trunk/target/surefire/surefirebooter5824516741124987297.jar>
<https://builds.apache.org/job/HBase-0.92/ws/trunk/target/surefire/surefire5779834025591066837tmp>
<https://builds.apache.org/job/HBase-0.92/ws/trunk/target/surefire/surefire5515035104356872906tmp>
Running org.apache.hadoop.hbase.ipc.TestDelayedRpc
Tests run: 4, Failures: 0, Errors: 0, Skipped: 0, Time elapsed: 2.508 sec
Forking command line: /bin/sh -c cd <https://builds.apache.org/job/HBase-0.92/ws/trunk>
&& /home/hudson/tools/java/jdk1.6.0_20-32/jre/bin/java -enableassertions -Xmx1400m
-jar <https://builds.apache.org/job/HBase-0.92/ws/trunk/target/surefire/surefirebooter4460843538702915761.jar>
<https://builds.apache.org/job/HBase-0.92/ws/trunk/target/surefire/surefire7528522899500247499tmp>
<https://builds.apache.org/job/HBase-0.92/ws/trunk/target/surefire/surefire4018599030805033391tmp>
Running org.apache.hadoop.hbase.TestFSTableDescriptorForceCreation
Tests run: 3, Failures: 0, Errors: 0, Skipped: 0, Time elapsed: 15.466 sec
Forking command line: /bin/sh -c cd <https://builds.apache.org/job/HBase-0.92/ws/trunk>
&& /home/hudson/tools/java/jdk1.6.0_20-32/jre/bin/java -enableassertions -Xmx1400m
-jar <https://builds.apache.org/job/HBase-0.92/ws/trunk/target/surefire/surefirebooter3269012668340989133.jar>
<https://builds.apache.org/job/HBase-0.92/ws/trunk/target/surefire/surefire8853601639071638871tmp>
<https://builds.apache.org/job/HBase-0.92/ws/trunk/target/surefire/surefire1838674546277019890tmp>
Running org.apache.hadoop.hbase.TestInfoServers
Tests run: 2, Failures: 0, Errors: 0, Skipped: 0, Time elapsed: 41.296 sec

Results :

Failed tests:   testTableAdminAndMetadata(org.apache.hadoop.hbase.avro.TestAvroServer)

Tests in error: 
  testRunShellTests(org.apache.hadoop.hbase.client.TestShell): (RuntimeError) Shell unit tests
failed. Check output file for details.
  testFamilyAdminAndMetadata(org.apache.hadoop.hbase.avro.TestAvroServer)
  testDML(org.apache.hadoop.hbase.avro.TestAvroServer)

Tests run: 1022, Failures: 1, Errors: 3, Skipped: 9

[INFO] ------------------------------------------------------------------------
[INFO] BUILD FAILURE
[INFO] ------------------------------------------------------------------------
[INFO] Total time: 2:26:40.741s
[INFO] Finished at: Thu Oct 13 07:51:00 UTC 2011
[INFO] Final Memory: 29M/381M
[INFO] ------------------------------------------------------------------------
[ERROR] Failed to execute goal org.apache.maven.plugins:maven-surefire-plugin:2.9:test (default-test)
on project hbase: There are test failures.
[ERROR] 
[ERROR] Please refer to <https://builds.apache.org/job/HBase-0.92/ws/trunk/target/surefire-reports>
for the individual test results.
[ERROR] -> [Help 1]
org.apache.maven.lifecycle.LifecycleExecutionException: Failed to execute goal org.apache.maven.plugins:maven-surefire-plugin:2.9:test
(default-test) on project hbase: There are test failures.

Please refer to <https://builds.apache.org/job/HBase-0.92/ws/trunk/target/surefire-reports>
for the individual test results.
	at org.apache.maven.lifecycle.internal.MojoExecutor.execute(MojoExecutor.java:213)
	at org.apache.maven.lifecycle.internal.MojoExecutor.execute(MojoExecutor.java:153)
	at org.apache.maven.lifecycle.internal.MojoExecutor.execute(MojoExecutor.java:145)
	at org.apache.maven.lifecycle.internal.MojoExecutor.executeForkedExecutions(MojoExecutor.java:365)
	at org.apache.maven.lifecycle.internal.MojoExecutor.execute(MojoExecutor.java:199)
	at org.apache.maven.lifecycle.internal.MojoExecutor.execute(MojoExecutor.java:153)
	at org.apache.maven.lifecycle.internal.MojoExecutor.execute(MojoExecutor.java:145)
	at org.apache.maven.lifecycle.internal.LifecycleModuleBuilder.buildProject(LifecycleModuleBuilder.java:84)
	at org.apache.maven.lifecycle.internal.LifecycleModuleBuilder.buildProject(LifecycleModuleBuilder.java:59)
	at org.apache.maven.lifecycle.internal.LifecycleStarter.singleThreadedBuild(LifecycleStarter.java:183)
	at org.apache.maven.lifecycle.internal.LifecycleStarter.execute(LifecycleStarter.java:161)
	at org.apache.maven.DefaultMaven.doExecute(DefaultMaven.java:319)
	at org.apache.maven.DefaultMaven.execute(DefaultMaven.java:156)
	at org.apache.maven.cli.MavenCli.execute(MavenCli.java:537)
	at org.apache.maven.cli.MavenCli.doMain(MavenCli.java:196)
	at org.apache.maven.cli.MavenCli.main(MavenCli.java:141)
	at sun.reflect.NativeMethodAccessorImpl.invoke0(Native Method)
	at sun.reflect.NativeMethodAccessorImpl.invoke(NativeMethodAccessorImpl.java:39)
	at sun.reflect.DelegatingMethodAccessorImpl.invoke(DelegatingMethodAccessorImpl.java:25)
	at java.lang.reflect.Method.invoke(Method.java:597)
	at org.codehaus.plexus.classworlds.launcher.Launcher.launchEnhanced(Launcher.java:290)
	at org.codehaus.plexus.classworlds.launcher.Launcher.launch(Launcher.java:230)
	at org.codehaus.plexus.classworlds.launcher.Launcher.mainWithExitCode(Launcher.java:409)
	at org.codehaus.plexus.classworlds.launcher.Launcher.main(Launcher.java:352)
Caused by: org.apache.maven.plugin.MojoFailureException: There are test failures.

Please refer to <https://builds.apache.org/job/HBase-0.92/ws/trunk/target/surefire-reports>
for the individual test results.
	at org.apache.maven.plugin.surefire.SurefireHelper.reportExecution(SurefireHelper.java:87)
	at org.apache.maven.plugin.surefire.SurefirePlugin.writeSummary(SurefirePlugin.java:631)
	at org.apache.maven.plugin.surefire.SurefirePlugin.handleSummary(SurefirePlugin.java:605)
	at org.apache.maven.plugin.surefire.AbstractSurefireMojo.executeAfterPreconditionsChecked(AbstractSurefireMojo.java:136)
	at org.apache.maven.plugin.surefire.AbstractSurefireMojo.execute(AbstractSurefireMojo.java:97)
	at org.apache.maven.plugin.DefaultBuildPluginManager.executeMojo(DefaultBuildPluginManager.java:101)
	at org.apache.maven.lifecycle.internal.MojoExecutor.execute(MojoExecutor.java:209)
	... 23 more
[ERROR] 
[ERROR] 
[ERROR] For more information about the errors and possible solutions, please read the following
articles:
[ERROR] [Help 1] http://cwiki.apache.org/confluence/display/MAVEN/MojoFailureException
Build step 'Invoke top-level Maven targets' marked build as failure
[locks-and-latches] Releasing all the locks
[locks-and-latches] All the locks released
Archiving artifacts
Recording test results


Mime
View raw message