hbase-dev mailing list archives

Site index · List index
Message view « Date » · « Thread »
Top « Date » · « Thread »
From Apache Jenkins Server <jenk...@builds.apache.org>
Subject Build failed in Jenkins: HBase-TRUNK-on-Hadoop-23 #44
Date Sat, 01 Oct 2011 02:04:24 GMT
See <https://builds.apache.org/job/HBase-TRUNK-on-Hadoop-23/44/changes>

Changes:

[Gary Helmling] HBASE-4515  User.getCurrent() can fail to initialize the current user

[stack] HBASE-4517 Document new replication features in 0.92

[stack] HBASE-4517 Document new replication features in 0.92

[stack] HBASE-4209 The HBase hbase-daemon.sh SIGKILLs master when stopping it

[stack] Hhbase-4503 Purge deprecated HBaseClusterTestCase

[stack] HBASE-4476 Compactions must fail if column tracker gets columns out of order

[tedyu] HBASE-4487  The increment operation can release the rowlock before sync-ing
               the Hlog (dhruba borthakur)

[tedyu] HBASE-2794  Utilize ROWCOL bloom filter if multiple columns within same family
               are requested in a Get (Mikhail Bautin)

[tedyu] HBASE-4145 Provide metrics for hbase client, add ScanMetrics.java

[tedyu] HBASE-4145  Provide metrics for hbase client (Ming Ma)

[tedyu] HBASE-4412  No need to retry scan operation on the same server in case of
               RegionServerStoppedException (Ming Ma)

[tedyu] HBASE-4212  TestMasterFailover fails occasionally (Gao Jinchao)

------------------------------------------
[...truncated 1246 lines...]
[INFO] ------------------------------------------------------------------------
[INFO] Building HBase 0.93-SNAPSHOT
[INFO] ------------------------------------------------------------------------
[WARNING] The POM for javax.jms:jms:jar:1.1 is invalid, transitive dependencies (if any) will
not be available, enable debug logging for more details
[WARNING] The POM for com.sun.jdmk:jmxtools:jar:1.2.1 is invalid, transitive dependencies
(if any) will not be available, enable debug logging for more details
[WARNING] The POM for com.sun.jmx:jmxri:jar:1.2.1 is invalid, transitive dependencies (if
any) will not be available, enable debug logging for more details
Downloading: http://repository.apache.org/snapshots/org/apache/hadoop/hadoop-common/0.23.0-SNAPSHOT/maven-metadata.xml
Downloading: https://repository.apache.org/content/repositories/releases/org/apache/hadoop/hadoop-common/0.23.0-SNAPSHOT/maven-metadata.xml
2 KB   
       
Downloaded: http://repository.apache.org/snapshots/org/apache/hadoop/hadoop-common/0.23.0-SNAPSHOT/maven-metadata.xml
(2 KB at 8.5 KB/sec)
       
Downloading: https://repository.apache.org/content/repositories/releases/org/apache/hadoop/hadoop-project-dist/0.23.0-SNAPSHOT/maven-metadata.xml
Downloading: http://repository.apache.org/snapshots/org/apache/hadoop/hadoop-project-dist/0.23.0-SNAPSHOT/maven-metadata.xml
831 B   
        
Downloaded: http://repository.apache.org/snapshots/org/apache/hadoop/hadoop-project-dist/0.23.0-SNAPSHOT/maven-metadata.xml
(831 B at 7.1 KB/sec)
        
Downloading: https://repository.apache.org/content/repositories/releases/org/apache/hadoop/hadoop-project/0.23.0-SNAPSHOT/maven-metadata.xml
Downloading: http://repository.apache.org/snapshots/org/apache/hadoop/hadoop-project/0.23.0-SNAPSHOT/maven-metadata.xml
612 B   
        
Downloaded: http://repository.apache.org/snapshots/org/apache/hadoop/hadoop-project/0.23.0-SNAPSHOT/maven-metadata.xml
(612 B at 7.1 KB/sec)
        
Downloading: https://repository.apache.org/content/repositories/releases/org/apache/hadoop/hadoop-auth/0.23.0-SNAPSHOT/maven-metadata.xml
Downloading: http://repository.apache.org/snapshots/org/apache/hadoop/hadoop-auth/0.23.0-SNAPSHOT/maven-metadata.xml
Downloading: https://repository.apache.org/content/repositories/snapshots/org/apache/hadoop/hadoop-auth/0.23.0-SNAPSHOT/maven-metadata.xml
996 B   
        
Downloaded: http://repository.apache.org/snapshots/org/apache/hadoop/hadoop-auth/0.23.0-SNAPSHOT/maven-metadata.xml
(996 B at 10.6 KB/sec)
        
996 B   
        
Downloaded: https://repository.apache.org/content/repositories/snapshots/org/apache/hadoop/hadoop-auth/0.23.0-SNAPSHOT/maven-metadata.xml
(996 B at 4.6 KB/sec)
Downloading: https://repository.apache.org/content/repositories/releases/org/apache/hadoop/hadoop-annotations/0.23.0-SNAPSHOT/maven-metadata.xml
Downloading: http://repository.apache.org/snapshots/org/apache/hadoop/hadoop-annotations/0.23.0-SNAPSHOT/maven-metadata.xml
        
791 B   
        
Downloaded: http://repository.apache.org/snapshots/org/apache/hadoop/hadoop-annotations/0.23.0-SNAPSHOT/maven-metadata.xml
(791 B at 7.4 KB/sec)
Downloading: https://repository.apache.org/content/repositories/releases/org/apache/hadoop/hadoop-hdfs/0.23.0-SNAPSHOT/maven-metadata.xml
Downloading: http://repository.apache.org/snapshots/org/apache/hadoop/hadoop-hdfs/0.23.0-SNAPSHOT/maven-metadata.xml
2 KB    
       
Downloaded: http://repository.apache.org/snapshots/org/apache/hadoop/hadoop-hdfs/0.23.0-SNAPSHOT/maven-metadata.xml
(2 KB at 15.0 KB/sec)
       
Downloading: https://repository.apache.org/content/repositories/releases/org/apache/hadoop/hadoop-mapred/0.23.0-SNAPSHOT/maven-metadata.xml
Downloading: http://repository.apache.org/snapshots/org/apache/hadoop/hadoop-mapred/0.23.0-SNAPSHOT/maven-metadata.xml
       
1006 B   
         
Downloaded: http://repository.apache.org/snapshots/org/apache/hadoop/hadoop-mapred/0.23.0-SNAPSHOT/maven-metadata.xml
(1006 B at 4.5 KB/sec)
Downloading: http://repository.apache.org/snapshots/org/apache/hadoop/hadoop-common-test/0.23.0-SNAPSHOT/maven-metadata.xml
Downloading: https://repository.apache.org/content/repositories/releases/org/apache/hadoop/hadoop-common-test/0.23.0-SNAPSHOT/maven-metadata.xml
         
1011 B   
         
Downloaded: http://repository.apache.org/snapshots/org/apache/hadoop/hadoop-common-test/0.23.0-SNAPSHOT/maven-metadata.xml
(1011 B at 4.1 KB/sec)
Downloading: https://repository.apache.org/content/repositories/releases/org/apache/hadoop/hadoop-hdfs-test/0.23.0-SNAPSHOT/maven-metadata.xml
Downloading: http://repository.apache.org/snapshots/org/apache/hadoop/hadoop-hdfs-test/0.23.0-SNAPSHOT/maven-metadata.xml
         
1009 B   
         
Downloaded: http://repository.apache.org/snapshots/org/apache/hadoop/hadoop-hdfs-test/0.23.0-SNAPSHOT/maven-metadata.xml
(1009 B at 2.8 KB/sec)
Downloading: http://repository.apache.org/snapshots/org/apache/hadoop/hadoop-mapred-test/0.23.0-SNAPSHOT/maven-metadata.xml
Downloading: https://repository.apache.org/content/repositories/releases/org/apache/hadoop/hadoop-mapred-test/0.23.0-SNAPSHOT/maven-metadata.xml
         
1011 B   
         
Downloaded: http://repository.apache.org/snapshots/org/apache/hadoop/hadoop-mapred-test/0.23.0-SNAPSHOT/maven-metadata.xml
(1011 B at 1.5 KB/sec)
[INFO] 
[INFO] --- maven-clean-plugin:2.4.1:clean (default-clean) @ hbase ---
[INFO] 
[INFO] --- xml-maven-plugin:1.0-beta-3:transform (default) @ hbase ---
[INFO] Transforming file: <https://builds.apache.org/job/HBase-TRUNK-on-Hadoop-23/ws/trunk/src/main/resources/hbase-default.xml>
[INFO] Transformed 1 file(s).
[INFO] 
[INFO] --- docbkx-maven-plugin:2.0.11:generate-html (multipage) @ hbase ---
[INFO] Processing input file: ops_mgt.xml
[INFO] <https://builds.apache.org/job/HBase-TRUNK-on-Hadoop-23/ws/trunk/target/site/book/ops_mgt.html>
has been generated.
[INFO] Processing input file: troubleshooting.xml
[INFO] <https://builds.apache.org/job/HBase-TRUNK-on-Hadoop-23/ws/trunk/target/site/book/troubleshooting.html>
has been generated.
[INFO] Processing input file: configuration.xml
[INFO] <https://builds.apache.org/job/HBase-TRUNK-on-Hadoop-23/ws/trunk/target/site/book/configuration.html>
has been generated.
[INFO] Processing input file: getting_started.xml
[INFO] <https://builds.apache.org/job/HBase-TRUNK-on-Hadoop-23/ws/trunk/target/site/book/getting_started.html>
has been generated.
[INFO] Processing input file: book.xml
[INFO] <https://builds.apache.org/job/HBase-TRUNK-on-Hadoop-23/ws/trunk/target/site/book/book.html>
has been generated.
[INFO] <https://builds.apache.org/job/HBase-TRUNK-on-Hadoop-23/ws/trunk/target/site/book/shell.html>
is up to date.
[INFO] <https://builds.apache.org/job/HBase-TRUNK-on-Hadoop-23/ws/trunk/target/site/book/performance.html>
is up to date.
[INFO] <https://builds.apache.org/job/HBase-TRUNK-on-Hadoop-23/ws/trunk/target/site/book/upgrading.html>
is up to date.
[INFO] <https://builds.apache.org/job/HBase-TRUNK-on-Hadoop-23/ws/trunk/target/site/book/external_apis.html>
is up to date.
[INFO] <https://builds.apache.org/job/HBase-TRUNK-on-Hadoop-23/ws/trunk/target/site/book/preface.html>
is up to date.
[INFO] <https://builds.apache.org/job/HBase-TRUNK-on-Hadoop-23/ws/trunk/target/site/book/build.html>
is up to date.
[INFO] <https://builds.apache.org/job/HBase-TRUNK-on-Hadoop-23/ws/trunk/target/site/book/developer.html>
is up to date.
[INFO] 
[INFO] --- docbkx-maven-plugin:2.0.11:generate-html (onepage) @ hbase ---
[INFO] Processing input file: ops_mgt.xml
[INFO] <https://builds.apache.org/job/HBase-TRUNK-on-Hadoop-23/44/artifact/trunk/target/site/ops_mgt.html>
has been generated.
[INFO] Processing input file: troubleshooting.xml
[INFO] <https://builds.apache.org/job/HBase-TRUNK-on-Hadoop-23/44/artifact/trunk/target/site/troubleshooting.html>
has been generated.
[INFO] Processing input file: configuration.xml
[INFO] <https://builds.apache.org/job/HBase-TRUNK-on-Hadoop-23/44/artifact/trunk/target/site/configuration.html>
has been generated.
[INFO] Processing input file: getting_started.xml
[INFO] <https://builds.apache.org/job/HBase-TRUNK-on-Hadoop-23/44/artifact/trunk/target/site/getting_started.html>
has been generated.
[INFO] Processing input file: book.xml
[INFO] <https://builds.apache.org/job/HBase-TRUNK-on-Hadoop-23/44/artifact/trunk/target/site/book.html>
has been generated.
[INFO] Processing input file: shell.xml
[INFO] <https://builds.apache.org/job/HBase-TRUNK-on-Hadoop-23/44/artifact/trunk/target/site/shell.html>
has been generated.
[INFO] Processing input file: performance.xml
[INFO] <https://builds.apache.org/job/HBase-TRUNK-on-Hadoop-23/44/artifact/trunk/target/site/performance.html>
has been generated.
[INFO] Processing input file: upgrading.xml
[INFO] <https://builds.apache.org/job/HBase-TRUNK-on-Hadoop-23/44/artifact/trunk/target/site/upgrading.html>
has been generated.
[INFO] Processing input file: external_apis.xml
[INFO] <https://builds.apache.org/job/HBase-TRUNK-on-Hadoop-23/44/artifact/trunk/target/site/external_apis.html>
has been generated.
[INFO] Processing input file: preface.xml
[INFO] <https://builds.apache.org/job/HBase-TRUNK-on-Hadoop-23/44/artifact/trunk/target/site/preface.html>
has been generated.
[INFO] Processing input file: build.xml
[INFO] <https://builds.apache.org/job/HBase-TRUNK-on-Hadoop-23/44/artifact/trunk/target/site/build.html>
has been generated.
[INFO] Processing input file: developer.xml
[INFO] <https://builds.apache.org/job/HBase-TRUNK-on-Hadoop-23/44/artifact/trunk/target/site/developer.html>
has been generated.
[INFO] 
[INFO] --- maven-site-plugin:2.0.1:site (default-site) @ hbase ---
[INFO] Unable to load parent project from a relative path: 1 problem was encountered while
building the effective model
[FATAL] Non-readable POM <https://builds.apache.org/job/HBase-TRUNK-on-Hadoop-23/ws/pom.xml>:
<https://builds.apache.org/job/HBase-TRUNK-on-Hadoop-23/ws/pom.xml> (No such file or
directory) @ 
 for project  at <https://builds.apache.org/job/HBase-TRUNK-on-Hadoop-23/ws/pom.xml>
for project  at <https://builds.apache.org/job/HBase-TRUNK-on-Hadoop-23/ws/pom.xml>
[INFO] Parent project loaded from repository.
[INFO] Unable to load parent project from a relative path: 1 problem was encountered while
building the effective model
[FATAL] Non-readable POM <https://builds.apache.org/job/HBase-TRUNK-on-Hadoop-23/ws/pom.xml>:
<https://builds.apache.org/job/HBase-TRUNK-on-Hadoop-23/ws/pom.xml> (No such file or
directory) @ 
 for project  at <https://builds.apache.org/job/HBase-TRUNK-on-Hadoop-23/ws/pom.xml>
for project  at <https://builds.apache.org/job/HBase-TRUNK-on-Hadoop-23/ws/pom.xml>
[INFO] Parent project loaded from repository.
Downloading: http://download.java.net/maven/2/org/apache/maven/skins/maven-stylus-skin/maven-metadata.xml
Downloading: http://people.apache.org/~rawson/repo/org/apache/maven/skins/maven-stylus-skin/maven-metadata.xml
Downloading: http://repository.codehaus.org/org/apache/maven/skins/maven-stylus-skin/maven-metadata.xml
Downloading: https://repository.apache.org/content/repositories/releases/org/apache/maven/skins/maven-stylus-skin/maven-metadata.xml
         
Downloading: http://repository.jboss.org/nexus/content/groups/public-jboss/org/apache/maven/skins/maven-stylus-skin/maven-metadata.xml
458 B    
        
Downloaded: https://repository.apache.org/content/repositories/releases/org/apache/maven/skins/maven-stylus-skin/maven-metadata.xml
(458 B at 2.8 KB/sec)
Downloading: http://repo1.maven.org/maven2/org/apache/maven/skins/maven-stylus-skin/maven-metadata.xml
        
458 B   
        
        
Downloaded: http://repo1.maven.org/maven2/org/apache/maven/skins/maven-stylus-skin/maven-metadata.xml
(458 B at 1.2 KB/sec)
        
[INFO]                                                                         
[INFO] ------------------------------------------------------------------------
[INFO] Building HBase 0.93-SNAPSHOT
[INFO] ------------------------------------------------------------------------
[INFO] 
[INFO] >>> maven-assembly-plugin:2.2-beta-5:assembly (default-cli) @ hbase >>>
[INFO] 
[INFO] --- avro-maven-plugin:1.5.3:schema (generate-avro-sources) @ hbase ---
[INFO] 
[INFO] --- avro-maven-plugin:1.5.3:protocol (generate-avro-sources) @ hbase ---
[INFO] 
[INFO] --- maven-antrun-plugin:1.6:run (generate) @ hbase ---
[INFO] Executing tasks

main:
    [mkdir] Created dir: <https://builds.apache.org/job/HBase-TRUNK-on-Hadoop-23/ws/trunk/target/hbase-webapps>
     [copy] Copying 5 files to <https://builds.apache.org/job/HBase-TRUNK-on-Hadoop-23/ws/trunk/target/hbase-webapps>
log4j:WARN No appenders could be found for logger (org.mortbay.log).
log4j:WARN Please initialize the log4j system properly.
log4j:WARN See http://logging.apache.org/log4j/1.2/faq.html#noconfig for more info.
    [mkdir] Created dir: <https://builds.apache.org/job/HBase-TRUNK-on-Hadoop-23/ws/trunk/target/hbase-webapps/master/WEB-INF>
    [mkdir] Created dir: <https://builds.apache.org/job/HBase-TRUNK-on-Hadoop-23/ws/trunk/target/hbase-webapps/regionserver/WEB-INF>
[INFO] Executed tasks
[INFO] 
[INFO] --- build-helper-maven-plugin:1.5:add-source (jspcSource-packageInfo-Avro-source) @
hbase ---
[INFO] Source directory: <https://builds.apache.org/job/HBase-TRUNK-on-Hadoop-23/ws/trunk/target/generated-jamon>
added.
[INFO] Source directory: <https://builds.apache.org/job/HBase-TRUNK-on-Hadoop-23/ws/trunk/target/generated-sources/java>
added.
[INFO] 
[INFO] --- jamon-maven-plugin:2.3.4:translate (default) @ hbase ---
[INFO] Translating 4 templates from <https://builds.apache.org/job/HBase-TRUNK-on-Hadoop-23/ws/trunk/src/main/jamon>
to <https://builds.apache.org/job/HBase-TRUNK-on-Hadoop-23/ws/trunk/target/generated-jamon>
[INFO] 
[INFO] --- maven-remote-resources-plugin:1.1:process (default) @ hbase ---
[INFO] Setting property: classpath.resource.loader.class => 'org.codehaus.plexus.velocity.ContextClassLoaderResourceLoader'.
[INFO] Setting property: velocimacro.messages.on => 'false'.
[INFO] Setting property: resource.loader => 'classpath'.
[INFO] Setting property: resource.manager.logwhenfound => 'false'.
Downloading: https://repository.apache.org/content/repositories/snapshots/org/apache/hadoop/hadoop-project/0.23.0-SNAPSHOT/maven-metadata.xml
612 B   
        
Downloaded: https://repository.apache.org/content/repositories/snapshots/org/apache/hadoop/hadoop-project/0.23.0-SNAPSHOT/maven-metadata.xml
(612 B at 3.9 KB/sec)
[INFO] 
[INFO] --- maven-resources-plugin:2.4:resources (default-resources) @ hbase ---
[INFO] Using 'UTF-8' encoding to copy filtered resources.
[INFO] Copying 1 resource
[INFO] Copying 7 resources
[INFO] Copying 3 resources
[INFO] 
[INFO] --- maven-antrun-plugin:1.6:run (default) @ hbase ---
[INFO] Executing tasks

main:
    [mkdir] Created dir: <https://builds.apache.org/job/HBase-TRUNK-on-Hadoop-23/ws/trunk/target/nativelib>
     [exec] tar: hadoop-snappy-nativelibs.tar: Cannot open: No such file or directory
     [exec] tar: Error is not recoverable: exiting now
     [exec] Result: 2
[INFO] Executed tasks
[INFO] 
[INFO] --- maven-compiler-plugin:2.0.2:compile (default-compile) @ hbase ---
[INFO] Compiling 604 source files to <https://builds.apache.org/job/HBase-TRUNK-on-Hadoop-23/ws/trunk/target/classes>
[INFO] ------------------------------------------------------------------------
[INFO] BUILD FAILURE
[INFO] ------------------------------------------------------------------------
[INFO] Total time: 43.572s
[INFO] Finished at: Sat Oct 01 02:04:16 UTC 2011
[INFO] Final Memory: 42M/779M
[INFO] ------------------------------------------------------------------------
[ERROR] Failed to execute goal org.apache.maven.plugins:maven-compiler-plugin:2.0.2:compile
(default-compile) on project hbase: Compilation failure: Compilation failure:
[ERROR] <https://builds.apache.org/job/HBase-TRUNK-on-Hadoop-23/ws/trunk/src/main/java/org/apache/hadoop/hbase/util/FSUtils.java>:[40,38]
cannot find symbol
[ERROR] symbol  : class FSConstants
[ERROR] location: package org.apache.hadoop.hdfs.protocol
[ERROR] 
[ERROR] <https://builds.apache.org/job/HBase-TRUNK-on-Hadoop-23/ws/trunk/src/main/java/org/apache/hadoop/hbase/util/Bytes.java>:[44,15]
sun.misc.Unsafe is Sun proprietary API and may be removed in a future release
[ERROR] 
[ERROR] <https://builds.apache.org/job/HBase-TRUNK-on-Hadoop-23/ws/trunk/src/main/java/org/apache/hadoop/hbase/util/FSHDFSUtils.java>:[35,38]
cannot find symbol
[ERROR] symbol  : class FSConstants
[ERROR] location: package org.apache.hadoop.hdfs.protocol
[ERROR] 
[ERROR] <https://builds.apache.org/job/HBase-TRUNK-on-Hadoop-23/ws/trunk/src/main/java/org/apache/hadoop/hbase/util/Bytes.java>:[1046,19]
sun.misc.Unsafe is Sun proprietary API and may be removed in a future release
[ERROR] 
[ERROR] <https://builds.apache.org/job/HBase-TRUNK-on-Hadoop-23/ws/trunk/src/main/java/org/apache/hadoop/hbase/util/FSUtils.java>:[166,48]
package FSConstants does not exist
[ERROR] 
[ERROR] <https://builds.apache.org/job/HBase-TRUNK-on-Hadoop-23/ws/trunk/src/main/java/org/apache/hadoop/hbase/util/FSUtils.java>:[442,38]
package FSConstants does not exist
[ERROR] 
[ERROR] <https://builds.apache.org/job/HBase-TRUNK-on-Hadoop-23/ws/trunk/src/main/java/org/apache/hadoop/hbase/util/Bytes.java>:[1052,21]
sun.misc.Unsafe is Sun proprietary API and may be removed in a future release
[ERROR] 
[ERROR] <https://builds.apache.org/job/HBase-TRUNK-on-Hadoop-23/ws/trunk/src/main/java/org/apache/hadoop/hbase/util/Bytes.java>:[1057,28]
sun.misc.Unsafe is Sun proprietary API and may be removed in a future release
[ERROR] 
[ERROR] <https://builds.apache.org/job/HBase-TRUNK-on-Hadoop-23/ws/trunk/src/main/java/org/apache/hadoop/hbase/util/FSHDFSUtils.java>:[89,26]
cannot find symbol
[ERROR] symbol  : variable FSConstants
[ERROR] location: class org.apache.hadoop.hbase.util.FSHDFSUtils
[ERROR] -> [Help 1]
[ERROR] 
[ERROR] To see the full stack trace of the errors, re-run Maven with the -e switch.
[ERROR] Re-run Maven using the -X switch to enable full debug logging.
[ERROR] 
[ERROR] For more information about the errors and possible solutions, please read the following
articles:
[ERROR] [Help 1] http://cwiki.apache.org/confluence/display/MAVEN/MojoFailureException
Build step 'Invoke top-level Maven targets' marked build as failure
[locks-and-latches] Releasing all the locks
[locks-and-latches] All the locks released
Archiving artifacts
Recording test results


Mime
View raw message