hbase-dev mailing list archives

Site index · List index
Message view « Date » · « Thread »
Top « Date » · « Thread »
From Apache Jenkins Server <jenk...@builds.apache.org>
Subject Build failed in Jenkins: HBase-0.92 #57
Date Wed, 12 Oct 2011 14:17:09 GMT
See <https://builds.apache.org/job/HBase-0.92/57/changes>

Changes:

[jgray] HBASE-4422  Move block cache parameters and references into single CacheConf class
(jgray)

------------------------------------------
[...truncated 6122 lines...]
Forking command line: /bin/sh -c cd <https://builds.apache.org/job/HBase-0.92/ws/trunk>
&& /home/jenkins/tools/java/jdk1.6.0_20-32/jre/bin/java -enableassertions -Xmx1400m
-jar <https://builds.apache.org/job/HBase-0.92/ws/trunk/target/surefire/surefirebooter1727641610522922599.jar>
<https://builds.apache.org/job/HBase-0.92/ws/trunk/target/surefire/surefire1756356727579094429tmp>
<https://builds.apache.org/job/HBase-0.92/ws/trunk/target/surefire/surefire4688620281587320902tmp>
Running org.apache.hadoop.hbase.rest.TestGzipFilter
Tests run: 3, Failures: 0, Errors: 0, Skipped: 0, Time elapsed: 26.14 sec
Forking command line: /bin/sh -c cd <https://builds.apache.org/job/HBase-0.92/ws/trunk>
&& /home/jenkins/tools/java/jdk1.6.0_20-32/jre/bin/java -enableassertions -Xmx1400m
-jar <https://builds.apache.org/job/HBase-0.92/ws/trunk/target/surefire/surefirebooter4074300498292399881.jar>
<https://builds.apache.org/job/HBase-0.92/ws/trunk/target/surefire/surefire1284958564434707997tmp>
<https://builds.apache.org/job/HBase-0.92/ws/trunk/target/surefire/surefire4974847711891112715tmp>
Running org.apache.hadoop.hbase.rest.TestMultiRowResource
Tests run: 3, Failures: 0, Errors: 0, Skipped: 0, Time elapsed: 20.168 sec
Forking command line: /bin/sh -c cd <https://builds.apache.org/job/HBase-0.92/ws/trunk>
&& /home/jenkins/tools/java/jdk1.6.0_20-32/jre/bin/java -enableassertions -Xmx1400m
-jar <https://builds.apache.org/job/HBase-0.92/ws/trunk/target/surefire/surefirebooter1790982600715229559.jar>
<https://builds.apache.org/job/HBase-0.92/ws/trunk/target/surefire/surefire9110139150228101203tmp>
<https://builds.apache.org/job/HBase-0.92/ws/trunk/target/surefire/surefire7006497982706162517tmp>
Running org.apache.hadoop.hbase.rest.TestScannersWithFilters
Tests run: 10, Failures: 0, Errors: 0, Skipped: 0, Time elapsed: 23.969 sec
Forking command line: /bin/sh -c cd <https://builds.apache.org/job/HBase-0.92/ws/trunk>
&& /home/jenkins/tools/java/jdk1.6.0_20-32/jre/bin/java -enableassertions -Xmx1400m
-jar <https://builds.apache.org/job/HBase-0.92/ws/trunk/target/surefire/surefirebooter5323876098312711255.jar>
<https://builds.apache.org/job/HBase-0.92/ws/trunk/target/surefire/surefire6643798021466153304tmp>
<https://builds.apache.org/job/HBase-0.92/ws/trunk/target/surefire/surefire3904564252873095049tmp>
Running org.apache.hadoop.hbase.rest.TestRowResource
Tests run: 11, Failures: 0, Errors: 0, Skipped: 0, Time elapsed: 24.481 sec
Forking command line: /bin/sh -c cd <https://builds.apache.org/job/HBase-0.92/ws/trunk>
&& /home/jenkins/tools/java/jdk1.6.0_20-32/jre/bin/java -enableassertions -Xmx1400m
-jar <https://builds.apache.org/job/HBase-0.92/ws/trunk/target/surefire/surefirebooter5459679273727189276.jar>
<https://builds.apache.org/job/HBase-0.92/ws/trunk/target/surefire/surefire9100559052595768230tmp>
<https://builds.apache.org/job/HBase-0.92/ws/trunk/target/surefire/surefire9078909332842785494tmp>
Running org.apache.hadoop.hbase.rest.model.TestCellModel
Tests run: 3, Failures: 0, Errors: 0, Skipped: 0, Time elapsed: 0.366 sec
Forking command line: /bin/sh -c cd <https://builds.apache.org/job/HBase-0.92/ws/trunk>
&& /home/jenkins/tools/java/jdk1.6.0_20-32/jre/bin/java -enableassertions -Xmx1400m
-jar <https://builds.apache.org/job/HBase-0.92/ws/trunk/target/surefire/surefirebooter6672886743474731118.jar>
<https://builds.apache.org/job/HBase-0.92/ws/trunk/target/surefire/surefire1705903259165767625tmp>
<https://builds.apache.org/job/HBase-0.92/ws/trunk/target/surefire/surefire2982490374147824977tmp>
Running org.apache.hadoop.hbase.rest.model.TestCellSetModel
Tests run: 3, Failures: 0, Errors: 0, Skipped: 0, Time elapsed: 0.399 sec
Forking command line: /bin/sh -c cd <https://builds.apache.org/job/HBase-0.92/ws/trunk>
&& /home/jenkins/tools/java/jdk1.6.0_20-32/jre/bin/java -enableassertions -Xmx1400m
-jar <https://builds.apache.org/job/HBase-0.92/ws/trunk/target/surefire/surefirebooter1911451251402571162.jar>
<https://builds.apache.org/job/HBase-0.92/ws/trunk/target/surefire/surefire1505420234859787380tmp>
<https://builds.apache.org/job/HBase-0.92/ws/trunk/target/surefire/surefire1839053400466515323tmp>
Running org.apache.hadoop.hbase.rest.model.TestTableListModel
Tests run: 3, Failures: 0, Errors: 0, Skipped: 0, Time elapsed: 0.378 sec
Forking command line: /bin/sh -c cd <https://builds.apache.org/job/HBase-0.92/ws/trunk>
&& /home/jenkins/tools/java/jdk1.6.0_20-32/jre/bin/java -enableassertions -Xmx1400m
-jar <https://builds.apache.org/job/HBase-0.92/ws/trunk/target/surefire/surefirebooter4722397700660139708.jar>
<https://builds.apache.org/job/HBase-0.92/ws/trunk/target/surefire/surefire7431591377521193145tmp>
<https://builds.apache.org/job/HBase-0.92/ws/trunk/target/surefire/surefire1303426209757881734tmp>
Running org.apache.hadoop.hbase.rest.model.TestVersionModel
Tests run: 3, Failures: 0, Errors: 0, Skipped: 0, Time elapsed: 0.363 sec
Forking command line: /bin/sh -c cd <https://builds.apache.org/job/HBase-0.92/ws/trunk>
&& /home/jenkins/tools/java/jdk1.6.0_20-32/jre/bin/java -enableassertions -Xmx1400m
-jar <https://builds.apache.org/job/HBase-0.92/ws/trunk/target/surefire/surefirebooter7832856521995812171.jar>
<https://builds.apache.org/job/HBase-0.92/ws/trunk/target/surefire/surefire459590509539532502tmp>
<https://builds.apache.org/job/HBase-0.92/ws/trunk/target/surefire/surefire889509608534111972tmp>
Running org.apache.hadoop.hbase.rest.model.TestColumnSchemaModel
Tests run: 2, Failures: 0, Errors: 0, Skipped: 0, Time elapsed: 0.271 sec
Forking command line: /bin/sh -c cd <https://builds.apache.org/job/HBase-0.92/ws/trunk>
&& /home/jenkins/tools/java/jdk1.6.0_20-32/jre/bin/java -enableassertions -Xmx1400m
-jar <https://builds.apache.org/job/HBase-0.92/ws/trunk/target/surefire/surefirebooter345167578353134993.jar>
<https://builds.apache.org/job/HBase-0.92/ws/trunk/target/surefire/surefire2397479372280278610tmp>
<https://builds.apache.org/job/HBase-0.92/ws/trunk/target/surefire/surefire8466958382390194084tmp>
Running org.apache.hadoop.hbase.rest.model.TestTableInfoModel
Tests run: 3, Failures: 0, Errors: 0, Skipped: 0, Time elapsed: 0.395 sec
Forking command line: /bin/sh -c cd <https://builds.apache.org/job/HBase-0.92/ws/trunk>
&& /home/jenkins/tools/java/jdk1.6.0_20-32/jre/bin/java -enableassertions -Xmx1400m
-jar <https://builds.apache.org/job/HBase-0.92/ws/trunk/target/surefire/surefirebooter3471010326712546546.jar>
<https://builds.apache.org/job/HBase-0.92/ws/trunk/target/surefire/surefire7035931540463450100tmp>
<https://builds.apache.org/job/HBase-0.92/ws/trunk/target/surefire/surefire2789116546419598853tmp>
Running org.apache.hadoop.hbase.rest.model.TestRowModel
Tests run: 2, Failures: 0, Errors: 0, Skipped: 0, Time elapsed: 0.365 sec
Forking command line: /bin/sh -c cd <https://builds.apache.org/job/HBase-0.92/ws/trunk>
&& /home/jenkins/tools/java/jdk1.6.0_20-32/jre/bin/java -enableassertions -Xmx1400m
-jar <https://builds.apache.org/job/HBase-0.92/ws/trunk/target/surefire/surefirebooter5852970197631206478.jar>
<https://builds.apache.org/job/HBase-0.92/ws/trunk/target/surefire/surefire3806410819694626629tmp>
<https://builds.apache.org/job/HBase-0.92/ws/trunk/target/surefire/surefire6874489985380375867tmp>
Running org.apache.hadoop.hbase.rest.model.TestTableSchemaModel
Tests run: 3, Failures: 0, Errors: 0, Skipped: 0, Time elapsed: 0.398 sec
Forking command line: /bin/sh -c cd <https://builds.apache.org/job/HBase-0.92/ws/trunk>
&& /home/jenkins/tools/java/jdk1.6.0_20-32/jre/bin/java -enableassertions -Xmx1400m
-jar <https://builds.apache.org/job/HBase-0.92/ws/trunk/target/surefire/surefirebooter5931158758118147989.jar>
<https://builds.apache.org/job/HBase-0.92/ws/trunk/target/surefire/surefire5746158968459079983tmp>
<https://builds.apache.org/job/HBase-0.92/ws/trunk/target/surefire/surefire7399356822384137003tmp>
Running org.apache.hadoop.hbase.rest.model.TestStorageClusterVersionModel
Tests run: 2, Failures: 0, Errors: 0, Skipped: 0, Time elapsed: 0.267 sec
Forking command line: /bin/sh -c cd <https://builds.apache.org/job/HBase-0.92/ws/trunk>
&& /home/jenkins/tools/java/jdk1.6.0_20-32/jre/bin/java -enableassertions -Xmx1400m
-jar <https://builds.apache.org/job/HBase-0.92/ws/trunk/target/surefire/surefirebooter4492121600637926348.jar>
<https://builds.apache.org/job/HBase-0.92/ws/trunk/target/surefire/surefire5351775461362954266tmp>
<https://builds.apache.org/job/HBase-0.92/ws/trunk/target/surefire/surefire5740142032168677258tmp>
Running org.apache.hadoop.hbase.rest.model.TestTableRegionModel
Tests run: 4, Failures: 0, Errors: 0, Skipped: 0, Time elapsed: 0.461 sec
Forking command line: /bin/sh -c cd <https://builds.apache.org/job/HBase-0.92/ws/trunk>
&& /home/jenkins/tools/java/jdk1.6.0_20-32/jre/bin/java -enableassertions -Xmx1400m
-jar <https://builds.apache.org/job/HBase-0.92/ws/trunk/target/surefire/surefirebooter4716160502120630214.jar>
<https://builds.apache.org/job/HBase-0.92/ws/trunk/target/surefire/surefire5651210820739045465tmp>
<https://builds.apache.org/job/HBase-0.92/ws/trunk/target/surefire/surefire5781335276108720897tmp>
Running org.apache.hadoop.hbase.rest.model.TestStorageClusterStatusModel
Tests run: 3, Failures: 0, Errors: 0, Skipped: 0, Time elapsed: 0.443 sec
Forking command line: /bin/sh -c cd <https://builds.apache.org/job/HBase-0.92/ws/trunk>
&& /home/jenkins/tools/java/jdk1.6.0_20-32/jre/bin/java -enableassertions -Xmx1400m
-jar <https://builds.apache.org/job/HBase-0.92/ws/trunk/target/surefire/surefirebooter4676103008391679607.jar>
<https://builds.apache.org/job/HBase-0.92/ws/trunk/target/surefire/surefire7188858176415532892tmp>
<https://builds.apache.org/job/HBase-0.92/ws/trunk/target/surefire/surefire3197176381225804200tmp>
Running org.apache.hadoop.hbase.rest.model.TestScannerModel
Tests run: 3, Failures: 0, Errors: 0, Skipped: 0, Time elapsed: 0.405 sec
Forking command line: /bin/sh -c cd <https://builds.apache.org/job/HBase-0.92/ws/trunk>
&& /home/jenkins/tools/java/jdk1.6.0_20-32/jre/bin/java -enableassertions -Xmx1400m
-jar <https://builds.apache.org/job/HBase-0.92/ws/trunk/target/surefire/surefirebooter4140364746348600413.jar>
<https://builds.apache.org/job/HBase-0.92/ws/trunk/target/surefire/surefire5923652321999338851tmp>
<https://builds.apache.org/job/HBase-0.92/ws/trunk/target/surefire/surefire3039240596918606858tmp>
Running org.apache.hadoop.hbase.rest.client.TestRemoteAdmin
Tests run: 2, Failures: 0, Errors: 0, Skipped: 0, Time elapsed: 24.097 sec
Forking command line: /bin/sh -c cd <https://builds.apache.org/job/HBase-0.92/ws/trunk>
&& /home/jenkins/tools/java/jdk1.6.0_20-32/jre/bin/java -enableassertions -Xmx1400m
-jar <https://builds.apache.org/job/HBase-0.92/ws/trunk/target/surefire/surefirebooter1567723901917857034.jar>
<https://builds.apache.org/job/HBase-0.92/ws/trunk/target/surefire/surefire6715200865062073549tmp>
<https://builds.apache.org/job/HBase-0.92/ws/trunk/target/surefire/surefire5717743471126874907tmp>
Running org.apache.hadoop.hbase.rest.client.TestRemoteTable
Tests run: 3, Failures: 0, Errors: 0, Skipped: 0, Time elapsed: 28.744 sec
Forking command line: /bin/sh -c cd <https://builds.apache.org/job/HBase-0.92/ws/trunk>
&& /home/jenkins/tools/java/jdk1.6.0_20-32/jre/bin/java -enableassertions -Xmx1400m
-jar <https://builds.apache.org/job/HBase-0.92/ws/trunk/target/surefire/surefirebooter2956387303973660528.jar>
<https://builds.apache.org/job/HBase-0.92/ws/trunk/target/surefire/surefire5811204587767618828tmp>
<https://builds.apache.org/job/HBase-0.92/ws/trunk/target/surefire/surefire6155450916827920599tmp>
Running org.apache.hadoop.hbase.rest.TestVersionResource
Tests run: 7, Failures: 0, Errors: 0, Skipped: 0, Time elapsed: 19.144 sec
Forking command line: /bin/sh -c cd <https://builds.apache.org/job/HBase-0.92/ws/trunk>
&& /home/jenkins/tools/java/jdk1.6.0_20-32/jre/bin/java -enableassertions -Xmx1400m
-jar <https://builds.apache.org/job/HBase-0.92/ws/trunk/target/surefire/surefirebooter4499286310628382764.jar>
<https://builds.apache.org/job/HBase-0.92/ws/trunk/target/surefire/surefire2204759770499409941tmp>
<https://builds.apache.org/job/HBase-0.92/ws/trunk/target/surefire/surefire7785303718890626467tmp>
Running org.apache.hadoop.hbase.rest.TestScannerResource
Tests run: 5, Failures: 0, Errors: 0, Skipped: 0, Time elapsed: 55.669 sec
Forking command line: /bin/sh -c cd <https://builds.apache.org/job/HBase-0.92/ws/trunk>
&& /home/jenkins/tools/java/jdk1.6.0_20-32/jre/bin/java -enableassertions -Xmx1400m
-jar <https://builds.apache.org/job/HBase-0.92/ws/trunk/target/surefire/surefirebooter9037839646699213708.jar>
<https://builds.apache.org/job/HBase-0.92/ws/trunk/target/surefire/surefire4922167423066738661tmp>
<https://builds.apache.org/job/HBase-0.92/ws/trunk/target/surefire/surefire7386825778354100750tmp>
Running org.apache.hadoop.hbase.rest.TestTransform
Tests run: 1, Failures: 0, Errors: 0, Skipped: 0, Time elapsed: 26.904 sec
Forking command line: /bin/sh -c cd <https://builds.apache.org/job/HBase-0.92/ws/trunk>
&& /home/jenkins/tools/java/jdk1.6.0_20-32/jre/bin/java -enableassertions -Xmx1400m
-jar <https://builds.apache.org/job/HBase-0.92/ws/trunk/target/surefire/surefirebooter3460564116475355666.jar>
<https://builds.apache.org/job/HBase-0.92/ws/trunk/target/surefire/surefire520772339638367609tmp>
<https://builds.apache.org/job/HBase-0.92/ws/trunk/target/surefire/surefire3019795488434691239tmp>
Running org.apache.hadoop.hbase.rest.TestTableResource
Tests run: 8, Failures: 0, Errors: 0, Skipped: 0, Time elapsed: 52.15 sec
Forking command line: /bin/sh -c cd <https://builds.apache.org/job/HBase-0.92/ws/trunk>
&& /home/jenkins/tools/java/jdk1.6.0_20-32/jre/bin/java -enableassertions -Xmx1400m
-jar <https://builds.apache.org/job/HBase-0.92/ws/trunk/target/surefire/surefirebooter4957313885936535051.jar>
<https://builds.apache.org/job/HBase-0.92/ws/trunk/target/surefire/surefire5017475647555411890tmp>
<https://builds.apache.org/job/HBase-0.92/ws/trunk/target/surefire/surefire1301578173220228811tmp>
Running org.apache.hadoop.hbase.rest.TestStatusResource
Tests run: 2, Failures: 0, Errors: 0, Skipped: 0, Time elapsed: 23.766 sec
Forking command line: /bin/sh -c cd <https://builds.apache.org/job/HBase-0.92/ws/trunk>
&& /home/jenkins/tools/java/jdk1.6.0_20-32/jre/bin/java -enableassertions -Xmx1400m
-jar <https://builds.apache.org/job/HBase-0.92/ws/trunk/target/surefire/surefirebooter500554967223324540.jar>
<https://builds.apache.org/job/HBase-0.92/ws/trunk/target/surefire/surefire4029597467102839282tmp>
<https://builds.apache.org/job/HBase-0.92/ws/trunk/target/surefire/surefire5115565544172787731tmp>
Running org.apache.hadoop.hbase.rest.TestSchemaResource
Tests run: 2, Failures: 0, Errors: 0, Skipped: 0, Time elapsed: 27.072 sec
Forking command line: /bin/sh -c cd <https://builds.apache.org/job/HBase-0.92/ws/trunk>
&& /home/jenkins/tools/java/jdk1.6.0_20-32/jre/bin/java -enableassertions -Xmx1400m
-jar <https://builds.apache.org/job/HBase-0.92/ws/trunk/target/surefire/surefirebooter32774764310082541.jar>
<https://builds.apache.org/job/HBase-0.92/ws/trunk/target/surefire/surefire1394288379456014999tmp>
<https://builds.apache.org/job/HBase-0.92/ws/trunk/target/surefire/surefire6200344054831006187tmp>
Running org.apache.hadoop.hbase.thrift.TestThriftServer
Tests run: 1, Failures: 0, Errors: 0, Skipped: 0, Time elapsed: 21.273 sec
Forking command line: /bin/sh -c cd <https://builds.apache.org/job/HBase-0.92/ws/trunk>
&& /home/jenkins/tools/java/jdk1.6.0_20-32/jre/bin/java -enableassertions -Xmx1400m
-jar <https://builds.apache.org/job/HBase-0.92/ws/trunk/target/surefire/surefirebooter61675122811336004.jar>
<https://builds.apache.org/job/HBase-0.92/ws/trunk/target/surefire/surefire9185316775781183916tmp>
<https://builds.apache.org/job/HBase-0.92/ws/trunk/target/surefire/surefire8260834177399478887tmp>
Running org.apache.hadoop.hbase.io.TestHeapSize
Tests run: 2, Failures: 1, Errors: 0, Skipped: 0, Time elapsed: 0.162 sec <<< FAILURE!
Forking command line: /bin/sh -c cd <https://builds.apache.org/job/HBase-0.92/ws/trunk>
&& /home/jenkins/tools/java/jdk1.6.0_20-32/jre/bin/java -enableassertions -Xmx1400m
-jar <https://builds.apache.org/job/HBase-0.92/ws/trunk/target/surefire/surefirebooter6120334458314225069.jar>
<https://builds.apache.org/job/HBase-0.92/ws/trunk/target/surefire/surefire8630304065347697138tmp>
<https://builds.apache.org/job/HBase-0.92/ws/trunk/target/surefire/surefire3653521264051057495tmp>
Running org.apache.hadoop.hbase.io.hfile.TestHFileSeek
Tests run: 1, Failures: 0, Errors: 0, Skipped: 0, Time elapsed: 6.073 sec
Forking command line: /bin/sh -c cd <https://builds.apache.org/job/HBase-0.92/ws/trunk>
&& /home/jenkins/tools/java/jdk1.6.0_20-32/jre/bin/java -enableassertions -Xmx1400m
-jar <https://builds.apache.org/job/HBase-0.92/ws/trunk/target/surefire/surefirebooter722215058468297478.jar>
<https://builds.apache.org/job/HBase-0.92/ws/trunk/target/surefire/surefire5808341882975753684tmp>
<https://builds.apache.org/job/HBase-0.92/ws/trunk/target/surefire/surefire4660615936413767250tmp>
Running org.apache.hadoop.hbase.io.hfile.slab.TestSlab
Tests run: 1, Failures: 0, Errors: 0, Skipped: 0, Time elapsed: 0.144 sec
Forking command line: /bin/sh -c cd <https://builds.apache.org/job/HBase-0.92/ws/trunk>
&& /home/jenkins/tools/java/jdk1.6.0_20-32/jre/bin/java -enableassertions -Xmx1400m
-jar <https://builds.apache.org/job/HBase-0.92/ws/trunk/target/surefire/surefirebooter7993661378071056698.jar>
<https://builds.apache.org/job/HBase-0.92/ws/trunk/target/surefire/surefire4296680044926812210tmp>
<https://builds.apache.org/job/HBase-0.92/ws/trunk/target/surefire/surefire7798685933777721612tmp>
Running org.apache.hadoop.hbase.io.hfile.slab.TestSlabCache
Tests run: 7, Failures: 0, Errors: 0, Skipped: 0, Time elapsed: 21.644 sec
Forking command line: /bin/sh -c cd <https://builds.apache.org/job/HBase-0.92/ws/trunk>
&& /home/jenkins/tools/java/jdk1.6.0_20-32/jre/bin/java -enableassertions -Xmx1400m
-jar <https://builds.apache.org/job/HBase-0.92/ws/trunk/target/surefire/surefirebooter4677426582441242507.jar>
<https://builds.apache.org/job/HBase-0.92/ws/trunk/target/surefire/surefire6177465980843453128tmp>
<https://builds.apache.org/job/HBase-0.92/ws/trunk/target/surefire/surefire6776947419126934838tmp>
Running org.apache.hadoop.hbase.io.hfile.slab.TestSingleSizeCache
Tests run: 5, Failures: 0, Errors: 0, Skipped: 0, Time elapsed: 23.401 sec
Forking command line: /bin/sh -c cd <https://builds.apache.org/job/HBase-0.92/ws/trunk>
&& /home/jenkins/tools/java/jdk1.6.0_20-32/jre/bin/java -enableassertions -Xmx1400m
-jar <https://builds.apache.org/job/HBase-0.92/ws/trunk/target/surefire/surefirebooter8578673006211154783.jar>
<https://builds.apache.org/job/HBase-0.92/ws/trunk/target/surefire/surefire5703867728304669074tmp>
<https://builds.apache.org/job/HBase-0.92/ws/trunk/target/surefire/surefire2099307758459244496tmp>
Running org.apache.hadoop.hbase.io.hfile.TestCachedBlockQueue
Tests run: 2, Failures: 0, Errors: 0, Skipped: 0, Time elapsed: 0.1 sec
Forking command line: /bin/sh -c cd <https://builds.apache.org/job/HBase-0.92/ws/trunk>
&& /home/jenkins/tools/java/jdk1.6.0_20-32/jre/bin/java -enableassertions -Xmx1400m
-jar <https://builds.apache.org/job/HBase-0.92/ws/trunk/target/surefire/surefirebooter5050890943029322307.jar>
<https://builds.apache.org/job/HBase-0.92/ws/trunk/target/surefire/surefire7760470793167724542tmp>
<https://builds.apache.org/job/HBase-0.92/ws/trunk/target/surefire/surefire3397864752000239354tmp>
Running org.apache.hadoop.hbase.io.hfile.TestHFileBlockIndex
Tests run: 10, Failures: 0, Errors: 0, Skipped: 0, Time elapsed: 11.474 sec
Forking command line: /bin/sh -c cd <https://builds.apache.org/job/HBase-0.92/ws/trunk>
&& /home/jenkins/tools/java/jdk1.6.0_20-32/jre/bin/java -enableassertions -Xmx1400m
-jar <https://builds.apache.org/job/HBase-0.92/ws/trunk/target/surefire/surefirebooter3255523561264324228.jar>
<https://builds.apache.org/job/HBase-0.92/ws/trunk/target/surefire/surefire8130744113864222021tmp>
<https://builds.apache.org/job/HBase-0.92/ws/trunk/target/surefire/surefire8387250331258784494tmp>
Running org.apache.hadoop.hbase.io.hfile.TestLruBlockCache
Tests run: 7, Failures: 0, Errors: 0, Skipped: 0, Time elapsed: 1.142 sec
Forking command line: /bin/sh -c cd <https://builds.apache.org/job/HBase-0.92/ws/trunk>
&& /home/jenkins/tools/java/jdk1.6.0_20-32/jre/bin/java -enableassertions -Xmx1400m
-jar <https://builds.apache.org/job/HBase-0.92/ws/trunk/target/surefire/surefirebooter6945169839200052368.jar>
<https://builds.apache.org/job/HBase-0.92/ws/trunk/target/surefire/surefire1700556014026158708tmp>
<https://builds.apache.org/job/HBase-0.92/ws/trunk/target/surefire/surefire6818810646179458105tmp>
Running org.apache.hadoop.hbase.io.hfile.TestHFilePerformance
Tests run: 1, Failures: 0, Errors: 0, Skipped: 0, Time elapsed: 6.824 sec
Forking command line: /bin/sh -c cd <https://builds.apache.org/job/HBase-0.92/ws/trunk>
&& /home/jenkins/tools/java/jdk1.6.0_20-32/jre/bin/java -enableassertions -Xmx1400m
-jar <https://builds.apache.org/job/HBase-0.92/ws/trunk/target/surefire/surefirebooter8420825955104228571.jar>
<https://builds.apache.org/job/HBase-0.92/ws/trunk/target/surefire/surefire5112454734834583354tmp>
<https://builds.apache.org/job/HBase-0.92/ws/trunk/target/surefire/surefire4588890895988140422tmp>
Running org.apache.hadoop.hbase.io.hfile.TestFixedFileTrailer
Tests run: 2, Failures: 0, Errors: 0, Skipped: 0, Time elapsed: 0.55 sec
Forking command line: /bin/sh -c cd <https://builds.apache.org/job/HBase-0.92/ws/trunk>
&& /home/jenkins/tools/java/jdk1.6.0_20-32/jre/bin/java -enableassertions -Xmx1400m
-jar <https://builds.apache.org/job/HBase-0.92/ws/trunk/target/surefire/surefirebooter5166388139257536445.jar>
<https://builds.apache.org/job/HBase-0.92/ws/trunk/target/surefire/surefire1319693933620074448tmp>
<https://builds.apache.org/job/HBase-0.92/ws/trunk/target/surefire/surefire7426622365971987635tmp>
Running org.apache.hadoop.hbase.io.hfile.TestHFileWriterV2
Tests run: 1, Failures: 0, Errors: 0, Skipped: 0, Time elapsed: 0.91 sec
Forking command line: /bin/sh -c cd <https://builds.apache.org/job/HBase-0.92/ws/trunk>
&& /home/jenkins/tools/java/jdk1.6.0_20-32/jre/bin/java -enableassertions -Xmx1400m
-jar <https://builds.apache.org/job/HBase-0.92/ws/trunk/target/surefire/surefirebooter4637866371402957135.jar>
<https://builds.apache.org/job/HBase-0.92/ws/trunk/target/surefire/surefire5783976827878592654tmp>
<https://builds.apache.org/job/HBase-0.92/ws/trunk/target/surefire/surefire790192469808142369tmp>
Running org.apache.hadoop.hbase.io.hfile.TestBlockCacheColumnFamilySummary
Tests run: 4, Failures: 0, Errors: 0, Skipped: 0, Time elapsed: 0.057 sec
Forking command line: /bin/sh -c cd <https://builds.apache.org/job/HBase-0.92/ws/trunk>
&& /home/jenkins/tools/java/jdk1.6.0_20-32/jre/bin/java -enableassertions -Xmx1400m
-jar <https://builds.apache.org/job/HBase-0.92/ws/trunk/target/surefire/surefirebooter3583770197473104300.jar>
<https://builds.apache.org/job/HBase-0.92/ws/trunk/target/surefire/surefire4358749109507485950tmp>
<https://builds.apache.org/job/HBase-0.92/ws/trunk/target/surefire/surefire1745297628045059717tmp>
Running org.apache.hadoop.hbase.io.hfile.TestHFileReaderV1
Tests run: 1, Failures: 0, Errors: 0, Skipped: 0, Time elapsed: 0.477 sec
Forking command line: /bin/sh -c cd <https://builds.apache.org/job/HBase-0.92/ws/trunk>
&& /home/jenkins/tools/java/jdk1.6.0_20-32/jre/bin/java -enableassertions -Xmx1400m
-jar <https://builds.apache.org/job/HBase-0.92/ws/trunk/target/surefire/surefirebooter4791862228211430606.jar>
<https://builds.apache.org/job/HBase-0.92/ws/trunk/target/surefire/surefire531178951284582043tmp>
<https://builds.apache.org/job/HBase-0.92/ws/trunk/target/surefire/surefire1385682784459857985tmp>
Running org.apache.hadoop.hbase.io.hfile.TestHFile
Tests run: 6, Failures: 0, Errors: 0, Skipped: 0, Time elapsed: 0.862 sec
Forking command line: /bin/sh -c cd <https://builds.apache.org/job/HBase-0.92/ws/trunk>
&& /home/jenkins/tools/java/jdk1.6.0_20-32/jre/bin/java -enableassertions -Xmx1400m
-jar <https://builds.apache.org/job/HBase-0.92/ws/trunk/target/surefire/surefirebooter1309280503333377304.jar>
<https://builds.apache.org/job/HBase-0.92/ws/trunk/target/surefire/surefire5002290205447527925tmp>
<https://builds.apache.org/job/HBase-0.92/ws/trunk/target/surefire/surefire6580098968391971839tmp>
Running org.apache.hadoop.hbase.io.hfile.TestReseekTo
Tests run: 1, Failures: 0, Errors: 0, Skipped: 0, Time elapsed: 0.574 sec
Forking command line: /bin/sh -c cd <https://builds.apache.org/job/HBase-0.92/ws/trunk>
&& /home/jenkins/tools/java/jdk1.6.0_20-32/jre/bin/java -enableassertions -Xmx1400m
-jar <https://builds.apache.org/job/HBase-0.92/ws/trunk/target/surefire/surefirebooter1055289683532747087.jar>
<https://builds.apache.org/job/HBase-0.92/ws/trunk/target/surefire/surefire8014910542389497307tmp>
<https://builds.apache.org/job/HBase-0.92/ws/trunk/target/surefire/surefire4179029459567054946tmp>
Running org.apache.hadoop.hbase.io.hfile.TestHFileBlock
Tests run: 7, Failures: 0, Errors: 0, Skipped: 0, Time elapsed: 30.808 sec
Forking command line: /bin/sh -c cd <https://builds.apache.org/job/HBase-0.92/ws/trunk>
&& /home/jenkins/tools/java/jdk1.6.0_20-32/jre/bin/java -enableassertions -Xmx1400m
-jar <https://builds.apache.org/job/HBase-0.92/ws/trunk/target/surefire/surefirebooter3251377179539312552.jar>
<https://builds.apache.org/job/HBase-0.92/ws/trunk/target/surefire/surefire3348508943349889985tmp>
<https://builds.apache.org/job/HBase-0.92/ws/trunk/target/surefire/surefire8802832479161785925tmp>
Running org.apache.hadoop.hbase.io.hfile.TestSeekTo
Tests run: 3, Failures: 0, Errors: 0, Skipped: 0, Time elapsed: 0.657 sec
Forking command line: /bin/sh -c cd <https://builds.apache.org/job/HBase-0.92/ws/trunk>
&& /home/jenkins/tools/java/jdk1.6.0_20-32/jre/bin/java -enableassertions -Xmx1400m
-jar <https://builds.apache.org/job/HBase-0.92/ws/trunk/target/surefire/surefirebooter5594647559028174974.jar>
<https://builds.apache.org/job/HBase-0.92/ws/trunk/target/surefire/surefire7620378082201137578tmp>
<https://builds.apache.org/job/HBase-0.92/ws/trunk/target/surefire/surefire613809706349073889tmp>
Running org.apache.hadoop.hbase.io.hfile.TestCacheOnWrite
Tests run: 6, Failures: 0, Errors: 0, Skipped: 0, Time elapsed: 9.767 sec
Forking command line: /bin/sh -c cd <https://builds.apache.org/job/HBase-0.92/ws/trunk>
&& /home/jenkins/tools/java/jdk1.6.0_20-32/jre/bin/java -enableassertions -Xmx1400m
-jar <https://builds.apache.org/job/HBase-0.92/ws/trunk/target/surefire/surefirebooter8910805851880590905.jar>
<https://builds.apache.org/job/HBase-0.92/ws/trunk/target/surefire/surefire9005950491708257639tmp>
<https://builds.apache.org/job/HBase-0.92/ws/trunk/target/surefire/surefire8223369762690173331tmp>
Running org.apache.hadoop.hbase.io.TestHbaseObjectWritable
Tests run: 3, Failures: 0, Errors: 0, Skipped: 0, Time elapsed: 0.4 sec
Forking command line: /bin/sh -c cd <https://builds.apache.org/job/HBase-0.92/ws/trunk>
&& /home/jenkins/tools/java/jdk1.6.0_20-32/jre/bin/java -enableassertions -Xmx1400m
-jar <https://builds.apache.org/job/HBase-0.92/ws/trunk/target/surefire/surefirebooter3343542111285673468.jar>
<https://builds.apache.org/job/HBase-0.92/ws/trunk/target/surefire/surefire9214202945974858287tmp>
<https://builds.apache.org/job/HBase-0.92/ws/trunk/target/surefire/surefire8764491579361289549tmp>
Running org.apache.hadoop.hbase.io.TestImmutableBytesWritable
Tests run: 3, Failures: 0, Errors: 0, Skipped: 0, Time elapsed: 0.108 sec
Forking command line: /bin/sh -c cd <https://builds.apache.org/job/HBase-0.92/ws/trunk>
&& /home/jenkins/tools/java/jdk1.6.0_20-32/jre/bin/java -enableassertions -Xmx1400m
-jar <https://builds.apache.org/job/HBase-0.92/ws/trunk/target/surefire/surefirebooter1253430122527879313.jar>
<https://builds.apache.org/job/HBase-0.92/ws/trunk/target/surefire/surefire6747012751201704900tmp>
<https://builds.apache.org/job/HBase-0.92/ws/trunk/target/surefire/surefire7300104555218282485tmp>
Running org.apache.hadoop.hbase.io.TestHalfStoreFileReader
Tests run: 1, Failures: 0, Errors: 0, Skipped: 0, Time elapsed: 0.627 sec
Forking command line: /bin/sh -c cd <https://builds.apache.org/job/HBase-0.92/ws/trunk>
&& /home/jenkins/tools/java/jdk1.6.0_20-32/jre/bin/java -enableassertions -Xmx1400m
-jar <https://builds.apache.org/job/HBase-0.92/ws/trunk/target/surefire/surefirebooter7741587296306729108.jar>
<https://builds.apache.org/job/HBase-0.92/ws/trunk/target/surefire/surefire5998678183008477062tmp>
<https://builds.apache.org/job/HBase-0.92/ws/trunk/target/surefire/surefire8097763388683216822tmp>
Running org.apache.hadoop.hbase.TestFSTableDescriptorForceCreation
Tests run: 3, Failures: 0, Errors: 0, Skipped: 0, Time elapsed: 3.129 sec
Forking command line: /bin/sh -c cd <https://builds.apache.org/job/HBase-0.92/ws/trunk>
&& /home/jenkins/tools/java/jdk1.6.0_20-32/jre/bin/java -enableassertions -Xmx1400m
-jar <https://builds.apache.org/job/HBase-0.92/ws/trunk/target/surefire/surefirebooter7819259579538848549.jar>
<https://builds.apache.org/job/HBase-0.92/ws/trunk/target/surefire/surefire6720930406674550917tmp>
<https://builds.apache.org/job/HBase-0.92/ws/trunk/target/surefire/surefire116362778294920147tmp>
Running org.apache.hadoop.hbase.avro.TestAvroUtil
Tests run: 1, Failures: 0, Errors: 0, Skipped: 0, Time elapsed: 0.656 sec
Forking command line: /bin/sh -c cd <https://builds.apache.org/job/HBase-0.92/ws/trunk>
&& /home/jenkins/tools/java/jdk1.6.0_20-32/jre/bin/java -enableassertions -Xmx1400m
-jar <https://builds.apache.org/job/HBase-0.92/ws/trunk/target/surefire/surefirebooter8400166016987682865.jar>
<https://builds.apache.org/job/HBase-0.92/ws/trunk/target/surefire/surefire1881700499002620402tmp>
<https://builds.apache.org/job/HBase-0.92/ws/trunk/target/surefire/surefire7077207563238655944tmp>
Running org.apache.hadoop.hbase.avro.TestAvroServer
Tests run: 3, Failures: 0, Errors: 0, Skipped: 0, Time elapsed: 35.072 sec
Forking command line: /bin/sh -c cd <https://builds.apache.org/job/HBase-0.92/ws/trunk>
&& /home/jenkins/tools/java/jdk1.6.0_20-32/jre/bin/java -enableassertions -Xmx1400m
-jar <https://builds.apache.org/job/HBase-0.92/ws/trunk/target/surefire/surefirebooter5165991832655779037.jar>
<https://builds.apache.org/job/HBase-0.92/ws/trunk/target/surefire/surefire1072654927527252786tmp>
<https://builds.apache.org/job/HBase-0.92/ws/trunk/target/surefire/surefire9054323876725113454tmp>
Running org.apache.hadoop.hbase.TestKeyValue
Tests run: 11, Failures: 0, Errors: 0, Skipped: 0, Time elapsed: 0.13 sec
Forking command line: /bin/sh -c cd <https://builds.apache.org/job/HBase-0.92/ws/trunk>
&& /home/jenkins/tools/java/jdk1.6.0_20-32/jre/bin/java -enableassertions -Xmx1400m
-jar <https://builds.apache.org/job/HBase-0.92/ws/trunk/target/surefire/surefirebooter464128745398033565.jar>
<https://builds.apache.org/job/HBase-0.92/ws/trunk/target/surefire/surefire3568322529235339814tmp>
<https://builds.apache.org/job/HBase-0.92/ws/trunk/target/surefire/surefire3057033410849614612tmp>
Running org.apache.hadoop.hbase.replication.TestMultiSlaveReplication
Tests run: 1, Failures: 0, Errors: 0, Skipped: 0, Time elapsed: 53.062 sec
Forking command line: /bin/sh -c cd <https://builds.apache.org/job/HBase-0.92/ws/trunk>
&& /home/jenkins/tools/java/jdk1.6.0_20-32/jre/bin/java -enableassertions -Xmx1400m
-jar <https://builds.apache.org/job/HBase-0.92/ws/trunk/target/surefire/surefirebooter1862995861471054209.jar>
<https://builds.apache.org/job/HBase-0.92/ws/trunk/target/surefire/surefire2025055746979145690tmp>
<https://builds.apache.org/job/HBase-0.92/ws/trunk/target/surefire/surefire2086786380802486657tmp>
Running org.apache.hadoop.hbase.replication.regionserver.TestReplicationSourceManager
Tests run: 1, Failures: 0, Errors: 0, Skipped: 0, Time elapsed: 0.903 sec
Forking command line: /bin/sh -c cd <https://builds.apache.org/job/HBase-0.92/ws/trunk>
&& /home/jenkins/tools/java/jdk1.6.0_20-32/jre/bin/java -enableassertions -Xmx1400m
-jar <https://builds.apache.org/job/HBase-0.92/ws/trunk/target/surefire/surefirebooter647038423514057243.jar>
<https://builds.apache.org/job/HBase-0.92/ws/trunk/target/surefire/surefire7503654604481142856tmp>
<https://builds.apache.org/job/HBase-0.92/ws/trunk/target/surefire/surefire8899231333739097921tmp>
Running org.apache.hadoop.hbase.replication.regionserver.TestReplicationSink
Tests run: 5, Failures: 0, Errors: 0, Skipped: 0, Time elapsed: 23.203 sec
Forking command line: /bin/sh -c cd <https://builds.apache.org/job/HBase-0.92/ws/trunk>
&& /home/jenkins/tools/java/jdk1.6.0_20-32/jre/bin/java -enableassertions -Xmx1400m
-jar <https://builds.apache.org/job/HBase-0.92/ws/trunk/target/surefire/surefirebooter6505661513355450879.jar>
<https://builds.apache.org/job/HBase-0.92/ws/trunk/target/surefire/surefire1362040363038596865tmp>
<https://builds.apache.org/job/HBase-0.92/ws/trunk/target/surefire/surefire6185702665735212355tmp>
Running org.apache.hadoop.hbase.replication.TestMasterReplication
Tests run: 2, Failures: 0, Errors: 0, Skipped: 0, Time elapsed: 84.282 sec
Forking command line: /bin/sh -c cd <https://builds.apache.org/job/HBase-0.92/ws/trunk>
&& /home/jenkins/tools/java/jdk1.6.0_20-32/jre/bin/java -enableassertions -Xmx1400m
-jar <https://builds.apache.org/job/HBase-0.92/ws/trunk/target/surefire/surefirebooter9083945157844274190.jar>
<https://builds.apache.org/job/HBase-0.92/ws/trunk/target/surefire/surefire1862468337142200061tmp>
<https://builds.apache.org/job/HBase-0.92/ws/trunk/target/surefire/surefire1321376465258017661tmp>
Running org.apache.hadoop.hbase.replication.TestReplicationSource
Tests run: 1, Failures: 0, Errors: 0, Skipped: 0, Time elapsed: 1.861 sec
Forking command line: /bin/sh -c cd <https://builds.apache.org/job/HBase-0.92/ws/trunk>
&& /home/jenkins/tools/java/jdk1.6.0_20-32/jre/bin/java -enableassertions -Xmx1400m
-jar <https://builds.apache.org/job/HBase-0.92/ws/trunk/target/surefire/surefirebooter4596090735169557906.jar>
<https://builds.apache.org/job/HBase-0.92/ws/trunk/target/surefire/surefire4217194979696430313tmp>
<https://builds.apache.org/job/HBase-0.92/ws/trunk/target/surefire/surefire1349383319247614534tmp>
Running org.apache.hadoop.hbase.replication.TestReplicationPeer
Tests run: 1, Failures: 0, Errors: 0, Skipped: 0, Time elapsed: 25.502 sec
Forking command line: /bin/sh -c cd <https://builds.apache.org/job/HBase-0.92/ws/trunk>
&& /home/jenkins/tools/java/jdk1.6.0_20-32/jre/bin/java -enableassertions -Xmx1400m
-jar <https://builds.apache.org/job/HBase-0.92/ws/trunk/target/surefire/surefirebooter3828945328264260490.jar>
<https://builds.apache.org/job/HBase-0.92/ws/trunk/target/surefire/surefire788990103364346986tmp>
<https://builds.apache.org/job/HBase-0.92/ws/trunk/target/surefire/surefire816131760467966667tmp>
Running org.apache.hadoop.hbase.replication.TestReplication
Tests run: 7, Failures: 0, Errors: 0, Skipped: 0, Time elapsed: 95.482 sec
Forking command line: /bin/sh -c cd <https://builds.apache.org/job/HBase-0.92/ws/trunk>
&& /home/jenkins/tools/java/jdk1.6.0_20-32/jre/bin/java -enableassertions -Xmx1400m
-jar <https://builds.apache.org/job/HBase-0.92/ws/trunk/target/surefire/surefirebooter6680472534053453522.jar>
<https://builds.apache.org/job/HBase-0.92/ws/trunk/target/surefire/surefire4981692174420900821tmp>
<https://builds.apache.org/job/HBase-0.92/ws/trunk/target/surefire/surefire8521491506653179644tmp>
Running org.apache.hadoop.hbase.ipc.TestDelayedRpc
Tests run: 4, Failures: 0, Errors: 0, Skipped: 0, Time elapsed: 2.498 sec
Forking command line: /bin/sh -c cd <https://builds.apache.org/job/HBase-0.92/ws/trunk>
&& /home/jenkins/tools/java/jdk1.6.0_20-32/jre/bin/java -enableassertions -Xmx1400m
-jar <https://builds.apache.org/job/HBase-0.92/ws/trunk/target/surefire/surefirebooter6465291563914196240.jar>
<https://builds.apache.org/job/HBase-0.92/ws/trunk/target/surefire/surefire8252377891875952922tmp>
<https://builds.apache.org/job/HBase-0.92/ws/trunk/target/surefire/surefire25970322526286304tmp>
Running org.apache.hadoop.hbase.TestCompare
Tests run: 1, Failures: 0, Errors: 0, Skipped: 0, Time elapsed: 0.233 sec
Forking command line: /bin/sh -c cd <https://builds.apache.org/job/HBase-0.92/ws/trunk>
&& /home/jenkins/tools/java/jdk1.6.0_20-32/jre/bin/java -enableassertions -Xmx1400m
-jar <https://builds.apache.org/job/HBase-0.92/ws/trunk/target/surefire/surefirebooter4661261876422956232.jar>
<https://builds.apache.org/job/HBase-0.92/ws/trunk/target/surefire/surefire7876931147801229918tmp>
<https://builds.apache.org/job/HBase-0.92/ws/trunk/target/surefire/surefire1755916372704253227tmp>
Running org.apache.hadoop.hbase.TestZooKeeper
Tests run: 7, Failures: 0, Errors: 0, Skipped: 0, Time elapsed: 87.77 sec
Forking command line: /bin/sh -c cd <https://builds.apache.org/job/HBase-0.92/ws/trunk>
&& /home/jenkins/tools/java/jdk1.6.0_20-32/jre/bin/java -enableassertions -Xmx1400m
-jar <https://builds.apache.org/job/HBase-0.92/ws/trunk/target/surefire/surefirebooter926950053234574204.jar>
<https://builds.apache.org/job/HBase-0.92/ws/trunk/target/surefire/surefire6645840159788438979tmp>
<https://builds.apache.org/job/HBase-0.92/ws/trunk/target/surefire/surefire387810748903303635tmp>
Running org.apache.hadoop.hbase.TestHBaseTestingUtility
Tests run: 6, Failures: 0, Errors: 0, Skipped: 0, Time elapsed: 57.619 sec

Results :

Failed tests:   testSizes(org.apache.hadoop.hbase.io.TestHeapSize): expected:<176> but
was:<168>

Tests run: 1022, Failures: 1, Errors: 0, Skipped: 9

[INFO] ------------------------------------------------------------------------
[INFO] BUILD FAILURE
[INFO] ------------------------------------------------------------------------
[INFO] Total time: 1:50:29.233s
[INFO] Finished at: Wed Oct 12 14:16:08 UTC 2011
[INFO] Final Memory: 41M/856M
[INFO] ------------------------------------------------------------------------
[ERROR] Failed to execute goal org.apache.maven.plugins:maven-surefire-plugin:2.9:test (default-test)
on project hbase: There are test failures.
[ERROR] 
[ERROR] Please refer to <https://builds.apache.org/job/HBase-0.92/ws/trunk/target/surefire-reports>
for the individual test results.
[ERROR] -> [Help 1]
org.apache.maven.lifecycle.LifecycleExecutionException: Failed to execute goal org.apache.maven.plugins:maven-surefire-plugin:2.9:test
(default-test) on project hbase: There are test failures.

Please refer to <https://builds.apache.org/job/HBase-0.92/ws/trunk/target/surefire-reports>
for the individual test results.
	at org.apache.maven.lifecycle.internal.MojoExecutor.execute(MojoExecutor.java:213)
	at org.apache.maven.lifecycle.internal.MojoExecutor.execute(MojoExecutor.java:153)
	at org.apache.maven.lifecycle.internal.MojoExecutor.execute(MojoExecutor.java:145)
	at org.apache.maven.lifecycle.internal.MojoExecutor.executeForkedExecutions(MojoExecutor.java:365)
	at org.apache.maven.lifecycle.internal.MojoExecutor.execute(MojoExecutor.java:199)
	at org.apache.maven.lifecycle.internal.MojoExecutor.execute(MojoExecutor.java:153)
	at org.apache.maven.lifecycle.internal.MojoExecutor.execute(MojoExecutor.java:145)
	at org.apache.maven.lifecycle.internal.LifecycleModuleBuilder.buildProject(LifecycleModuleBuilder.java:84)
	at org.apache.maven.lifecycle.internal.LifecycleModuleBuilder.buildProject(LifecycleModuleBuilder.java:59)
	at org.apache.maven.lifecycle.internal.LifecycleStarter.singleThreadedBuild(LifecycleStarter.java:183)
	at org.apache.maven.lifecycle.internal.LifecycleStarter.execute(LifecycleStarter.java:161)
	at org.apache.maven.DefaultMaven.doExecute(DefaultMaven.java:319)
	at org.apache.maven.DefaultMaven.execute(DefaultMaven.java:156)
	at org.apache.maven.cli.MavenCli.execute(MavenCli.java:537)
	at org.apache.maven.cli.MavenCli.doMain(MavenCli.java:196)
	at org.apache.maven.cli.MavenCli.main(MavenCli.java:141)
	at sun.reflect.NativeMethodAccessorImpl.invoke0(Native Method)
	at sun.reflect.NativeMethodAccessorImpl.invoke(NativeMethodAccessorImpl.java:39)
	at sun.reflect.DelegatingMethodAccessorImpl.invoke(DelegatingMethodAccessorImpl.java:25)
	at java.lang.reflect.Method.invoke(Method.java:597)
	at org.codehaus.plexus.classworlds.launcher.Launcher.launchEnhanced(Launcher.java:290)
	at org.codehaus.plexus.classworlds.launcher.Launcher.launch(Launcher.java:230)
	at org.codehaus.plexus.classworlds.launcher.Launcher.mainWithExitCode(Launcher.java:409)
	at org.codehaus.plexus.classworlds.launcher.Launcher.main(Launcher.java:352)
Caused by: org.apache.maven.plugin.MojoFailureException: There are test failures.

Please refer to <https://builds.apache.org/job/HBase-0.92/ws/trunk/target/surefire-reports>
for the individual test results.
	at org.apache.maven.plugin.surefire.SurefireHelper.reportExecution(SurefireHelper.java:87)
	at org.apache.maven.plugin.surefire.SurefirePlugin.writeSummary(SurefirePlugin.java:631)
	at org.apache.maven.plugin.surefire.SurefirePlugin.handleSummary(SurefirePlugin.java:605)
	at org.apache.maven.plugin.surefire.AbstractSurefireMojo.executeAfterPreconditionsChecked(AbstractSurefireMojo.java:136)
	at org.apache.maven.plugin.surefire.AbstractSurefireMojo.execute(AbstractSurefireMojo.java:97)
	at org.apache.maven.plugin.DefaultBuildPluginManager.executeMojo(DefaultBuildPluginManager.java:101)
	at org.apache.maven.lifecycle.internal.MojoExecutor.execute(MojoExecutor.java:209)
	... 23 more
[ERROR] 
[ERROR] 
[ERROR] For more information about the errors and possible solutions, please read the following
articles:
[ERROR] [Help 1] http://cwiki.apache.org/confluence/display/MAVEN/MojoFailureException
Build step 'Invoke top-level Maven targets' marked build as failure
[locks-and-latches] Releasing all the locks
[locks-and-latches] All the locks released
Archiving artifacts
Recording test results
Updating HBASE-4422


Mime
View raw message