hbase-dev mailing list archives

Site index · List index
Message view « Date » · « Thread »
Top « Date » · « Thread »
From Gary Helmling <ghelml...@gmail.com>
Subject Re: Build failed in Jenkins: HBase-0.92 #30
Date Thu, 29 Sep 2011 23:08:47 GMT
Created HBASE-4518 to deal with TestServerCustomProtocol flakiness.



On Thu, Sep 29, 2011 at 3:54 PM, Apache Jenkins Server <
jenkins@builds.apache.org> wrote:

> See <https://builds.apache.org/job/HBase-0.92/30/changes>
>
> Changes:
>
> [stack] HBASE-4513 NOTICES.txt refers to Facebook for Thrift
>
> [ramkrishna] HBASE-4512 JVMClusterUtil throwing wrong exception when master
> thread cannot be created (Ram)
>
> ------------------------------------------
> [...truncated 1641 lines...]
> Running org.apache.hadoop.hbase.regionserver.TestStore
> Tests run: 11, Failures: 0, Errors: 0, Skipped: 0, Time elapsed: 2.101 sec
> Running org.apache.hadoop.hbase.regionserver.TestRpcMetrics
> Tests run: 1, Failures: 0, Errors: 0, Skipped: 0, Time elapsed: 1.89 sec
> Running org.apache.hadoop.hbase.regionserver.TestCompoundBloomFilter
> Tests run: 3, Failures: 0, Errors: 0, Skipped: 0, Time elapsed: 24.157 sec
> Running org.apache.hadoop.hbase.regionserver.TestBlocksRead
> Tests run: 2, Failures: 0, Errors: 0, Skipped: 0, Time elapsed: 0.963 sec
> Running org.apache.hadoop.hbase.regionserver.TestKeyValueScanFixture
> Tests run: 1, Failures: 0, Errors: 0, Skipped: 0, Time elapsed: 0.112 sec
> Running org.apache.hadoop.hbase.regionserver.TestExplicitColumnTracker
> Tests run: 4, Failures: 0, Errors: 0, Skipped: 0, Time elapsed: 0.83 sec
> Running org.apache.hadoop.hbase.regionserver.TestStoreFile
> Tests run: 8, Failures: 0, Errors: 0, Skipped: 0, Time elapsed: 49.245 sec
> Running org.apache.hadoop.hbase.regionserver.TestWideScanner
> Tests run: 1, Failures: 0, Errors: 0, Skipped: 0, Time elapsed: 14.874 sec
> Running org.apache.hadoop.hbase.regionserver.TestQueryMatcher
> Tests run: 4, Failures: 0, Errors: 0, Skipped: 0, Time elapsed: 0.476 sec
> Running
> org.apache.hadoop.hbase.regionserver.TestReadWriteConsistencyControl
> Tests run: 1, Failures: 0, Errors: 0, Skipped: 0, Time elapsed: 10.105 sec
> Running org.apache.hadoop.hbase.regionserver.TestResettingCounters
> Tests run: 1, Failures: 0, Errors: 0, Skipped: 0, Time elapsed: 0.658 sec
> Running org.apache.hadoop.hbase.regionserver.TestStoreScanner
> Tests run: 14, Failures: 0, Errors: 0, Skipped: 0, Time elapsed: 0.136 sec
> Running org.apache.hadoop.hbase.regionserver.TestMinVersions
> Tests run: 6, Failures: 0, Errors: 0, Skipped: 0, Time elapsed: 1.422 sec
> Running org.apache.hadoop.hbase.regionserver.TestMemStoreLAB
> Tests run: 3, Failures: 0, Errors: 0, Skipped: 0, Time elapsed: 1.356 sec
> Running org.apache.hadoop.hbase.regionserver.TestSplitTransactionOnCluster
> Tests run: 4, Failures: 0, Errors: 0, Skipped: 0, Time elapsed: 46.556 sec
> Running org.apache.hadoop.hbase.regionserver.TestSplitTransaction
> Tests run: 6, Failures: 0, Errors: 0, Skipped: 0, Time elapsed: 4.466 sec
> Running org.apache.hadoop.hbase.regionserver.TestScanDeleteTracker
> Tests run: 6, Failures: 0, Errors: 0, Skipped: 0, Time elapsed: 0.537 sec
> Running org.apache.hadoop.hbase.regionserver.TestCompactSelection
> Tests run: 1, Failures: 0, Errors: 0, Skipped: 0, Time elapsed: 0.585 sec
> Running org.apache.hadoop.hbase.regionserver.TestStoreFileBlockCacheSummary
> Tests run: 1, Failures: 0, Errors: 0, Skipped: 0, Time elapsed: 15.908 sec
> Running org.apache.hadoop.hbase.regionserver.TestMemStore
> Tests run: 21, Failures: 0, Errors: 0, Skipped: 0, Time elapsed: 28.946 sec
> Running org.apache.hadoop.hbase.regionserver.TestGetClosestAtOrBefore
> Tests run: 3, Failures: 0, Errors: 0, Skipped: 0, Time elapsed: 7.246 sec
> Running org.apache.hadoop.hbase.regionserver.TestKeyValueSkipListSet
> Tests run: 4, Failures: 0, Errors: 0, Skipped: 0, Time elapsed: 0.118 sec
> Running org.apache.hadoop.hbase.regionserver.TestKeyValueHeap
> Tests run: 3, Failures: 0, Errors: 0, Skipped: 0, Time elapsed: 0.441 sec
> Running org.apache.hadoop.hbase.regionserver.TestScanner
> Tests run: 6, Failures: 0, Errors: 0, Skipped: 0, Time elapsed: 50.244 sec
> Running org.apache.hadoop.hbase.regionserver.TestRegionSplitPolicy
> Tests run: 3, Failures: 0, Errors: 0, Skipped: 0, Time elapsed: 0.668 sec
> Running org.apache.hadoop.hbase.regionserver.TestMultiColumnScanner
> Tests run: 6, Failures: 0, Errors: 0, Skipped: 0, Time elapsed: 21.596 sec
> Running org.apache.hadoop.hbase.regionserver.TestHRegionInfo
> Tests run: 3, Failures: 0, Errors: 0, Skipped: 0, Time elapsed: 0.542 sec
> Running org.apache.hadoop.hbase.regionserver.handler.TestCloseRegionHandler
> Tests run: 1, Failures: 0, Errors: 0, Skipped: 0, Time elapsed: 0.756 sec
> Running org.apache.hadoop.hbase.regionserver.handler.TestOpenRegionHandler
> Tests run: 3, Failures: 0, Errors: 0, Skipped: 0, Time elapsed: 0.814 sec
> Running org.apache.hadoop.hbase.regionserver.TestMasterAddressManager
> Tests run: 1, Failures: 0, Errors: 0, Skipped: 0, Time elapsed: 0.48 sec
> Running org.apache.hadoop.hbase.regionserver.TestSplitLogWorker
> Tests run: 5, Failures: 0, Errors: 0, Skipped: 0, Time elapsed: 1.976 sec
> Running org.apache.hadoop.hbase.regionserver.TestFSErrorsExposed
> Tests run: 3, Failures: 0, Errors: 0, Skipped: 0, Time elapsed: 35.767 sec
> Running org.apache.hadoop.hbase.TestHServerAddress
> Tests run: 6, Failures: 0, Errors: 0, Skipped: 0, Time elapsed: 0.066 sec
> Running org.apache.hadoop.hbase.filter.TestColumnRangeFilter
> Tests run: 1, Failures: 0, Errors: 0, Skipped: 0, Time elapsed: 39.047 sec
> Running org.apache.hadoop.hbase.filter.TestColumnPaginationFilter
> Tests run: 1, Failures: 0, Errors: 0, Skipped: 0, Time elapsed: 0.113 sec
> Running org.apache.hadoop.hbase.filter.TestPageFilter
> Tests run: 2, Failures: 0, Errors: 0, Skipped: 0, Time elapsed: 0.029 sec
> Running org.apache.hadoop.hbase.filter.TestParseFilter
> Tests run: 33, Failures: 0, Errors: 0, Skipped: 0, Time elapsed: 0.3 sec
> Running org.apache.hadoop.hbase.filter.TestRandomRowFilter
> Tests run: 2, Failures: 0, Errors: 0, Skipped: 0, Time elapsed: 0.579 sec
> Running org.apache.hadoop.hbase.filter.TestPrefixFilter
> Tests run: 3, Failures: 0, Errors: 0, Skipped: 0, Time elapsed: 0.106 sec
> Running org.apache.hadoop.hbase.filter.TestBitComparator
> Tests run: 3, Failures: 0, Errors: 0, Skipped: 0, Time elapsed: 0.032 sec
> Running org.apache.hadoop.hbase.filter.TestDependentColumnFilter
> Tests run: 2, Failures: 0, Errors: 0, Skipped: 0, Time elapsed: 0.771 sec
> Running org.apache.hadoop.hbase.filter.TestSingleColumnValueFilter
> Tests run: 2, Failures: 0, Errors: 0, Skipped: 0, Time elapsed: 0.154 sec
> Running org.apache.hadoop.hbase.filter.TestInclusiveStopFilter
> Tests run: 2, Failures: 0, Errors: 0, Skipped: 0, Time elapsed: 0.106 sec
> Running org.apache.hadoop.hbase.filter.TestFilterList
> Tests run: 5, Failures: 0, Errors: 0, Skipped: 0, Time elapsed: 0.238 sec
> Running org.apache.hadoop.hbase.filter.TestFilter
> Tests run: 18, Failures: 0, Errors: 0, Skipped: 0, Time elapsed: 4.789 sec
> Running org.apache.hadoop.hbase.filter.TestMultipleColumnPrefixFilter
> Tests run: 3, Failures: 0, Errors: 0, Skipped: 0, Time elapsed: 3.461 sec
> Running org.apache.hadoop.hbase.filter.TestColumnPrefixFilter
> Tests run: 2, Failures: 0, Errors: 0, Skipped: 0, Time elapsed: 2.685 sec
> Running org.apache.hadoop.hbase.filter.TestSingleColumnValueExcludeFilter
> Tests run: 1, Failures: 0, Errors: 0, Skipped: 0, Time elapsed: 0.119 sec
> Running org.apache.hadoop.hbase.TestGlobalMemStoreSize
> Tests run: 1, Failures: 0, Errors: 0, Skipped: 0, Time elapsed: 14.885 sec
> Running org.apache.hadoop.hbase.TestHBaseTestingUtility
> Tests run: 6, Failures: 0, Errors: 0, Skipped: 0, Time elapsed: 63.305 sec
> Running org.apache.hadoop.hbase.security.TestUser
> Tests run: 2, Failures: 0, Errors: 0, Skipped: 0, Time elapsed: 0.251 sec
> Running org.apache.hadoop.hbase.TestRegionRebalancing
> Tests run: 1, Failures: 0, Errors: 0, Skipped: 0, Time elapsed: 52.883 sec
> Running org.apache.hadoop.hbase.replication.TestReplication
> Tests run: 7, Failures: 0, Errors: 0, Skipped: 0, Time elapsed: 98.709 sec
> Running org.apache.hadoop.hbase.replication.TestMasterReplication
> Tests run: 2, Failures: 0, Errors: 0, Skipped: 0, Time elapsed: 76.333 sec
> Running
> org.apache.hadoop.hbase.replication.regionserver.TestReplicationSourceManager
> Tests run: 1, Failures: 0, Errors: 0, Skipped: 0, Time elapsed: 0.848 sec
> Running
> org.apache.hadoop.hbase.replication.regionserver.TestReplicationSink
> Tests run: 5, Failures: 0, Errors: 0, Skipped: 0, Time elapsed: 23.658 sec
> Running org.apache.hadoop.hbase.replication.TestMultiSlaveReplication
> Tests run: 1, Failures: 0, Errors: 0, Skipped: 0, Time elapsed: 49.762 sec
> Running org.apache.hadoop.hbase.replication.TestReplicationSource
> Tests run: 1, Failures: 0, Errors: 0, Skipped: 0, Time elapsed: 1.658 sec
> Running org.apache.hadoop.hbase.avro.TestAvroServer
> Tests run: 3, Failures: 0, Errors: 0, Skipped: 0, Time elapsed: 31.437 sec
> Running org.apache.hadoop.hbase.TestAcidGuarantees
> Tests run: 3, Failures: 0, Errors: 0, Skipped: 3, Time elapsed: 0.06 sec
> Running org.apache.hadoop.hbase.TestKeyValue
> Tests run: 11, Failures: 0, Errors: 0, Skipped: 0, Time elapsed: 0.126 sec
> Running
> org.apache.hadoop.hbase.coprocessor.TestRegionServerCoprocessorExceptionWithRemove
> Tests run: 1, Failures: 0, Errors: 0, Skipped: 0, Time elapsed: 24.235 sec
> Running org.apache.hadoop.hbase.coprocessor.TestRegionObserverInterface
> Tests run: 5, Failures: 0, Errors: 0, Skipped: 0, Time elapsed: 32.192 sec
> Running org.apache.hadoop.hbase.coprocessor.TestCoprocessorInterface
> Tests run: 1, Failures: 0, Errors: 0, Skipped: 0, Time elapsed: 3.789 sec
> Running org.apache.hadoop.hbase.coprocessor.TestMasterObserver
> Tests run: 3, Failures: 0, Errors: 0, Skipped: 0, Time elapsed: 32.329 sec
> Running org.apache.hadoop.hbase.coprocessor.TestCoprocessorEndpoint
> Tests run: 2, Failures: 0, Errors: 0, Skipped: 0, Time elapsed: 27.246 sec
> Running org.apache.hadoop.hbase.coprocessor.TestWALObserver
> Tests run: 3, Failures: 0, Errors: 0, Skipped: 0, Time elapsed: 19.541 sec
> Running org.apache.hadoop.hbase.coprocessor.TestRegionObserverBypass
> Tests run: 2, Failures: 0, Errors: 0, Skipped: 0, Time elapsed: 19.345 sec
> Running
> org.apache.hadoop.hbase.coprocessor.TestMasterCoprocessorExceptionWithAbort
> Tests run: 1, Failures: 0, Errors: 0, Skipped: 0, Time elapsed: 20.172 sec
> Running
> org.apache.hadoop.hbase.coprocessor.TestRegionServerCoprocessorExceptionWithAbort
> Tests run: 1, Failures: 0, Errors: 0, Skipped: 0, Time elapsed: 18.993 sec
> Running org.apache.hadoop.hbase.coprocessor.TestAggregateProtocol
> Tests run: 44, Failures: 0, Errors: 0, Skipped: 0, Time elapsed: 26.105 sec
> Running
> org.apache.hadoop.hbase.coprocessor.TestMasterCoprocessorExceptionWithRemove
> Tests run: 1, Failures: 0, Errors: 0, Skipped: 0, Time elapsed: 23.902 sec
> Running org.apache.hadoop.hbase.coprocessor.TestRegionObserverStacking
> Tests run: 1, Failures: 0, Errors: 0, Skipped: 0, Time elapsed: 0.58 sec
> Running org.apache.hadoop.hbase.coprocessor.TestClassLoading
> Tests run: 3, Failures: 0, Errors: 0, Skipped: 0, Time elapsed: 19.89 sec
> Running org.apache.hadoop.hbase.TestScanMultipleVersions
> Tests run: 1, Failures: 0, Errors: 0, Skipped: 0, Time elapsed: 17.24 sec
> Running org.apache.hadoop.hbase.mapred.TestTableMapReduce
> Tests run: 1, Failures: 0, Errors: 0, Skipped: 0, Time elapsed: 39.191 sec
> Running org.apache.hadoop.hbase.mapred.TestTableInputFormat
> Tests run: 6, Failures: 0, Errors: 0, Skipped: 0, Time elapsed: 19.619 sec
> Running org.apache.hadoop.hbase.TestServerName
> Tests run: 2, Failures: 0, Errors: 0, Skipped: 0, Time elapsed: 0.054 sec
> Running org.apache.hadoop.hbase.master.TestActiveMasterManager
> Tests run: 2, Failures: 0, Errors: 0, Skipped: 0, Time elapsed: 0.681 sec
> Running org.apache.hadoop.hbase.master.TestMasterFailover
> Running org.apache.hadoop.hbase.master.TestMasterRestartAfterDisablingTable
> Tests run: 1, Failures: 0, Errors: 0, Skipped: 0, Time elapsed: 22.93 sec
> Running org.apache.hadoop.hbase.master.TestCatalogJanitor
> Tests run: 3, Failures: 0, Errors: 0, Skipped: 0, Time elapsed: 4.216 sec
> Running org.apache.hadoop.hbase.master.TestRollingRestart
> Tests run: 1, Failures: 0, Errors: 0, Skipped: 0, Time elapsed: 63.591 sec
> Running org.apache.hadoop.hbase.master.TestMasterTransitions
> Tests run: 3, Failures: 0, Errors: 0, Skipped: 3, Time elapsed: 18.377 sec
> Running org.apache.hadoop.hbase.master.TestRestartCluster
> Tests run: 2, Failures: 0, Errors: 0, Skipped: 0, Time elapsed: 51.05 sec
> Running org.apache.hadoop.hbase.master.TestMasterStatusServlet
> Tests run: 5, Failures: 0, Errors: 0, Skipped: 0, Time elapsed: 0.88 sec
> Running org.apache.hadoop.hbase.master.TestClockSkewDetection
> Tests run: 1, Failures: 0, Errors: 0, Skipped: 0, Time elapsed: 0.243 sec
> Running org.apache.hadoop.hbase.master.TestDefaultLoadBalancer
> Tests run: 4, Failures: 0, Errors: 0, Skipped: 0, Time elapsed: 1.479 sec
> Running org.apache.hadoop.hbase.master.TestHMasterRPCException
> Tests run: 1, Failures: 0, Errors: 0, Skipped: 0, Time elapsed: 1.037 sec
> Running org.apache.hadoop.hbase.master.TestDistributedLogSplitting
> Tests run: 4, Failures: 0, Errors: 0, Skipped: 0, Time elapsed: 114.085 sec
> Running org.apache.hadoop.hbase.master.TestMaster
> Tests run: 1, Failures: 0, Errors: 0, Skipped: 0, Time elapsed: 77.979 sec
> Running org.apache.hadoop.hbase.master.TestSplitLogManager
> Tests run: 10, Failures: 0, Errors: 0, Skipped: 0, Time elapsed: 13.884 sec
> Running org.apache.hadoop.hbase.master.TestDeadServer
> Tests run: 1, Failures: 0, Errors: 0, Skipped: 0, Time elapsed: 0.056 sec
> Running org.apache.hadoop.hbase.master.TestLogsCleaner
> Tests run: 1, Failures: 0, Errors: 0, Skipped: 0, Time elapsed: 1.186 sec
> Running org.apache.hadoop.hbase.master.TestZKBasedOpenCloseRegion
> Tests run: 3, Failures: 0, Errors: 0, Skipped: 0, Time elapsed: 22.084 sec
>
> Results :
>
> Failed tests:
> testRowRange(org.apache.hadoop.hbase.regionserver.TestServerCustomProtocol):
> Results should contain region
> test,bbb,1317332645939.aea9154349b9e0dc207e2e9476702763. for row 'bbb'
>
> Tests run: 1008, Failures: 1, Errors: 0, Skipped: 21
>
> [INFO]
> ------------------------------------------------------------------------
> [INFO] BUILD FAILURE
> [INFO]
> ------------------------------------------------------------------------
> [INFO] Total time: 1:58:09.109s
> [INFO] Finished at: Thu Sep 29 22:53:51 UTC 2011
> [INFO] Final Memory: 41M/706M
> [INFO]
> ------------------------------------------------------------------------
> [ERROR] Failed to execute goal
> org.apache.maven.plugins:maven-surefire-plugin:2.9:test (default-test) on
> project hbase: Failure or timeout -> [Help 1]
> org.apache.maven.lifecycle.LifecycleExecutionException: Failed to execute
> goal org.apache.maven.plugins:maven-surefire-plugin:2.9:test (default-test)
> on project hbase: Failure or timeout
>        at
> org.apache.maven.lifecycle.internal.MojoExecutor.execute(MojoExecutor.java:217)
>        at
> org.apache.maven.lifecycle.internal.MojoExecutor.execute(MojoExecutor.java:153)
>        at
> org.apache.maven.lifecycle.internal.MojoExecutor.execute(MojoExecutor.java:145)
>        at
> org.apache.maven.lifecycle.internal.MojoExecutor.executeForkedExecutions(MojoExecutor.java:365)
>        at
> org.apache.maven.lifecycle.internal.MojoExecutor.execute(MojoExecutor.java:199)
>        at
> org.apache.maven.lifecycle.internal.MojoExecutor.execute(MojoExecutor.java:153)
>        at
> org.apache.maven.lifecycle.internal.MojoExecutor.execute(MojoExecutor.java:145)
>        at
> org.apache.maven.lifecycle.internal.LifecycleModuleBuilder.buildProject(LifecycleModuleBuilder.java:84)
>        at
> org.apache.maven.lifecycle.internal.LifecycleModuleBuilder.buildProject(LifecycleModuleBuilder.java:59)
>        at
> org.apache.maven.lifecycle.internal.LifecycleStarter.singleThreadedBuild(LifecycleStarter.java:183)
>        at
> org.apache.maven.lifecycle.internal.LifecycleStarter.execute(LifecycleStarter.java:161)
>        at org.apache.maven.DefaultMaven.doExecute(DefaultMaven.java:319)
>        at org.apache.maven.DefaultMaven.execute(DefaultMaven.java:156)
>        at org.apache.maven.cli.MavenCli.execute(MavenCli.java:537)
>        at org.apache.maven.cli.MavenCli.doMain(MavenCli.java:196)
>        at org.apache.maven.cli.MavenCli.main(MavenCli.java:141)
>        at sun.reflect.NativeMethodAccessorImpl.invoke0(Native Method)
>        at
> sun.reflect.NativeMethodAccessorImpl.invoke(NativeMethodAccessorImpl.java:39)
>        at
> sun.reflect.DelegatingMethodAccessorImpl.invoke(DelegatingMethodAccessorImpl.java:25)
>        at java.lang.reflect.Method.invoke(Method.java:597)
>        at
> org.codehaus.plexus.classworlds.launcher.Launcher.launchEnhanced(Launcher.java:290)
>        at
> org.codehaus.plexus.classworlds.launcher.Launcher.launch(Launcher.java:230)
>        at
> org.codehaus.plexus.classworlds.launcher.Launcher.mainWithExitCode(Launcher.java:409)
>        at
> org.codehaus.plexus.classworlds.launcher.Launcher.main(Launcher.java:352)
> Caused by: org.apache.maven.plugin.MojoExecutionException: Failure or
> timeout
>        at
> org.apache.maven.plugin.surefire.SurefirePlugin.assertNoFailureOrTimeout(SurefirePlugin.java:623)
>        at
> org.apache.maven.plugin.surefire.SurefirePlugin.handleSummary(SurefirePlugin.java:604)
>        at
> org.apache.maven.plugin.surefire.AbstractSurefireMojo.executeAfterPreconditionsChecked(AbstractSurefireMojo.java:136)
>        at
> org.apache.maven.plugin.surefire.AbstractSurefireMojo.execute(AbstractSurefireMojo.java:97)
>        at
> org.apache.maven.plugin.DefaultBuildPluginManager.executeMojo(DefaultBuildPluginManager.java:101)
>        at
> org.apache.maven.lifecycle.internal.MojoExecutor.execute(MojoExecutor.java:209)
>        ... 23 more
> [ERROR]
> [ERROR] Re-run Maven using the -X switch to enable full debug logging.
> [ERROR]
> [ERROR] For more information about the errors and possible solutions,
> please read the following articles:
> [ERROR] [Help 1]
> http://cwiki.apache.org/confluence/display/MAVEN/MojoExecutionException
> Build step 'Invoke top-level Maven targets' marked build as failure
> [locks-and-latches] Releasing all the locks
> [locks-and-latches] All the locks released
> Archiving artifacts
> Recording test results
> Updating HBASE-4512
> Updating HBASE-4513
>
>

Mime
  • Unnamed multipart/alternative (inline, None, 0 bytes)
View raw message