hbase-dev mailing list archives

Site index · List index
Message view « Date » · « Thread »
Top « Date » · « Thread »
From Apache Jenkins Server <jenk...@builds.apache.org>
Subject Build failed in Jenkins: HBase-TRUNK-on-Hadoop-23 #32
Date Mon, 19 Sep 2011 00:03:53 GMT
See <https://builds.apache.org/job/HBase-TRUNK-on-Hadoop-23/32/changes>

Changes:

[stack] HBASE-4430 Disable TestSlabCache and TestSingleSizedCache temporarily to see if these
are cause of build box failure though all tests pass

[stack] HBASE-4375 [hbck] Add region coverage visualization to hbck

[stack] HBASE-4430 Disable TestSlabCache and TestSingleSizedCache temporarily to see if these
are cause of build box failure though all tests pass

[tedyu] HBASE-4428 addendum, call ctx.stop at the end of testCacheMultiThreaded(), not in
doAnAction()

------------------------------------------
[...truncated 2242 lines...]
1384 KB   1586 KB   
1387 KB   1586 KB   
1391 KB   1586 KB   
1395 KB   1586 KB   
1399 KB   1586 KB   
1403 KB   1586 KB   
1407 KB   1586 KB   
1411 KB   1586 KB   
1411 KB   1586 KB   
1411 KB   1590 KB   
1411 KB   1594 KB   
1411 KB   1598 KB   
1411 KB   1602 KB   
1411 KB   1606 KB   
1411 KB   1610 KB   
1411 KB   1614 KB   
1411 KB   1617 KB   
1411 KB   1621 KB   
1411 KB   1625 KB   
1411 KB   1629 KB   
1411 KB   1633 KB   
1411 KB   1637 KB   
1411 KB   1641 KB   
1411 KB   1645 KB   
1411 KB   1649 KB   
1411 KB   1650 KB   
1415 KB   1650 KB   
1419 KB   1650 KB   
1422 KB   1650 KB   
1426 KB   1650 KB   
1430 KB   1650 KB   
1434 KB   1650 KB   
1438 KB   1650 KB   
1442 KB   1650 KB   
1446 KB   1650 KB   
1450 KB   1650 KB   
1450 KB   1650 KB   
1454 KB   1650 KB   
1458 KB   1650 KB   
1462 KB   1650 KB   
1466 KB   1650 KB   
1470 KB   1650 KB   
1474 KB   1650 KB   
1476 KB   1650 KB   
1476 KB   1654 KB   
1476 KB   1658 KB   
1476 KB   1662 KB   
1476 KB   1666 KB   
1476 KB   1668 KB   
1479 KB   1668 KB   
1483 KB   1668 KB   
1484 KB   1668 KB   
1488 KB   1668 KB   
1492 KB   1668 KB   
1496 KB   1668 KB   
1500 KB   1668 KB   
1504 KB   1668 KB   
1508 KB   1668 KB   
1512 KB   1668 KB   
1514 KB   1668 KB   
1515 KB   1668 KB   
1519 KB   1668 KB   
1523 KB   1668 KB   
1527 KB   1668 KB   
1531 KB   1668 KB   
1534 KB   1668 KB   
                    
Downloaded: http://repository.apache.org/snapshots/org/apache/hadoop/hadoop-common/0.23.0-SNAPSHOT/hadoop-common-0.23.0-20110914.160844-310.jar
(1668 KB at 1560.3 KB/sec)
                    
Downloaded: http://repository.apache.org/snapshots/org/apache/hadoop/hadoop-hdfs/0.23.0-SNAPSHOT/hadoop-hdfs-0.23.0-20110914.160902-373.jar
(1534 KB at 1368.3 KB/sec)
[INFO] 
[INFO] --- maven-clean-plugin:2.4.1:clean (default-clean) @ hbase ---
[INFO] 
[INFO] --- xml-maven-plugin:1.0-beta-3:transform (default) @ hbase ---
[INFO] Transforming file: <https://builds.apache.org/job/HBase-TRUNK-on-Hadoop-23/ws/trunk/src/main/resources/hbase-default.xml>
[INFO] Transformed 1 file(s).
[INFO] 
[INFO] --- docbkx-maven-plugin:2.0.11:generate-html (multipage) @ hbase ---
[INFO] Processing input file: ops_mgt.xml
[INFO] <https://builds.apache.org/job/HBase-TRUNK-on-Hadoop-23/ws/trunk/target/site/book/ops_mgt.html>
has been generated.
[INFO] Processing input file: troubleshooting.xml
[INFO] <https://builds.apache.org/job/HBase-TRUNK-on-Hadoop-23/ws/trunk/target/site/book/troubleshooting.html>
has been generated.
[INFO] Processing input file: configuration.xml
[INFO] <https://builds.apache.org/job/HBase-TRUNK-on-Hadoop-23/ws/trunk/target/site/book/configuration.html>
has been generated.
[INFO] Processing input file: getting_started.xml
[INFO] <https://builds.apache.org/job/HBase-TRUNK-on-Hadoop-23/ws/trunk/target/site/book/getting_started.html>
has been generated.
[INFO] Processing input file: book.xml
[INFO] <https://builds.apache.org/job/HBase-TRUNK-on-Hadoop-23/ws/trunk/target/site/book/book.html>
has been generated.
[INFO] <https://builds.apache.org/job/HBase-TRUNK-on-Hadoop-23/ws/trunk/target/site/book/shell.html>
is up to date.
[INFO] <https://builds.apache.org/job/HBase-TRUNK-on-Hadoop-23/ws/trunk/target/site/book/performance.html>
is up to date.
[INFO] <https://builds.apache.org/job/HBase-TRUNK-on-Hadoop-23/ws/trunk/target/site/book/upgrading.html>
is up to date.
[INFO] <https://builds.apache.org/job/HBase-TRUNK-on-Hadoop-23/ws/trunk/target/site/book/external_apis.html>
is up to date.
[INFO] <https://builds.apache.org/job/HBase-TRUNK-on-Hadoop-23/ws/trunk/target/site/book/preface.html>
is up to date.
[INFO] <https://builds.apache.org/job/HBase-TRUNK-on-Hadoop-23/ws/trunk/target/site/book/build.html>
is up to date.
[INFO] <https://builds.apache.org/job/HBase-TRUNK-on-Hadoop-23/ws/trunk/target/site/book/developer.html>
is up to date.
[INFO] 
[INFO] --- docbkx-maven-plugin:2.0.11:generate-html (onepage) @ hbase ---
[INFO] Processing input file: ops_mgt.xml
[INFO] <https://builds.apache.org/job/HBase-TRUNK-on-Hadoop-23/32/artifact/trunk/target/site/ops_mgt.html>
has been generated.
[INFO] Processing input file: troubleshooting.xml
[INFO] <https://builds.apache.org/job/HBase-TRUNK-on-Hadoop-23/32/artifact/trunk/target/site/troubleshooting.html>
has been generated.
[INFO] Processing input file: configuration.xml
[INFO] <https://builds.apache.org/job/HBase-TRUNK-on-Hadoop-23/32/artifact/trunk/target/site/configuration.html>
has been generated.
[INFO] Processing input file: getting_started.xml
[INFO] <https://builds.apache.org/job/HBase-TRUNK-on-Hadoop-23/32/artifact/trunk/target/site/getting_started.html>
has been generated.
[INFO] Processing input file: book.xml
[INFO] <https://builds.apache.org/job/HBase-TRUNK-on-Hadoop-23/32/artifact/trunk/target/site/book.html>
has been generated.
[INFO] Processing input file: shell.xml
[INFO] <https://builds.apache.org/job/HBase-TRUNK-on-Hadoop-23/32/artifact/trunk/target/site/shell.html>
has been generated.
[INFO] Processing input file: performance.xml
[INFO] <https://builds.apache.org/job/HBase-TRUNK-on-Hadoop-23/32/artifact/trunk/target/site/performance.html>
has been generated.
[INFO] Processing input file: upgrading.xml
[INFO] <https://builds.apache.org/job/HBase-TRUNK-on-Hadoop-23/32/artifact/trunk/target/site/upgrading.html>
has been generated.
[INFO] Processing input file: external_apis.xml
[INFO] <https://builds.apache.org/job/HBase-TRUNK-on-Hadoop-23/32/artifact/trunk/target/site/external_apis.html>
has been generated.
[INFO] Processing input file: preface.xml
[INFO] <https://builds.apache.org/job/HBase-TRUNK-on-Hadoop-23/32/artifact/trunk/target/site/preface.html>
has been generated.
[INFO] Processing input file: build.xml
[INFO] <https://builds.apache.org/job/HBase-TRUNK-on-Hadoop-23/32/artifact/trunk/target/site/build.html>
has been generated.
[INFO] Processing input file: developer.xml
[INFO] <https://builds.apache.org/job/HBase-TRUNK-on-Hadoop-23/32/artifact/trunk/target/site/developer.html>
has been generated.
[INFO] 
[INFO] --- maven-site-plugin:2.0.1:site (default-site) @ hbase ---
[INFO] Unable to load parent project from a relative path: 1 problem was encountered while
building the effective model
[FATAL] Non-readable POM <https://builds.apache.org/job/HBase-TRUNK-on-Hadoop-23/ws/pom.xml>:
<https://builds.apache.org/job/HBase-TRUNK-on-Hadoop-23/ws/pom.xml> (No such file or
directory) @ 
 for project  at <https://builds.apache.org/job/HBase-TRUNK-on-Hadoop-23/ws/pom.xml>
for project  at <https://builds.apache.org/job/HBase-TRUNK-on-Hadoop-23/ws/pom.xml>
[INFO] Parent project loaded from repository.
[INFO] Unable to load parent project from a relative path: 1 problem was encountered while
building the effective model
[FATAL] Non-readable POM <https://builds.apache.org/job/HBase-TRUNK-on-Hadoop-23/ws/pom.xml>:
<https://builds.apache.org/job/HBase-TRUNK-on-Hadoop-23/ws/pom.xml> (No such file or
directory) @ 
 for project  at <https://builds.apache.org/job/HBase-TRUNK-on-Hadoop-23/ws/pom.xml>
for project  at <https://builds.apache.org/job/HBase-TRUNK-on-Hadoop-23/ws/pom.xml>
[INFO] Parent project loaded from repository.
Downloading: http://repository.codehaus.org/org/apache/maven/skins/maven-stylus-skin/maven-metadata.xml
Downloading: http://download.java.net/maven/2/org/apache/maven/skins/maven-stylus-skin/maven-metadata.xml
Downloading: https://repository.apache.org/content/repositories/releases/org/apache/maven/skins/maven-stylus-skin/maven-metadata.xml
Downloading: http://people.apache.org/~rawson/repo/org/apache/maven/skins/maven-stylus-skin/maven-metadata.xml
                    
Downloading: http://repository.jboss.org/nexus/content/groups/public-jboss/org/apache/maven/skins/maven-stylus-skin/maven-metadata.xml
458 B               
        
Downloading: http://repo1.maven.org/maven2/org/apache/maven/skins/maven-stylus-skin/maven-metadata.xml
        
458 B   458 B   
                
                
Downloaded: https://repository.apache.org/content/repositories/releases/org/apache/maven/skins/maven-stylus-skin/maven-metadata.xml
(458 B at 0.8 KB/sec)
                
Downloaded: http://repo1.maven.org/maven2/org/apache/maven/skins/maven-stylus-skin/maven-metadata.xml
(458 B at 1.2 KB/sec)
[INFO]                                                                         
[INFO] ------------------------------------------------------------------------
[INFO] Building HBase 0.91.0-SNAPSHOT
[INFO] ------------------------------------------------------------------------
[INFO] 
[INFO] >>> maven-assembly-plugin:2.2-beta-5:assembly (default-cli) @ hbase >>>
[INFO] 
[INFO] --- avro-maven-plugin:1.5.3:schema (generate-avro-sources) @ hbase ---
[INFO] 
[INFO] --- avro-maven-plugin:1.5.3:protocol (generate-avro-sources) @ hbase ---
[INFO] 
[INFO] --- maven-antrun-plugin:1.6:run (generate) @ hbase ---
[INFO] Executing tasks

main:
    [mkdir] Created dir: <https://builds.apache.org/job/HBase-TRUNK-on-Hadoop-23/ws/trunk/target/hbase-webapps>
     [copy] Copying 5 files to <https://builds.apache.org/job/HBase-TRUNK-on-Hadoop-23/ws/trunk/target/hbase-webapps>
log4j:WARN No appenders could be found for logger (org.mortbay.log).
log4j:WARN Please initialize the log4j system properly.
log4j:WARN See http://logging.apache.org/log4j/1.2/faq.html#noconfig for more info.
    [mkdir] Created dir: <https://builds.apache.org/job/HBase-TRUNK-on-Hadoop-23/ws/trunk/target/hbase-webapps/master/WEB-INF>
    [mkdir] Created dir: <https://builds.apache.org/job/HBase-TRUNK-on-Hadoop-23/ws/trunk/target/hbase-webapps/regionserver/WEB-INF>
[INFO] Executed tasks
[INFO] 
[INFO] --- build-helper-maven-plugin:1.5:add-source (jspcSource-packageInfo-Avro-source) @
hbase ---
[INFO] Source directory: <https://builds.apache.org/job/HBase-TRUNK-on-Hadoop-23/ws/trunk/target/generated-jamon>
added.
[INFO] Source directory: <https://builds.apache.org/job/HBase-TRUNK-on-Hadoop-23/ws/trunk/target/generated-sources/java>
added.
[INFO] 
[INFO] --- jamon-maven-plugin:2.3.4:translate (default) @ hbase ---
[INFO] Translating 4 templates from <https://builds.apache.org/job/HBase-TRUNK-on-Hadoop-23/ws/trunk/src/main/jamon>
to <https://builds.apache.org/job/HBase-TRUNK-on-Hadoop-23/ws/trunk/target/generated-jamon>
[INFO] 
[INFO] --- maven-remote-resources-plugin:1.1:process (default) @ hbase ---
[INFO] Setting property: classpath.resource.loader.class => 'org.codehaus.plexus.velocity.ContextClassLoaderResourceLoader'.
[INFO] Setting property: velocimacro.messages.on => 'false'.
[INFO] Setting property: resource.loader => 'classpath'.
[INFO] Setting property: resource.manager.logwhenfound => 'false'.
Downloading: https://repository.apache.org/content/repositories/snapshots/org/apache/hadoop/hadoop-project/0.23.0-SNAPSHOT/maven-metadata.xml
612 B           
        
Downloaded: https://repository.apache.org/content/repositories/snapshots/org/apache/hadoop/hadoop-project/0.23.0-SNAPSHOT/maven-metadata.xml
(612 B at 1.3 KB/sec)
[INFO] 
[INFO] --- maven-resources-plugin:2.4:resources (default-resources) @ hbase ---
[INFO] Using 'UTF-8' encoding to copy filtered resources.
[INFO] Copying 1 resource
[INFO] Copying 7 resources
[INFO] Copying 3 resources
[INFO] 
[INFO] --- maven-antrun-plugin:1.6:run (default) @ hbase ---
[INFO] Executing tasks

main:
    [mkdir] Created dir: <https://builds.apache.org/job/HBase-TRUNK-on-Hadoop-23/ws/trunk/target/nativelib>
     [exec] tar: hadoop-snappy-nativelibs.tar: Cannot open: No such file or directory
     [exec] tar: Error is not recoverable: exiting now
     [exec] Result: 2
[INFO] Executed tasks
[INFO] 
[INFO] --- maven-compiler-plugin:2.0.2:compile (default-compile) @ hbase ---
[INFO] Compiling 599 source files to <https://builds.apache.org/job/HBase-TRUNK-on-Hadoop-23/ws/trunk/target/classes>
[INFO] ------------------------------------------------------------------------
[INFO] BUILD FAILURE
[INFO] ------------------------------------------------------------------------
[INFO] Total time: 44.152s
[INFO] Finished at: Mon Sep 19 00:03:42 UTC 2011
[INFO] Final Memory: 42M/816M
[INFO] ------------------------------------------------------------------------
[ERROR] Failed to execute goal org.apache.maven.plugins:maven-compiler-plugin:2.0.2:compile
(default-compile) on project hbase: Compilation failure: Compilation failure:
[ERROR] <https://builds.apache.org/job/HBase-TRUNK-on-Hadoop-23/ws/trunk/src/main/java/org/apache/hadoop/hbase/util/FSUtils.java>:[40,38]
cannot find symbol
[ERROR] symbol  : class FSConstants
[ERROR] location: package org.apache.hadoop.hdfs.protocol
[ERROR] 
[ERROR] <https://builds.apache.org/job/HBase-TRUNK-on-Hadoop-23/ws/trunk/src/main/java/org/apache/hadoop/hbase/util/Bytes.java>:[44,15]
sun.misc.Unsafe is Sun proprietary API and may be removed in a future release
[ERROR] 
[ERROR] <https://builds.apache.org/job/HBase-TRUNK-on-Hadoop-23/ws/trunk/src/main/java/org/apache/hadoop/hbase/util/FSHDFSUtils.java>:[35,38]
cannot find symbol
[ERROR] symbol  : class FSConstants
[ERROR] location: package org.apache.hadoop.hdfs.protocol
[ERROR] 
[ERROR] <https://builds.apache.org/job/HBase-TRUNK-on-Hadoop-23/ws/trunk/src/main/java/org/apache/hadoop/hbase/util/Bytes.java>:[1046,19]
sun.misc.Unsafe is Sun proprietary API and may be removed in a future release
[ERROR] 
[ERROR] <https://builds.apache.org/job/HBase-TRUNK-on-Hadoop-23/ws/trunk/src/main/java/org/apache/hadoop/hbase/util/FSUtils.java>:[166,48]
package FSConstants does not exist
[ERROR] 
[ERROR] <https://builds.apache.org/job/HBase-TRUNK-on-Hadoop-23/ws/trunk/src/main/java/org/apache/hadoop/hbase/util/FSUtils.java>:[442,38]
package FSConstants does not exist
[ERROR] 
[ERROR] <https://builds.apache.org/job/HBase-TRUNK-on-Hadoop-23/ws/trunk/src/main/java/org/apache/hadoop/hbase/util/Bytes.java>:[1052,21]
sun.misc.Unsafe is Sun proprietary API and may be removed in a future release
[ERROR] 
[ERROR] <https://builds.apache.org/job/HBase-TRUNK-on-Hadoop-23/ws/trunk/src/main/java/org/apache/hadoop/hbase/util/Bytes.java>:[1057,28]
sun.misc.Unsafe is Sun proprietary API and may be removed in a future release
[ERROR] 
[ERROR] <https://builds.apache.org/job/HBase-TRUNK-on-Hadoop-23/ws/trunk/src/main/java/org/apache/hadoop/hbase/util/FSHDFSUtils.java>:[89,26]
cannot find symbol
[ERROR] symbol  : variable FSConstants
[ERROR] location: class org.apache.hadoop.hbase.util.FSHDFSUtils
[ERROR] -> [Help 1]
[ERROR] 
[ERROR] To see the full stack trace of the errors, re-run Maven with the -e switch.
[ERROR] Re-run Maven using the -X switch to enable full debug logging.
[ERROR] 
[ERROR] For more information about the errors and possible solutions, please read the following
articles:
[ERROR] [Help 1] http://cwiki.apache.org/confluence/display/MAVEN/MojoFailureException
Build step 'Invoke top-level Maven targets' marked build as failure
[locks-and-latches] Releasing all the locks
[locks-and-latches] All the locks released
Archiving artifacts
Recording test results


Mime
View raw message