hbase-dev mailing list archives

Site index · List index
Message view « Date » · « Thread »
Top « Date » · « Thread »
From Ramkrishna S Vasudevan <ramakrish...@huawei.com>
Subject RE: Build failed in Jenkins: HBase-TRUNK #2186
Date Thu, 08 Sep 2011 07:03:28 GMT

Hi Gary

Yes, I have told this to Stack and Ted.

Regards
Ram


-----Original Message-----
From: Gary Helmling [mailto:ghelmling@gmail.com] 
Sent: Thursday, September 08, 2011 12:23 PM
To: dev@hbase.apache.org
Subject: Re: Build failed in Jenkins: HBase-TRUNK #2186

Looks like TestHLogUtils didn't get added with the HBASE-4260 patch?

On Wed, Sep 7, 2011 at 10:20 PM, Apache Jenkins Server <
jenkins@builds.apache.org> wrote:

> See <https://builds.apache.org/job/HBase-TRUNK/2186/changes>
>
> Changes:
>
> [stack] HBASE-4296 Deprecate HTable[Interface].getRowOrBefore(...)
>
> [stack] HBASE-4260 Expose a command to manually trigger an HLog roll
>
> ------------------------------------------
> [...truncated 1238 lines...]
> 52 KB
> 56 KB
> 60 KB
> 64 KB
> 68 KB
> 71 KB
> 75 KB
> 79 KB
> 83 KB
> 87 KB
> 91 KB
> 95 KB
> 99 KB
> 103 KB
> 107 KB
> 110 KB
> 114 KB
> 118 KB
> 122 KB
> 126 KB
> 130 KB
> 134 KB
> 138 KB
> 142 KB
> 146 KB
> 149 KB
> 153 KB
> 157 KB
> 161 KB
> 165 KB
> 169 KB
> 173 KB
> 177 KB
> 181 KB
> 185 KB
> 189 KB
> 193 KB
> 196 KB
> 200 KB
> 204 KB
> 208 KB
> 212 KB
> 216 KB
> 220 KB
> 224 KB
> 228 KB
> 232 KB
> 235 KB
> 239 KB
> 243 KB
> 247 KB
> 251 KB
> 255 KB
> 259 KB
> 263 KB
> 267 KB
> 271 KB
> 274 KB
> 278 KB
> 282 KB
> 286 KB
> 290 KB
> 294 KB
> 295 KB
>
> Downloaded:
>
https://repository.apache.org/content/repositories/releases/org/apache/thrif
t/libthrift/0.7.0/libthrift-0.7.0.jar(295 KB at 749.3 KB/sec)
> [INFO]
> [INFO] --- maven-clean-plugin:2.4.1:clean (default-clean) @ hbase ---
> [INFO]
> [INFO] --- xml-maven-plugin:1.0-beta-3:transform (default) @ hbase ---
> [INFO] Transforming file: <
>
https://builds.apache.org/job/HBase-TRUNK/ws/trunk/src/main/resources/hbase-
default.xml
> >
> [INFO] Transformed 1 file(s).
> [INFO]
> [INFO] --- docbkx-maven-plugin:2.0.11:generate-html (multipage) @ hbase
---
> [INFO] Processing input file: ops_mgt.xml
> [INFO] <
>
https://builds.apache.org/job/HBase-TRUNK/ws/trunk/target/site/book/ops_mgt.
html>
> has been generated.
> [INFO] Processing input file: troubleshooting.xml
> [INFO] <
>
https://builds.apache.org/job/HBase-TRUNK/ws/trunk/target/site/book/troubles
hooting.html>
> has been generated.
> [INFO] Processing input file: configuration.xml
> [INFO] <
>
https://builds.apache.org/job/HBase-TRUNK/ws/trunk/target/site/book/configur
ation.html>
> has been generated.
> [INFO] Processing input file: getting_started.xml
> [INFO] <
>
https://builds.apache.org/job/HBase-TRUNK/ws/trunk/target/site/book/getting_
started.html>
> has been generated.
> [INFO] Processing input file: book.xml
> [INFO] <
>
https://builds.apache.org/job/HBase-TRUNK/ws/trunk/target/site/book/book.htm
l>
> has been generated.
> [INFO] <
>
https://builds.apache.org/job/HBase-TRUNK/ws/trunk/target/site/book/shell.ht
ml>
> is up to date.
> [INFO] <
>
https://builds.apache.org/job/HBase-TRUNK/ws/trunk/target/site/book/performa
nce.html>
> is up to date.
> [INFO] <
>
https://builds.apache.org/job/HBase-TRUNK/ws/trunk/target/site/book/upgradin
g.html>
> is up to date.
> [INFO] <
>
https://builds.apache.org/job/HBase-TRUNK/ws/trunk/target/site/book/external
_apis.html>
> is up to date.
> [INFO] <
>
https://builds.apache.org/job/HBase-TRUNK/ws/trunk/target/site/book/preface.
html>
> is up to date.
> [INFO] <
>
https://builds.apache.org/job/HBase-TRUNK/ws/trunk/target/site/book/build.ht
ml>
> is up to date.
> [INFO] <
>
https://builds.apache.org/job/HBase-TRUNK/ws/trunk/target/site/book/develope
r.html>
> is up to date.
> [INFO]
> [INFO] --- docbkx-maven-plugin:2.0.11:generate-html (onepage) @ hbase ---
> [INFO] Processing input file: ops_mgt.xml
> [INFO] <
>
https://builds.apache.org/job/HBase-TRUNK/2186/artifact/trunk/target/site/op
s_mgt.html>
> has been generated.
> [INFO] Processing input file: troubleshooting.xml
> [INFO] <
>
https://builds.apache.org/job/HBase-TRUNK/2186/artifact/trunk/target/site/tr
oubleshooting.html>
> has been generated.
> [INFO] Processing input file: configuration.xml
> [INFO] <
>
https://builds.apache.org/job/HBase-TRUNK/2186/artifact/trunk/target/site/co
nfiguration.html>
> has been generated.
> [INFO] Processing input file: getting_started.xml
> [INFO] <
>
https://builds.apache.org/job/HBase-TRUNK/2186/artifact/trunk/target/site/ge
tting_started.html>
> has been generated.
> [INFO] Processing input file: book.xml
> [INFO] <
>
https://builds.apache.org/job/HBase-TRUNK/2186/artifact/trunk/target/site/bo
ok.html>
> has been generated.
> [INFO] Processing input file: shell.xml
> [INFO] <
>
https://builds.apache.org/job/HBase-TRUNK/2186/artifact/trunk/target/site/sh
ell.html>
> has been generated.
> [INFO] Processing input file: performance.xml
> [INFO] <
>
https://builds.apache.org/job/HBase-TRUNK/2186/artifact/trunk/target/site/pe
rformance.html>
> has been generated.
> [INFO] Processing input file: upgrading.xml
> [INFO] <
>
https://builds.apache.org/job/HBase-TRUNK/2186/artifact/trunk/target/site/up
grading.html>
> has been generated.
> [INFO] Processing input file: external_apis.xml
> [INFO] <
>
https://builds.apache.org/job/HBase-TRUNK/2186/artifact/trunk/target/site/ex
ternal_apis.html>
> has been generated.
> [INFO] Processing input file: preface.xml
> [INFO] <
>
https://builds.apache.org/job/HBase-TRUNK/2186/artifact/trunk/target/site/pr
eface.html>
> has been generated.
> [INFO] Processing input file: build.xml
> [INFO] <
>
https://builds.apache.org/job/HBase-TRUNK/2186/artifact/trunk/target/site/bu
ild.html>
> has been generated.
> [INFO] Processing input file: developer.xml
> [INFO] <
>
https://builds.apache.org/job/HBase-TRUNK/2186/artifact/trunk/target/site/de
veloper.html>
> has been generated.
> [INFO]
> [INFO] --- maven-site-plugin:2.0.1:site (default-site) @ hbase ---
> [INFO] Unable to load parent project from a relative path: 1 problem was
> encountered while building the effective model
> [FATAL] Non-readable POM <
> https://builds.apache.org/job/HBase-TRUNK/ws/pom.xml>: <
> https://builds.apache.org/job/HBase-TRUNK/ws/pom.xml> (No such file or
> directory) @
>  for project  at <https://builds.apache.org/job/HBase-TRUNK/ws/pom.xml>
> for project  at <https://builds.apache.org/job/HBase-TRUNK/ws/pom.xml>
> [INFO] Parent project loaded from repository.
> [INFO] Unable to load parent project from a relative path: 1 problem was
> encountered while building the effective model
> [FATAL] Non-readable POM <
> https://builds.apache.org/job/HBase-TRUNK/ws/pom.xml>: <
> https://builds.apache.org/job/HBase-TRUNK/ws/pom.xml> (No such file or
> directory) @
>  for project  at <https://builds.apache.org/job/HBase-TRUNK/ws/pom.xml>
> for project  at <https://builds.apache.org/job/HBase-TRUNK/ws/pom.xml>
> [INFO] Parent project loaded from repository.
> Downloading:
>
http://download.java.net/maven/2/org/apache/maven/skins/maven-stylus-skin/ma
ven-metadata.xml
> Downloading:
>
http://people.apache.org/~rawson/repo/org/apache/maven/skins/maven-stylus-sk
in/maven-metadata.xml
> Downloading:
>
http://repository.codehaus.org/org/apache/maven/skins/maven-stylus-skin/mave
n-metadata.xml
> Downloading:
>
https://repository.apache.org/content/repositories/releases/org/apache/maven
/skins/maven-stylus-skin/maven-metadata.xml
>
> Downloading:
>
http://repository.jboss.org/nexus/content/groups/public-jboss/org/apache/mav
en/skins/maven-stylus-skin/maven-metadata.xml
> 458 B
>
> Downloaded:
>
https://repository.apache.org/content/repositories/releases/org/apache/maven
/skins/maven-stylus-skin/maven-metadata.xml(458 B at 1.9 KB/sec)
> Downloading:
>
http://repo1.maven.org/maven2/org/apache/maven/skins/maven-stylus-skin/maven
-metadata.xml
>
> 458 B
>
>
> Downloaded:
>
http://repo1.maven.org/maven2/org/apache/maven/skins/maven-stylus-skin/maven
-metadata.xml(458 B at 1.2 KB/sec)
>
> [INFO]
> [INFO]
> ------------------------------------------------------------------------
> [INFO] Building HBase 0.91.0-SNAPSHOT
> [INFO]
> ------------------------------------------------------------------------
> [INFO]
> [INFO] >>> maven-assembly-plugin:2.2-beta-5:assembly (default-cli) @ hbase
> >>>
> [INFO]
> [INFO] --- avro-maven-plugin:1.5.3:schema (generate-avro-sources) @ hbase
> ---
> [INFO]
> [INFO] --- avro-maven-plugin:1.5.3:protocol (generate-avro-sources) @
hbase
> ---
> [INFO]
> [INFO] --- maven-antrun-plugin:1.6:run (generate) @ hbase ---
> [WARNING] Parameter tasks is deprecated, use target instead
> [INFO] Executing tasks
>
> main:
>    [mkdir] Created dir: <
> https://builds.apache.org/job/HBase-TRUNK/ws/trunk/target/hbase-webapps>
>     [copy] Copying 5 files to <
> https://builds.apache.org/job/HBase-TRUNK/ws/trunk/target/hbase-webapps>
> SLF4J: Failed to load class "org.slf4j.impl.StaticLoggerBinder".
> SLF4J: See http://www.slf4j.org/codes.html#StaticLoggerBinder for further
> details.
> 2011-09-08 05:19:52.214:INFO::Logging to STDERR via
> org.mortbay.log.StdErrLog
>    [mkdir] Created dir: <
>
https://builds.apache.org/job/HBase-TRUNK/ws/trunk/target/hbase-webapps/mast
er/WEB-INF
> >
>    [mkdir] Created dir: <
>
https://builds.apache.org/job/HBase-TRUNK/ws/trunk/target/hbase-webapps/regi
onserver/WEB-INF
> >
> [INFO] Executed tasks
> [INFO]
> [INFO] --- build-helper-maven-plugin:1.5:add-source
> (jspcSource-packageInfo-Avro-source) @ hbase ---
> [INFO] Source directory: <
> https://builds.apache.org/job/HBase-TRUNK/ws/trunk/target/generated-jamon>
> added.
> [INFO] Source directory: <
>
https://builds.apache.org/job/HBase-TRUNK/ws/trunk/target/generated-sources/
java>
> added.
> [INFO]
> [INFO] --- jamon-maven-plugin:2.3.4:translate (default) @ hbase ---
> [INFO] Translating 4 templates from <
> https://builds.apache.org/job/HBase-TRUNK/ws/trunk/src/main/jamon> to <
> https://builds.apache.org/job/HBase-TRUNK/ws/trunk/target/generated-jamon>
> [INFO]
> [INFO] --- maven-remote-resources-plugin:1.1:process (default) @ hbase ---
> [INFO] Setting property: classpath.resource.loader.class =>
> 'org.codehaus.plexus.velocity.ContextClassLoaderResourceLoader'.
> [INFO] Setting property: velocimacro.messages.on => 'false'.
> [INFO] Setting property: resource.loader => 'classpath'.
> [INFO] Setting property: resource.manager.logwhenfound => 'false'.
> [INFO]
> [INFO] --- maven-resources-plugin:2.4:resources (default-resources) @
hbase
> ---
> [INFO] Using 'UTF-8' encoding to copy filtered resources.
> [INFO] Copying 1 resource
> [INFO] Copying 7 resources
> [INFO] Copying 3 resources
> [INFO]
> [INFO] --- maven-antrun-plugin:1.6:run (default) @ hbase ---
> [WARNING] Parameter tasks is deprecated, use target instead
> [INFO] Executing tasks
>
> main:
>    [mkdir] Created dir: <
> https://builds.apache.org/job/HBase-TRUNK/ws/trunk/target/nativelib>
>     [exec] tar: hadoop-snappy-nativelibs.tar: Cannot open: No such file or
> directory
>     [exec] tar: Error is not recoverable: exiting now
>     [exec] Result: 2
> [INFO] Executed tasks
> [INFO]
> [INFO] --- maven-compiler-plugin:2.0.2:compile (default-compile) @ hbase
> ---
> [INFO] Compiling 587 source files to <
> https://builds.apache.org/job/HBase-TRUNK/ws/trunk/target/classes>
> [WARNING] <
>
https://builds.apache.org/job/HBase-TRUNK/ws/trunk/src/main/java/org/apache/
hadoop/hbase/util/Bytes.java>:[44,15]
> sun.misc.Unsafe is Sun proprietary API and may be removed in a future
> release
>
> [WARNING] <
>
https://builds.apache.org/job/HBase-TRUNK/ws/trunk/src/main/java/org/apache/
hadoop/hbase/util/Bytes.java>:[1046,19]
> sun.misc.Unsafe is Sun proprietary API and may be removed in a future
> release
>
> [WARNING] <
>
https://builds.apache.org/job/HBase-TRUNK/ws/trunk/src/main/java/org/apache/
hadoop/hbase/util/Bytes.java>:[1052,21]
> sun.misc.Unsafe is Sun proprietary API and may be removed in a future
> release
>
> [WARNING] <
>
https://builds.apache.org/job/HBase-TRUNK/ws/trunk/src/main/java/org/apache/
hadoop/hbase/util/Bytes.java>:[1057,28]
> sun.misc.Unsafe is Sun proprietary API and may be removed in a future
> release
>
> [INFO]
> [INFO] --- maven-resources-plugin:2.4:testResources
(default-testResources)
> @ hbase ---
> [INFO] Using 'UTF-8' encoding to copy filtered resources.
> [INFO] Copying 5 resources
> [INFO] Copying 3 resources
> [INFO]
> [INFO] --- maven-compiler-plugin:2.0.2:testCompile (default-testCompile) @
> hbase ---
> [INFO] Compiling 245 source files to <
> https://builds.apache.org/job/HBase-TRUNK/ws/trunk/target/test-classes>
> [INFO]
> ------------------------------------------------------------------------
> [INFO] BUILD FAILURE
> [INFO]
> ------------------------------------------------------------------------
> [INFO] Total time: 42.650s
> [INFO] Finished at: Thu Sep 08 05:20:07 UTC 2011
> [INFO] Final Memory: 54M/1055M
> [INFO]
> ------------------------------------------------------------------------
> [ERROR] Failed to execute goal
> org.apache.maven.plugins:maven-compiler-plugin:2.0.2:testCompile
> (default-testCompile) on project hbase: Compilation failure: Compilation
> failure:
> [ERROR] <
>
https://builds.apache.org/job/HBase-TRUNK/ws/trunk/src/test/java/org/apache/
hadoop/hbase/client/TestAdmin.java>:[61,47]
> cannot find symbol
> [ERROR] symbol  : class TestHLogUtils
> [ERROR] location: package org.apache.hadoop.hbase.regionserver.wal
> [ERROR]
> [ERROR] <
>
https://builds.apache.org/job/HBase-TRUNK/ws/trunk/src/test/java/org/apache/
hadoop/hbase/client/TestAdmin.java>:[1178,10]
> cannot find symbol
> [ERROR] symbol  : variable TestHLogUtils
> [ERROR] location: class org.apache.hadoop.hbase.client.TestAdmin
> [ERROR]
> [ERROR] <
>
https://builds.apache.org/job/HBase-TRUNK/ws/trunk/src/test/java/org/apache/
hadoop/hbase/client/TestAdmin.java>:[1188,16]
> cannot find symbol
> [ERROR] symbol  : variable TestHLogUtils
> [ERROR] location: class org.apache.hadoop.hbase.client.TestAdmin
> [ERROR] -> [Help 1]
> [ERROR]
> [ERROR] To see the full stack trace of the errors, re-run Maven with the
-e
> switch.
> [ERROR] Re-run Maven using the -X switch to enable full debug logging.
> [ERROR]
> [ERROR] For more information about the errors and possible solutions,
> please read the following articles:
> [ERROR] [Help 1]
> http://cwiki.apache.org/confluence/display/MAVEN/MojoFailureException
> Build step 'Invoke top-level Maven targets' marked build as failure
> [locks-and-latches] Releasing all the locks
> [locks-and-latches] All the locks released
> Archiving artifacts
> Updating HBASE-4296
> Updating HBASE-4260
> Recording test results
>
>


Mime
View raw message