hbase-dev mailing list archives

Site index · List index
Message view « Date » · « Thread »
Top « Date » · « Thread »
From Apache Jenkins Server <jenk...@builds.apache.org>
Subject Build failed in Jenkins: HBase-TRUNK-on-Hadoop-23 #28
Date Thu, 15 Sep 2011 00:08:56 GMT
See <https://builds.apache.org/job/HBase-TRUNK-on-Hadoop-23/28/changes>

Changes:

[tedyu] HBASE-4330  Fix races in slab cache (Li Pi & Todd)

[dmeil] HBASE-4409.  book.  Fixed cycle in config section and wiki with "too many open files"
error.

[dmeil] HBASE-4408.  book.xml, faq

[todd] Amend HBASE-4381 Refactor split decisions into a split policy class

Adjusts heap size estimates for HRegion and Store to fix failing TestHeapSize.

[dmeil] HBASE-4407 book.xml, schema design

[todd] HBASE-4406  TestOpenRegionHandler failing after HBASE-4287

[dmeil] HBASE-4405 - adding link to blog for hbase dev on windows

[todd] HBASE-4381  Refactor split decisions into a split policy class.

[todd] HBASE-4287  If region opening fails, change region in transition into a FAILED_OPEN
state so that it can be retried quickly.

[stack] HBASE-4394 Add support for seeking hints to FilterList

[stack] HBASE-4359 Show dead RegionServer names in the HMaster info page

------------------------------------------
[...truncated 2255 lines...]
1355 KB   
1357 KB   
1361 KB   
1365 KB   
1369 KB   
1373 KB   
1377 KB   
1381 KB   
1385 KB   
1389 KB   
1392 KB   
1396 KB   
1400 KB   
1404 KB   
1405 KB   
1409 KB   
1413 KB   
1417 KB   
1421 KB   
1425 KB   
1429 KB   
1433 KB   
1433 KB   
1437 KB   
1441 KB   
1445 KB   
1447 KB   
1451 KB   
1455 KB   
1459 KB   
1463 KB   
1467 KB   
1471 KB   
1475 KB   
1476 KB   
1480 KB   
1484 KB   
1488 KB   
1492 KB   
1496 KB   
1500 KB   
1504 KB   
1508 KB   
1512 KB   
1516 KB   
1517 KB   
1521 KB   
1525 KB   
1529 KB   
1533 KB   
1534 KB   
          
Downloaded: http://repository.apache.org/snapshots/org/apache/hadoop/hadoop-hdfs/0.23.0-SNAPSHOT/hadoop-hdfs-0.23.0-20110914.160902-373.jar
(1534 KB at 906.6 KB/sec)
Downloading: https://repository.apache.org/content/repositories/releases/commons-daemon/commons-daemon/1.0.3/commons-daemon-1.0.3.jar
4 KB      
8 KB   
12 KB   
16 KB   
17 KB   
        
Downloaded: https://repository.apache.org/content/repositories/releases/commons-daemon/commons-daemon/1.0.3/commons-daemon-1.0.3.jar
(17 KB at 53.5 KB/sec)
[INFO] 
[INFO] --- maven-clean-plugin:2.4.1:clean (default-clean) @ hbase ---
[INFO] 
[INFO] --- xml-maven-plugin:1.0-beta-3:transform (default) @ hbase ---
[INFO] Transforming file: <https://builds.apache.org/job/HBase-TRUNK-on-Hadoop-23/ws/trunk/src/main/resources/hbase-default.xml>
[INFO] Transformed 1 file(s).
[INFO] 
[INFO] --- docbkx-maven-plugin:2.0.11:generate-html (multipage) @ hbase ---
[INFO] Processing input file: build.xml
[INFO] <https://builds.apache.org/job/HBase-TRUNK-on-Hadoop-23/ws/trunk/target/site/book/build.html>
has been generated.
[INFO] Processing input file: developer.xml
[INFO] <https://builds.apache.org/job/HBase-TRUNK-on-Hadoop-23/ws/trunk/target/site/book/developer.html>
has been generated.
[INFO] Processing input file: preface.xml
[INFO] <https://builds.apache.org/job/HBase-TRUNK-on-Hadoop-23/ws/trunk/target/site/book/preface.html>
has been generated.
[INFO] Processing input file: ops_mgt.xml
[INFO] <https://builds.apache.org/job/HBase-TRUNK-on-Hadoop-23/ws/trunk/target/site/book/ops_mgt.html>
has been generated.
[INFO] Processing input file: performance.xml
[INFO] <https://builds.apache.org/job/HBase-TRUNK-on-Hadoop-23/ws/trunk/target/site/book/performance.html>
has been generated.
[INFO] Processing input file: upgrading.xml
[INFO] <https://builds.apache.org/job/HBase-TRUNK-on-Hadoop-23/ws/trunk/target/site/book/upgrading.html>
has been generated.
[INFO] Processing input file: external_apis.xml
[INFO] <https://builds.apache.org/job/HBase-TRUNK-on-Hadoop-23/ws/trunk/target/site/book/external_apis.html>
has been generated.
[INFO] Processing input file: configuration.xml
[INFO] <https://builds.apache.org/job/HBase-TRUNK-on-Hadoop-23/ws/trunk/target/site/book/configuration.html>
has been generated.
[INFO] Processing input file: getting_started.xml
[INFO] <https://builds.apache.org/job/HBase-TRUNK-on-Hadoop-23/ws/trunk/target/site/book/getting_started.html>
has been generated.
[INFO] Processing input file: shell.xml
[INFO] <https://builds.apache.org/job/HBase-TRUNK-on-Hadoop-23/ws/trunk/target/site/book/shell.html>
has been generated.
[INFO] Processing input file: book.xml
[INFO] <https://builds.apache.org/job/HBase-TRUNK-on-Hadoop-23/ws/trunk/target/site/book/book.html>
has been generated.
[INFO] Processing input file: troubleshooting.xml
[INFO] <https://builds.apache.org/job/HBase-TRUNK-on-Hadoop-23/ws/trunk/target/site/book/troubleshooting.html>
has been generated.
[INFO] 
[INFO] --- docbkx-maven-plugin:2.0.11:generate-html (onepage) @ hbase ---
[INFO] Processing input file: build.xml
[INFO] <https://builds.apache.org/job/HBase-TRUNK-on-Hadoop-23/28/artifact/trunk/target/site/build.html>
has been generated.
[INFO] Processing input file: developer.xml
[INFO] <https://builds.apache.org/job/HBase-TRUNK-on-Hadoop-23/28/artifact/trunk/target/site/developer.html>
has been generated.
[INFO] Processing input file: preface.xml
[INFO] <https://builds.apache.org/job/HBase-TRUNK-on-Hadoop-23/28/artifact/trunk/target/site/preface.html>
has been generated.
[INFO] Processing input file: ops_mgt.xml
[INFO] <https://builds.apache.org/job/HBase-TRUNK-on-Hadoop-23/28/artifact/trunk/target/site/ops_mgt.html>
has been generated.
[INFO] Processing input file: performance.xml
[INFO] <https://builds.apache.org/job/HBase-TRUNK-on-Hadoop-23/28/artifact/trunk/target/site/performance.html>
has been generated.
[INFO] Processing input file: upgrading.xml
[INFO] <https://builds.apache.org/job/HBase-TRUNK-on-Hadoop-23/28/artifact/trunk/target/site/upgrading.html>
has been generated.
[INFO] Processing input file: external_apis.xml
[INFO] <https://builds.apache.org/job/HBase-TRUNK-on-Hadoop-23/28/artifact/trunk/target/site/external_apis.html>
has been generated.
[INFO] Processing input file: configuration.xml
[INFO] <https://builds.apache.org/job/HBase-TRUNK-on-Hadoop-23/28/artifact/trunk/target/site/configuration.html>
has been generated.
[INFO] Processing input file: getting_started.xml
[INFO] <https://builds.apache.org/job/HBase-TRUNK-on-Hadoop-23/28/artifact/trunk/target/site/getting_started.html>
has been generated.
[INFO] Processing input file: shell.xml
[INFO] <https://builds.apache.org/job/HBase-TRUNK-on-Hadoop-23/28/artifact/trunk/target/site/shell.html>
has been generated.
[INFO] Processing input file: book.xml
[INFO] <https://builds.apache.org/job/HBase-TRUNK-on-Hadoop-23/28/artifact/trunk/target/site/book.html>
has been generated.
[INFO] Processing input file: troubleshooting.xml
[INFO] <https://builds.apache.org/job/HBase-TRUNK-on-Hadoop-23/28/artifact/trunk/target/site/troubleshooting.html>
has been generated.
[INFO] 
[INFO] --- maven-site-plugin:2.0.1:site (default-site) @ hbase ---
[INFO] Unable to load parent project from a relative path: 1 problem was encountered while
building the effective model
[FATAL] Non-readable POM <https://builds.apache.org/job/HBase-TRUNK-on-Hadoop-23/ws/pom.xml>:
<https://builds.apache.org/job/HBase-TRUNK-on-Hadoop-23/ws/pom.xml> (No such file or
directory) @ 
 for project  at <https://builds.apache.org/job/HBase-TRUNK-on-Hadoop-23/ws/pom.xml>
for project  at <https://builds.apache.org/job/HBase-TRUNK-on-Hadoop-23/ws/pom.xml>
[INFO] Parent project loaded from repository.
[INFO] Unable to load parent project from a relative path: 1 problem was encountered while
building the effective model
[FATAL] Non-readable POM <https://builds.apache.org/job/HBase-TRUNK-on-Hadoop-23/ws/pom.xml>:
<https://builds.apache.org/job/HBase-TRUNK-on-Hadoop-23/ws/pom.xml> (No such file or
directory) @ 
 for project  at <https://builds.apache.org/job/HBase-TRUNK-on-Hadoop-23/ws/pom.xml>
for project  at <https://builds.apache.org/job/HBase-TRUNK-on-Hadoop-23/ws/pom.xml>
[INFO] Parent project loaded from repository.
Downloading: http://download.java.net/maven/2/org/apache/maven/skins/maven-stylus-skin/maven-metadata.xml
Downloading: http://people.apache.org/~rawson/repo/org/apache/maven/skins/maven-stylus-skin/maven-metadata.xml
Downloading: https://repository.apache.org/content/repositories/releases/org/apache/maven/skins/maven-stylus-skin/maven-metadata.xml
Downloading: http://repository.codehaus.org/org/apache/maven/skins/maven-stylus-skin/maven-metadata.xml
        
Downloading: http://repository.jboss.org/nexus/content/groups/public-jboss/org/apache/maven/skins/maven-stylus-skin/maven-metadata.xml
        
Downloading: http://repo1.maven.org/maven2/org/apache/maven/skins/maven-stylus-skin/maven-metadata.xml
        
458 B   
458 B   458 B   
                
Downloaded: https://repository.apache.org/content/repositories/releases/org/apache/maven/skins/maven-stylus-skin/maven-metadata.xml
(458 B at 1.4 KB/sec)
                
                
Downloaded: http://repo1.maven.org/maven2/org/apache/maven/skins/maven-stylus-skin/maven-metadata.xml
(458 B at 1.3 KB/sec)
[INFO]                                                                         
[INFO] ------------------------------------------------------------------------
[INFO] Building HBase 0.91.0-SNAPSHOT
[INFO] ------------------------------------------------------------------------
[INFO] 
[INFO] >>> maven-assembly-plugin:2.2-beta-5:assembly (default-cli) @ hbase >>>
[INFO] 
[INFO] --- avro-maven-plugin:1.5.3:schema (generate-avro-sources) @ hbase ---
[INFO] 
[INFO] --- avro-maven-plugin:1.5.3:protocol (generate-avro-sources) @ hbase ---
[INFO] 
[INFO] --- maven-antrun-plugin:1.6:run (generate) @ hbase ---
[WARNING] Parameter tasks is deprecated, use target instead
[INFO] Executing tasks

main:
    [mkdir] Created dir: <https://builds.apache.org/job/HBase-TRUNK-on-Hadoop-23/ws/trunk/target/hbase-webapps>
     [copy] Copying 5 files to <https://builds.apache.org/job/HBase-TRUNK-on-Hadoop-23/ws/trunk/target/hbase-webapps>
SLF4J: Failed to load class "org.slf4j.impl.StaticLoggerBinder".
SLF4J: See http://www.slf4j.org/codes.html#StaticLoggerBinder for further details.
2011-09-15 00:08:45.748:INFO::Logging to STDERR via org.mortbay.log.StdErrLog
    [mkdir] Created dir: <https://builds.apache.org/job/HBase-TRUNK-on-Hadoop-23/ws/trunk/target/hbase-webapps/master/WEB-INF>
    [mkdir] Created dir: <https://builds.apache.org/job/HBase-TRUNK-on-Hadoop-23/ws/trunk/target/hbase-webapps/regionserver/WEB-INF>
[INFO] Executed tasks
[INFO] 
[INFO] --- build-helper-maven-plugin:1.5:add-source (jspcSource-packageInfo-Avro-source) @
hbase ---
[INFO] Source directory: <https://builds.apache.org/job/HBase-TRUNK-on-Hadoop-23/ws/trunk/target/generated-jamon>
added.
[INFO] Source directory: <https://builds.apache.org/job/HBase-TRUNK-on-Hadoop-23/ws/trunk/target/generated-sources/java>
added.
[INFO] 
[INFO] --- jamon-maven-plugin:2.3.4:translate (default) @ hbase ---
[INFO] Translating 4 templates from <https://builds.apache.org/job/HBase-TRUNK-on-Hadoop-23/ws/trunk/src/main/jamon>
to <https://builds.apache.org/job/HBase-TRUNK-on-Hadoop-23/ws/trunk/target/generated-jamon>
[INFO] 
[INFO] --- maven-remote-resources-plugin:1.1:process (default) @ hbase ---
[INFO] Setting property: classpath.resource.loader.class => 'org.codehaus.plexus.velocity.ContextClassLoaderResourceLoader'.
[INFO] Setting property: velocimacro.messages.on => 'false'.
[INFO] Setting property: resource.loader => 'classpath'.
[INFO] Setting property: resource.manager.logwhenfound => 'false'.
Downloading: https://repository.apache.org/content/repositories/snapshots/org/apache/hadoop/hadoop-project/0.23.0-SNAPSHOT/maven-metadata.xml
612 B           
        
Downloaded: https://repository.apache.org/content/repositories/snapshots/org/apache/hadoop/hadoop-project/0.23.0-SNAPSHOT/maven-metadata.xml
(612 B at 3.7 KB/sec)
[INFO] 
[INFO] --- maven-resources-plugin:2.4:resources (default-resources) @ hbase ---
[INFO] Using 'UTF-8' encoding to copy filtered resources.
[INFO] Copying 1 resource
[INFO] Copying 7 resources
[INFO] Copying 3 resources
[INFO] 
[INFO] --- maven-antrun-plugin:1.6:run (default) @ hbase ---
[WARNING] Parameter tasks is deprecated, use target instead
[INFO] Executing tasks

main:
    [mkdir] Created dir: <https://builds.apache.org/job/HBase-TRUNK-on-Hadoop-23/ws/trunk/target/nativelib>
     [exec] tar: hadoop-snappy-nativelibs.tar: Cannot open: No such file or directory
     [exec] tar: Error is not recoverable: exiting now
     [exec] Result: 2
[INFO] Executed tasks
[INFO] 
[INFO] --- maven-compiler-plugin:2.0.2:compile (default-compile) @ hbase ---
[INFO] Compiling 599 source files to <https://builds.apache.org/job/HBase-TRUNK-on-Hadoop-23/ws/trunk/target/classes>
[INFO] ------------------------------------------------------------------------
[INFO] BUILD FAILURE
[INFO] ------------------------------------------------------------------------
[INFO] Total time: 42.856s
[INFO] Finished at: Thu Sep 15 00:08:54 UTC 2011
[INFO] Final Memory: 46M/1049M
[INFO] ------------------------------------------------------------------------
[ERROR] Failed to execute goal org.apache.maven.plugins:maven-compiler-plugin:2.0.2:compile
(default-compile) on project hbase: Compilation failure: Compilation failure:
[ERROR] <https://builds.apache.org/job/HBase-TRUNK-on-Hadoop-23/ws/trunk/src/main/java/org/apache/hadoop/hbase/util/Bytes.java>:[44,15]
sun.misc.Unsafe is Sun proprietary API and may be removed in a future release
[ERROR] 
[ERROR] <https://builds.apache.org/job/HBase-TRUNK-on-Hadoop-23/ws/trunk/src/main/java/org/apache/hadoop/hbase/util/Bytes.java>:[1046,19]
sun.misc.Unsafe is Sun proprietary API and may be removed in a future release
[ERROR] 
[ERROR] <https://builds.apache.org/job/HBase-TRUNK-on-Hadoop-23/ws/trunk/src/main/java/org/apache/hadoop/hbase/util/FSHDFSUtils.java>:[35,38]
cannot find symbol
[ERROR] symbol  : class FSConstants
[ERROR] location: package org.apache.hadoop.hdfs.protocol
[ERROR] 
[ERROR] <https://builds.apache.org/job/HBase-TRUNK-on-Hadoop-23/ws/trunk/src/main/java/org/apache/hadoop/hbase/util/FSUtils.java>:[40,38]
cannot find symbol
[ERROR] symbol  : class FSConstants
[ERROR] location: package org.apache.hadoop.hdfs.protocol
[ERROR] 
[ERROR] <https://builds.apache.org/job/HBase-TRUNK-on-Hadoop-23/ws/trunk/src/main/java/org/apache/hadoop/hbase/util/Bytes.java>:[1052,21]
sun.misc.Unsafe is Sun proprietary API and may be removed in a future release
[ERROR] 
[ERROR] <https://builds.apache.org/job/HBase-TRUNK-on-Hadoop-23/ws/trunk/src/main/java/org/apache/hadoop/hbase/util/Bytes.java>:[1057,28]
sun.misc.Unsafe is Sun proprietary API and may be removed in a future release
[ERROR] 
[ERROR] <https://builds.apache.org/job/HBase-TRUNK-on-Hadoop-23/ws/trunk/src/main/java/org/apache/hadoop/hbase/util/FSUtils.java>:[166,48]
package FSConstants does not exist
[ERROR] 
[ERROR] <https://builds.apache.org/job/HBase-TRUNK-on-Hadoop-23/ws/trunk/src/main/java/org/apache/hadoop/hbase/util/FSUtils.java>:[442,38]
package FSConstants does not exist
[ERROR] 
[ERROR] <https://builds.apache.org/job/HBase-TRUNK-on-Hadoop-23/ws/trunk/src/main/java/org/apache/hadoop/hbase/util/FSHDFSUtils.java>:[89,26]
cannot find symbol
[ERROR] symbol  : variable FSConstants
[ERROR] location: class org.apache.hadoop.hbase.util.FSHDFSUtils
[ERROR] -> [Help 1]
[ERROR] 
[ERROR] To see the full stack trace of the errors, re-run Maven with the -e switch.
[ERROR] Re-run Maven using the -X switch to enable full debug logging.
[ERROR] 
[ERROR] For more information about the errors and possible solutions, please read the following
articles:
[ERROR] [Help 1] http://cwiki.apache.org/confluence/display/MAVEN/MojoFailureException
Build step 'Invoke top-level Maven targets' marked build as failure
[locks-and-latches] Releasing all the locks
[locks-and-latches] All the locks released
Archiving artifacts
Recording test results


Mime
View raw message