hbase-dev mailing list archives

Site index · List index
Message view « Date » · « Thread »
Top « Date » · « Thread »
From Apache Jenkins Server <jenk...@builds.apache.org>
Subject Build failed in Jenkins: HBase-TRUNK-on-Hadoop-23 #22
Date Fri, 09 Sep 2011 01:54:32 GMT
See <https://builds.apache.org/job/HBase-TRUNK-on-Hadoop-23/22/changes>

Changes:

[tedyu] HBASE-2195 Support cyclic replication (Lars Hofhansl)

[stack] HBASE-4105 HBASE-4015-Making the timeout monitor less racy; third attempt

[stack] HBASE-4015 Refactor the TimeoutMonitor to make it less racy -- REVERT.  Ram says I
have applied wrong patch.  Redoing.   A SECOND TIMEsvn rm --force   src/main/java/org/apache/hadoop/hbase/master/TimeOutManagerCallable.javasvn
rm --force   src/main/java/org/apache/hadoop/hbase/master/TimeOutManagerCallable.java

[stack] HBASE-4015 Refactor the TimeoutMonitor to make it less racy -- reapply with HBASE-4015_reprepared_trunk_2.patch

[stack] HBASE-4015 Refactor the TimeoutMonitor to make it less racy -- REVERT.  Ram says I
have applied wrong patch.  Redoing.

[stack] HBASE-4243  HADOOP_HOME should be auto-detected (Roman Shaposhnik) -- revert.. non-portable
shell change

[stack] HBASE-4015 Refactor the TimeoutMonitor to make it less racy

[stack] HBASE-4015 Refactor the TimeoutMonitor to make it less racy

[stack] HBASE-4015 Refactor the TimeoutMonitor to make it less racy

[stack] Fix tag... was 'p' when should be 'para'

[stack] HBASE-4297 TableMapReduceUtil overwrites user supplied options

[stack] HBASE-4243 HADOOP_HOME should be auto-detected

[stack] HBASE-4341 HRS#closeAllRegions should take care of HRS#onlineRegions's weak consistency

[stack] HBASE-4260 Expose a command to manually trigger an HLog roll

[Gary Helmling] HBASE-4271  Clean up coprocessor handling of table operations

[stack] HBASE-4296 Deprecate HTable[Interface].getRowOrBefore(...)

[stack] HBASE-4260 Expose a command to manually trigger an HLog roll

------------------------------------------
[...truncated 1775 lines...]
Tests run: 1, Failures: 0, Errors: 1, Skipped: 0, Time elapsed: 5.825 sec <<< FAILURE!
Running org.apache.hadoop.hbase.regionserver.wal.TestWALActionsListener
Tests run: 1, Failures: 0, Errors: 0, Skipped: 0, Time elapsed: 0.823 sec
Running org.apache.hadoop.hbase.regionserver.wal.TestHLogMethods
Tests run: 3, Failures: 0, Errors: 0, Skipped: 0, Time elapsed: 0.984 sec
Running org.apache.hadoop.hbase.regionserver.wal.TestLogRolling
Tests run: 3, Failures: 0, Errors: 1, Skipped: 0, Time elapsed: 179.041 sec <<< FAILURE!
Running org.apache.hadoop.hbase.regionserver.wal.TestHLogSplit
Tests run: 28, Failures: 0, Errors: 28, Skipped: 0, Time elapsed: 5.333 sec <<< FAILURE!
Running org.apache.hadoop.hbase.regionserver.TestStore
Tests run: 11, Failures: 0, Errors: 0, Skipped: 0, Time elapsed: 2.422 sec
Running org.apache.hadoop.hbase.regionserver.TestRpcMetrics
Tests run: 1, Failures: 0, Errors: 0, Skipped: 0, Time elapsed: 2.057 sec
Running org.apache.hadoop.hbase.regionserver.TestCompoundBloomFilter
Tests run: 3, Failures: 0, Errors: 0, Skipped: 0, Time elapsed: 24.441 sec
Running org.apache.hadoop.hbase.regionserver.TestKeyValueScanFixture
Tests run: 1, Failures: 0, Errors: 0, Skipped: 0, Time elapsed: 0.153 sec
Running org.apache.hadoop.hbase.regionserver.TestExplicitColumnTracker
Tests run: 4, Failures: 0, Errors: 0, Skipped: 0, Time elapsed: 1.008 sec
Running org.apache.hadoop.hbase.regionserver.TestStoreFile
Tests run: 8, Failures: 0, Errors: 0, Skipped: 0, Time elapsed: 24.438 sec
Running org.apache.hadoop.hbase.regionserver.TestWideScanner
Tests run: 1, Failures: 0, Errors: 0, Skipped: 0, Time elapsed: 16.095 sec
Running org.apache.hadoop.hbase.regionserver.TestQueryMatcher
Tests run: 4, Failures: 0, Errors: 0, Skipped: 0, Time elapsed: 0.605 sec
Running org.apache.hadoop.hbase.regionserver.TestReadWriteConsistencyControl
Tests run: 1, Failures: 0, Errors: 0, Skipped: 0, Time elapsed: 10.107 sec
Running org.apache.hadoop.hbase.regionserver.TestResettingCounters
Tests run: 1, Failures: 0, Errors: 0, Skipped: 0, Time elapsed: 0.83 sec
Running org.apache.hadoop.hbase.regionserver.TestStoreScanner
Tests run: 14, Failures: 0, Errors: 0, Skipped: 0, Time elapsed: 0.137 sec
Running org.apache.hadoop.hbase.regionserver.TestMinVersions
Tests run: 6, Failures: 0, Errors: 0, Skipped: 0, Time elapsed: 1.607 sec
Running org.apache.hadoop.hbase.regionserver.TestMemStoreLAB
Tests run: 3, Failures: 0, Errors: 0, Skipped: 0, Time elapsed: 1.367 sec
Running org.apache.hadoop.hbase.regionserver.TestSplitTransactionOnCluster
Tests run: 4, Failures: 0, Errors: 0, Skipped: 0, Time elapsed: 43.025 sec
Running org.apache.hadoop.hbase.regionserver.TestSplitTransaction
Tests run: 6, Failures: 0, Errors: 0, Skipped: 0, Time elapsed: 4.646 sec
Running org.apache.hadoop.hbase.regionserver.TestScanDeleteTracker
Tests run: 6, Failures: 0, Errors: 0, Skipped: 0, Time elapsed: 0.672 sec
Running org.apache.hadoop.hbase.regionserver.TestCompactSelection
Tests run: 1, Failures: 0, Errors: 0, Skipped: 0, Time elapsed: 0.767 sec
Running org.apache.hadoop.hbase.regionserver.TestStoreFileBlockCacheSummary
Tests run: 1, Failures: 0, Errors: 0, Skipped: 0, Time elapsed: 18.99 sec
Running org.apache.hadoop.hbase.regionserver.TestMemStore
Tests run: 21, Failures: 0, Errors: 0, Skipped: 0, Time elapsed: 29.208 sec
Running org.apache.hadoop.hbase.regionserver.TestGetClosestAtOrBefore
Tests run: 3, Failures: 0, Errors: 0, Skipped: 0, Time elapsed: 6.211 sec
Running org.apache.hadoop.hbase.regionserver.TestKeyValueSkipListSet
Tests run: 4, Failures: 0, Errors: 0, Skipped: 0, Time elapsed: 0.118 sec
Running org.apache.hadoop.hbase.regionserver.TestKeyValueHeap
Tests run: 3, Failures: 0, Errors: 0, Skipped: 0, Time elapsed: 0.555 sec
Running org.apache.hadoop.hbase.regionserver.TestScanner
Tests run: 6, Failures: 0, Errors: 0, Skipped: 0, Time elapsed: 46.564 sec
Running org.apache.hadoop.hbase.regionserver.TestHRegionInfo
Tests run: 3, Failures: 0, Errors: 0, Skipped: 0, Time elapsed: 0.668 sec
Running org.apache.hadoop.hbase.regionserver.handler.TestOpenRegionHandler
Tests run: 1, Failures: 0, Errors: 0, Skipped: 0, Time elapsed: 0.938 sec
Running org.apache.hadoop.hbase.regionserver.TestMasterAddressManager
Tests run: 1, Failures: 0, Errors: 0, Skipped: 0, Time elapsed: 0.53 sec
Running org.apache.hadoop.hbase.regionserver.TestSplitLogWorker
Tests run: 5, Failures: 0, Errors: 0, Skipped: 0, Time elapsed: 2.021 sec
Running org.apache.hadoop.hbase.regionserver.TestFSErrorsExposed
Tests run: 3, Failures: 0, Errors: 0, Skipped: 0, Time elapsed: 40.298 sec
Running org.apache.hadoop.hbase.TestHServerAddress
Tests run: 6, Failures: 0, Errors: 0, Skipped: 0, Time elapsed: 0.068 sec
Running org.apache.hadoop.hbase.filter.TestColumnRangeFilter
Tests run: 1, Failures: 0, Errors: 0, Skipped: 0, Time elapsed: 25.186 sec
Running org.apache.hadoop.hbase.filter.TestColumnPaginationFilter
Tests run: 1, Failures: 0, Errors: 0, Skipped: 0, Time elapsed: 0.113 sec
Running org.apache.hadoop.hbase.filter.TestPageFilter
Tests run: 2, Failures: 0, Errors: 0, Skipped: 0, Time elapsed: 0.03 sec
Running org.apache.hadoop.hbase.filter.TestParseFilter
Tests run: 33, Failures: 0, Errors: 0, Skipped: 0, Time elapsed: 0.314 sec
Running org.apache.hadoop.hbase.filter.TestRandomRowFilter
Tests run: 2, Failures: 0, Errors: 0, Skipped: 0, Time elapsed: 0.565 sec
Running org.apache.hadoop.hbase.filter.TestPrefixFilter
Tests run: 3, Failures: 0, Errors: 0, Skipped: 0, Time elapsed: 0.106 sec
Running org.apache.hadoop.hbase.filter.TestBitComparator
Tests run: 3, Failures: 0, Errors: 0, Skipped: 0, Time elapsed: 0.036 sec
Running org.apache.hadoop.hbase.filter.TestDependentColumnFilter
Tests run: 2, Failures: 0, Errors: 0, Skipped: 0, Time elapsed: 0.954 sec
Running org.apache.hadoop.hbase.filter.TestSingleColumnValueFilter
Tests run: 2, Failures: 0, Errors: 0, Skipped: 0, Time elapsed: 0.153 sec
Running org.apache.hadoop.hbase.filter.TestInclusiveStopFilter
Tests run: 2, Failures: 0, Errors: 0, Skipped: 0, Time elapsed: 0.105 sec
Running org.apache.hadoop.hbase.filter.TestFilterList
Tests run: 4, Failures: 0, Errors: 0, Skipped: 0, Time elapsed: 0.266 sec
Running org.apache.hadoop.hbase.filter.TestFilter
Tests run: 18, Failures: 0, Errors: 0, Skipped: 0, Time elapsed: 5.283 sec
Running org.apache.hadoop.hbase.filter.TestMultipleColumnPrefixFilter
Tests run: 3, Failures: 0, Errors: 0, Skipped: 0, Time elapsed: 3.917 sec
Running org.apache.hadoop.hbase.filter.TestColumnPrefixFilter
Tests run: 2, Failures: 0, Errors: 0, Skipped: 0, Time elapsed: 2.874 sec
Running org.apache.hadoop.hbase.filter.TestSingleColumnValueExcludeFilter
Tests run: 1, Failures: 0, Errors: 0, Skipped: 0, Time elapsed: 0.115 sec
Running org.apache.hadoop.hbase.TestGlobalMemStoreSize
Tests run: 1, Failures: 0, Errors: 0, Skipped: 0, Time elapsed: 15.358 sec
Running org.apache.hadoop.hbase.TestHBaseTestingUtility
Tests run: 6, Failures: 0, Errors: 0, Skipped: 0, Time elapsed: 57.049 sec
Running org.apache.hadoop.hbase.security.TestUser
Tests run: 2, Failures: 0, Errors: 0, Skipped: 0, Time elapsed: 0.49 sec
Running org.apache.hadoop.hbase.TestRegionRebalancing
Tests run: 1, Failures: 0, Errors: 0, Skipped: 0, Time elapsed: 34.576 sec
Running org.apache.hadoop.hbase.replication.TestReplication
Tests run: 7, Failures: 0, Errors: 0, Skipped: 0, Time elapsed: 112.402 sec
Running org.apache.hadoop.hbase.replication.TestMasterReplication
Tests run: 2, Failures: 0, Errors: 0, Skipped: 0, Time elapsed: 81.427 sec
Running org.apache.hadoop.hbase.replication.regionserver.TestReplicationSourceManager
Tests run: 1, Failures: 0, Errors: 0, Skipped: 0, Time elapsed: 1.039 sec
Running org.apache.hadoop.hbase.replication.regionserver.TestReplicationSink
Tests run: 5, Failures: 0, Errors: 0, Skipped: 0, Time elapsed: 21.299 sec
Running org.apache.hadoop.hbase.replication.TestReplicationSource
Tests run: 1, Failures: 0, Errors: 0, Skipped: 0, Time elapsed: 2.945 sec
Running org.apache.hadoop.hbase.avro.TestAvroServer
Tests run: 3, Failures: 0, Errors: 0, Skipped: 0, Time elapsed: 30.657 sec
Running org.apache.hadoop.hbase.TestAcidGuarantees
Tests run: 3, Failures: 0, Errors: 0, Skipped: 3, Time elapsed: 0.06 sec
Running org.apache.hadoop.hbase.TestKeyValue
Tests run: 9, Failures: 0, Errors: 0, Skipped: 0, Time elapsed: 0.125 sec
Running org.apache.hadoop.hbase.coprocessor.TestRegionObserverInterface
Tests run: 5, Failures: 0, Errors: 0, Skipped: 0, Time elapsed: 30.715 sec
Running org.apache.hadoop.hbase.coprocessor.TestCoprocessorInterface
Tests run: 1, Failures: 0, Errors: 0, Skipped: 0, Time elapsed: 3.954 sec
Running org.apache.hadoop.hbase.coprocessor.TestMasterObserver
Tests run: 3, Failures: 0, Errors: 0, Skipped: 0, Time elapsed: 28.754 sec
Running org.apache.hadoop.hbase.coprocessor.TestCoprocessorEndpoint
Tests run: 2, Failures: 0, Errors: 0, Skipped: 0, Time elapsed: 24.701 sec
Running org.apache.hadoop.hbase.coprocessor.TestWALObserver
Tests run: 1, Failures: 0, Errors: 1, Skipped: 0, Time elapsed: 17.275 sec <<< FAILURE!
Running org.apache.hadoop.hbase.coprocessor.TestAggregateProtocol
Tests run: 44, Failures: 0, Errors: 0, Skipped: 0, Time elapsed: 20.965 sec
Running org.apache.hadoop.hbase.coprocessor.TestRegionObserverStacking
Tests run: 1, Failures: 0, Errors: 0, Skipped: 0, Time elapsed: 0.743 sec
Running org.apache.hadoop.hbase.coprocessor.TestClassLoading
Tests run: 3, Failures: 0, Errors: 0, Skipped: 0, Time elapsed: 22.168 sec
Running org.apache.hadoop.hbase.TestScanMultipleVersions
Tests run: 1, Failures: 0, Errors: 0, Skipped: 0, Time elapsed: 16.925 sec
Running org.apache.hadoop.hbase.mapred.TestTableMapReduce
Tests run: 1, Failures: 0, Errors: 1, Skipped: 0, Time elapsed: 28.88 sec <<< FAILURE!
Running org.apache.hadoop.hbase.mapred.TestTableInputFormat
Tests run: 6, Failures: 0, Errors: 0, Skipped: 0, Time elapsed: 23.963 sec
Running org.apache.hadoop.hbase.TestServerName
Tests run: 2, Failures: 0, Errors: 0, Skipped: 0, Time elapsed: 0.054 sec
Running org.apache.hadoop.hbase.master.TestActiveMasterManager
Tests run: 2, Failures: 0, Errors: 0, Skipped: 0, Time elapsed: 0.73 sec
Running org.apache.hadoop.hbase.master.TestMasterFailover
Tests run: 3, Failures: 0, Errors: 0, Skipped: 0, Time elapsed: 123.57 sec
Running org.apache.hadoop.hbase.master.TestMasterRestartAfterDisablingTable
Tests run: 1, Failures: 0, Errors: 0, Skipped: 0, Time elapsed: 23.16 sec
Running org.apache.hadoop.hbase.master.TestCatalogJanitor
Tests run: 2, Failures: 0, Errors: 0, Skipped: 0, Time elapsed: 1.12 sec
Running org.apache.hadoop.hbase.master.TestRollingRestart
Tests run: 1, Failures: 0, Errors: 0, Skipped: 0, Time elapsed: 59.142 sec
Running org.apache.hadoop.hbase.master.TestMasterTransitions
Tests run: 3, Failures: 0, Errors: 0, Skipped: 3, Time elapsed: 18.597 sec
Running org.apache.hadoop.hbase.master.TestRestartCluster
Tests run: 2, Failures: 0, Errors: 0, Skipped: 0, Time elapsed: 49.748 sec
Running org.apache.hadoop.hbase.master.TestMasterStatusServlet
Tests run: 5, Failures: 0, Errors: 0, Skipped: 0, Time elapsed: 0.967 sec
Running org.apache.hadoop.hbase.master.TestClockSkewDetection
Tests run: 1, Failures: 0, Errors: 0, Skipped: 0, Time elapsed: 0.242 sec
Running org.apache.hadoop.hbase.master.TestDefaultLoadBalancer
Tests run: 4, Failures: 0, Errors: 0, Skipped: 0, Time elapsed: 1.491 sec
Running org.apache.hadoop.hbase.master.TestHMasterRPCException
Tests run: 1, Failures: 0, Errors: 0, Skipped: 0, Time elapsed: 1.121 sec
Running org.apache.hadoop.hbase.master.TestDistributedLogSplitting
Tests run: 4, Failures: 0, Errors: 0, Skipped: 0, Time elapsed: 118.03 sec
Running org.apache.hadoop.hbase.master.TestMaster
Tests run: 1, Failures: 0, Errors: 0, Skipped: 0, Time elapsed: 79.198 sec
Running org.apache.hadoop.hbase.master.TestSplitLogManager
Tests run: 9, Failures: 0, Errors: 0, Skipped: 0, Time elapsed: 11.811 sec
Running org.apache.hadoop.hbase.master.TestDeadServer
Tests run: 1, Failures: 0, Errors: 0, Skipped: 0, Time elapsed: 0.055 sec
Running org.apache.hadoop.hbase.master.TestLogsCleaner
Tests run: 1, Failures: 0, Errors: 0, Skipped: 0, Time elapsed: 1.392 sec
Running org.apache.hadoop.hbase.master.TestZKBasedOpenCloseRegion
Tests run: 3, Failures: 0, Errors: 0, Skipped: 0, Time elapsed: 20.669 sec

Results :

Failed tests:   testMRIncrementalLoad(org.apache.hadoop.hbase.mapreduce.TestHFileOutputFormat)
  testMRIncrementalLoadWithSplit(org.apache.hadoop.hbase.mapreduce.TestHFileOutputFormat)

Tests in error: 
  test_LATEST_TIMESTAMP_isReplaced(org.apache.hadoop.hbase.mapreduce.TestHFileOutputFormat):
org.apache.hadoop.mapreduce.task.TaskAttemptContextImpl.<init>(org.apache.hadoop.mapred.JobConf,
org.apache.hadoop.mapreduce.TaskAttemptID)
  test_TIMERANGE(org.apache.hadoop.hbase.mapreduce.TestHFileOutputFormat): org.apache.hadoop.mapreduce.task.TaskAttemptContextImpl.<init>(org.apache.hadoop.mapred.JobConf,
org.apache.hadoop.mapreduce.TaskAttemptID)
  testColumnFamilyCompression(org.apache.hadoop.hbase.mapreduce.TestHFileOutputFormat): org.apache.hadoop.mapreduce.task.TaskAttemptContextImpl.<init>(org.apache.hadoop.mapred.JobConf,
org.apache.hadoop.mapreduce.TaskAttemptID)
  testMROnTable(org.apache.hadoop.hbase.mapreduce.TestImportTsv): File does not exist: /home/jenkins/.m2/repository/com/google/guava/guava/r09/guava-r09.jar
  testMROnTableWithCustomMapper(org.apache.hadoop.hbase.mapreduce.TestImportTsv): File does
not exist: /home/jenkins/.m2/repository/com/google/guava/guava/r09/guava-r09.jar
  testMultiRegionTable(org.apache.hadoop.hbase.mapreduce.TestTableMapReduce): File does not
exist: /home/jenkins/.m2/repository/org/apache/zookeeper/zookeeper/3.3.3/zookeeper-3.3.3.jar
  org.apache.hadoop.hbase.regionserver.wal.TestWALReplay: nameNode
  testLogRollOnPipelineRestart(org.apache.hadoop.hbase.regionserver.wal.TestLogRolling): Cannot
obtain block length for LocatedBlock{BP-1589348335-67.195.138.8-1315531638880:blk_1036372941904292264_1014;
getBlockSize()=1834; corrupt=false; offset=0; locs=[127.0.0.1:47257, 127.0.0.1:43762]}
  testRecoveredEditsPathForMeta(org.apache.hadoop.hbase.regionserver.wal.TestHLogSplit): nameNode
  testSplitFailsIfNewHLogGetsCreatedAfterSplitStarted(org.apache.hadoop.hbase.regionserver.wal.TestHLogSplit):
nameNode
  testSplitPreservesEdits(org.apache.hadoop.hbase.regionserver.wal.TestHLogSplit): nameNode
  testEmptyLogFiles(org.apache.hadoop.hbase.regionserver.wal.TestHLogSplit): nameNode
  testEmptyOpenLogFiles(org.apache.hadoop.hbase.regionserver.wal.TestHLogSplit): nameNode
  testOpenZeroLengthReportedFileButWithDataGetsSplit(org.apache.hadoop.hbase.regionserver.wal.TestHLogSplit):
nameNode
  testTralingGarbageCorruptionFileSkipErrorsPasses(org.apache.hadoop.hbase.regionserver.wal.TestHLogSplit):
nameNode
  testFirstLineCorruptionLogFileSkipErrorsPasses(org.apache.hadoop.hbase.regionserver.wal.TestHLogSplit):
nameNode
  testMiddleGarbageCorruptionSkipErrorsReadsHalfOfFile(org.apache.hadoop.hbase.regionserver.wal.TestHLogSplit):
nameNode
  testCorruptedFileGetsArchivedIfSkipErrors(org.apache.hadoop.hbase.regionserver.wal.TestHLogSplit):
nameNode
  testTrailingGarbageCorruptionLogFileSkipErrorsFalseThrows(org.apache.hadoop.hbase.regionserver.wal.TestHLogSplit):
nameNode
  testCorruptedLogFilesSkipErrorsFalseDoesNotTouchLogs(org.apache.hadoop.hbase.regionserver.wal.TestHLogSplit):
nameNode
  testEOFisIgnored(org.apache.hadoop.hbase.regionserver.wal.TestHLogSplit): nameNode
  testLogsGetArchivedAfterSplit(org.apache.hadoop.hbase.regionserver.wal.TestHLogSplit): nameNode
  testSplit(org.apache.hadoop.hbase.regionserver.wal.TestHLogSplit): nameNode
  testLogDirectoryShouldBeDeletedAfterSuccessfulSplit(org.apache.hadoop.hbase.regionserver.wal.TestHLogSplit):
nameNode
  testSplitWillNotTouchLogsIfNewHLogGetsCreatedAfterSplitStarted(org.apache.hadoop.hbase.regionserver.wal.TestHLogSplit):
nameNode
  testSplitWillFailIfWritingToRegionFails(org.apache.hadoop.hbase.regionserver.wal.TestHLogSplit):
nameNode
  testSplitDeletedRegion(org.apache.hadoop.hbase.regionserver.wal.TestHLogSplit): nameNode
  testIOEOnOutputThread(org.apache.hadoop.hbase.regionserver.wal.TestHLogSplit): nameNode
  testMovedHLogDuringRecovery(org.apache.hadoop.hbase.regionserver.wal.TestHLogSplit): nameNode
  testThreading(org.apache.hadoop.hbase.regionserver.wal.TestHLogSplit): nameNode
  testThreadingSlowWriterSmallBuffer(org.apache.hadoop.hbase.regionserver.wal.TestHLogSplit):
nameNode
  testSplitLogFileWithOneRegion(org.apache.hadoop.hbase.regionserver.wal.TestHLogSplit): nameNode
  testSplitLogFileDeletedRegionDir(org.apache.hadoop.hbase.regionserver.wal.TestHLogSplit):
nameNode
  testSplitLogFileEmpty(org.apache.hadoop.hbase.regionserver.wal.TestHLogSplit): nameNode
  testSplitLogFileMultipleRegions(org.apache.hadoop.hbase.regionserver.wal.TestHLogSplit):
nameNode
  testSplitLogFileFirstLineCorruptionLog(org.apache.hadoop.hbase.regionserver.wal.TestHLogSplit):
nameNode
  org.apache.hadoop.hbase.coprocessor.TestWALObserver: nameNode
  testMultiRegionTable(org.apache.hadoop.hbase.mapred.TestTableMapReduce): File does not exist:
/home/jenkins/.m2/repository/org/apache/zookeeper/zookeeper/3.3.3/zookeeper-3.3.3.jar

Tests run: 949, Failures: 2, Errors: 38, Skipped: 9

[INFO] ------------------------------------------------------------------------
[INFO] BUILD FAILURE
[INFO] ------------------------------------------------------------------------
[INFO] Total time: 1:10:28.649s
[INFO] Finished at: Fri Sep 09 01:52:29 UTC 2011
[INFO] Final Memory: 41M/632M
[INFO] ------------------------------------------------------------------------
[ERROR] Failed to execute goal org.apache.maven.plugins:maven-surefire-plugin:2.9:test (default-test)
on project hbase: There are test failures.
[ERROR] 
[ERROR] Please refer to <https://builds.apache.org/job/HBase-TRUNK-on-Hadoop-23/ws/trunk/target/surefire-reports>
for the individual test results.
[ERROR] -> [Help 1]
[ERROR] 
[ERROR] To see the full stack trace of the errors, re-run Maven with the -e switch.
[ERROR] Re-run Maven using the -X switch to enable full debug logging.
[ERROR] 
[ERROR] For more information about the errors and possible solutions, please read the following
articles:
[ERROR] [Help 1] http://cwiki.apache.org/confluence/display/MAVEN/MojoFailureException
Build step 'Invoke top-level Maven targets' marked build as failure
[locks-and-latches] Releasing all the locks
[locks-and-latches] All the locks released
Archiving artifacts
Recording test results


Mime
View raw message