hbase-dev mailing list archives

Site index · List index
Message view « Date » · « Thread »
Top « Date » · « Thread »
From Stack <st...@duboce.net>
Subject Re: Build failed in Jenkins: HBase-TRUNK #2117
Date Tue, 16 Aug 2011 06:22:57 GMT
I made https://issues.apache.org/jira/browse/INFRA-3851 for the too
many open files issue.
St.Ack

On Mon, Aug 15, 2011 at 10:44 PM, Apache Jenkins Server
<jenkins@builds.apache.org> wrote:
> See <https://builds.apache.org/job/HBase-TRUNK/2117/changes>
>
> Changes:
>
> [tedyu] HBASE-4197 Added check of scanner against null
>
> [tedyu] HBASE-2399  Forced splits only act on the first family in a table (Ming Ma)
>
> ------------------------------------------
> [...truncated 1519 lines...]
> Tests run: 2, Failures: 0, Errors: 0, Skipped: 0, Time elapsed: 0.027 sec
> Running org.apache.hadoop.hbase.filter.TestSingleColumnValueExcludeFilter
> Tests run: 1, Failures: 0, Errors: 0, Skipped: 0, Time elapsed: 0.113 sec
> Running org.apache.hadoop.hbase.filter.TestColumnRangeFilter
> Tests run: 1, Failures: 0, Errors: 0, Skipped: 0, Time elapsed: 24.589 sec
> Running org.apache.hadoop.hbase.filter.TestFilterList
> Tests run: 4, Failures: 0, Errors: 0, Skipped: 0, Time elapsed: 0.227 sec
> Running org.apache.hadoop.hbase.filter.TestSingleColumnValueFilter
> Tests run: 2, Failures: 0, Errors: 0, Skipped: 0, Time elapsed: 0.149 sec
> Running org.apache.hadoop.hbase.filter.TestDependentColumnFilter
> Tests run: 2, Failures: 0, Errors: 0, Skipped: 0, Time elapsed: 0.781 sec
> Running org.apache.hadoop.hbase.coprocessor.TestClassLoading
> Tests run: 3, Failures: 0, Errors: 0, Skipped: 0, Time elapsed: 26.133 sec
> Running org.apache.hadoop.hbase.coprocessor.TestAggregateProtocol
> Tests run: 44, Failures: 0, Errors: 0, Skipped: 0, Time elapsed: 19.292 sec
> Running org.apache.hadoop.hbase.coprocessor.TestRegionObserverStacking
> Tests run: 1, Failures: 0, Errors: 0, Skipped: 0, Time elapsed: 0.579 sec
> Running org.apache.hadoop.hbase.coprocessor.TestMasterObserver
> Tests run: 3, Failures: 0, Errors: 0, Skipped: 0, Time elapsed: 24.209 sec
> Running org.apache.hadoop.hbase.coprocessor.TestCoprocessorEndpoint
> Tests run: 2, Failures: 0, Errors: 0, Skipped: 0, Time elapsed: 25.163 sec
> Running org.apache.hadoop.hbase.coprocessor.TestWALObserver
> Tests run: 3, Failures: 0, Errors: 0, Skipped: 0, Time elapsed: 17.588 sec
> Running org.apache.hadoop.hbase.coprocessor.TestCoprocessorInterface
> Tests run: 1, Failures: 0, Errors: 0, Skipped: 0, Time elapsed: 3.825 sec
> Running org.apache.hadoop.hbase.coprocessor.TestRegionObserverInterface
> Tests run: 4, Failures: 0, Errors: 0, Skipped: 0, Time elapsed: 33.155 sec
> Running org.apache.hadoop.hbase.mapred.TestTableMapReduce
> Tests run: 1, Failures: 0, Errors: 0, Skipped: 0, Time elapsed: 84.533 sec
> Running org.apache.hadoop.hbase.TestGlobalMemStoreSize
> Tests run: 1, Failures: 0, Errors: 0, Skipped: 0, Time elapsed: 13.923 sec
> Running org.apache.hadoop.hbase.mapreduce.TestTableSplit
> Tests run: 1, Failures: 0, Errors: 0, Skipped: 0, Time elapsed: 0.13 sec
> Running org.apache.hadoop.hbase.mapreduce.TestTableMapReduce
> Tests run: 2, Failures: 0, Errors: 0, Skipped: 0, Time elapsed: 73.294 sec
> Running org.apache.hadoop.hbase.mapreduce.TestSimpleTotalOrderPartitioner
> Tests run: 1, Failures: 0, Errors: 0, Skipped: 0, Time elapsed: 0.314 sec
> Running org.apache.hadoop.hbase.mapreduce.TestHFileOutputFormat
> Tests run: 8, Failures: 0, Errors: 0, Skipped: 0, Time elapsed: 123.692 sec
> Running org.apache.hadoop.hbase.mapreduce.TestImportTsv
> Tests run: 8, Failures: 0, Errors: 0, Skipped: 0, Time elapsed: 40.6 sec
> Running org.apache.hadoop.hbase.mapreduce.TestTableInputFormatScan
> Tests run: 11, Failures: 0, Errors: 0, Skipped: 0, Time elapsed: 326.943 sec
> Running org.apache.hadoop.hbase.mapreduce.TestTimeRangeMapRed
> Tests run: 1, Failures: 0, Errors: 0, Skipped: 0, Time elapsed: 21.827 sec
> Running org.apache.hadoop.hbase.mapreduce.TestLoadIncrementalHFiles
> Tests run: 4, Failures: 0, Errors: 0, Skipped: 0, Time elapsed: 37.429 sec
> Running org.apache.hadoop.hbase.TestAcidGuarantees
> Tests run: 3, Failures: 0, Errors: 0, Skipped: 3, Time elapsed: 0.06 sec
> Running org.apache.hadoop.hbase.TestSerialization
> Tests run: 18, Failures: 0, Errors: 0, Skipped: 0, Time elapsed: 0.314 sec
> Running org.apache.hadoop.hbase.catalog.TestMetaReaderEditor
> Tests run: 4, Failures: 0, Errors: 0, Skipped: 0, Time elapsed: 22.74 sec
> Running org.apache.hadoop.hbase.catalog.TestCatalogTrackerOnCluster
> Tests run: 1, Failures: 0, Errors: 0, Skipped: 0, Time elapsed: 209.198 sec
> Running org.apache.hadoop.hbase.catalog.TestCatalogTracker
> Tests run: 8, Failures: 0, Errors: 0, Skipped: 0, Time elapsed: 3.058 sec
> Running org.apache.hadoop.hbase.client.TestResult
> Tests run: 2, Failures: 0, Errors: 0, Skipped: 0, Time elapsed: 0.139 sec
> Running org.apache.hadoop.hbase.client.TestTimestampsFilter
> Tests run: 3, Failures: 0, Errors: 0, Skipped: 0, Time elapsed: 26.626 sec
> Running org.apache.hadoop.hbase.client.TestMetaMigration
> Tests run: 4, Failures: 0, Errors: 0, Skipped: 0, Time elapsed: 18.266 sec
> Running org.apache.hadoop.hbase.client.TestShell
> Tests run: 1, Failures: 0, Errors: 0, Skipped: 0, Time elapsed: 34.01 sec
> Running org.apache.hadoop.hbase.client.TestFromClientSide
> Tests run: 45, Failures: 0, Errors: 0, Skipped: 3, Time elapsed: 110.8 sec
> Running org.apache.hadoop.hbase.client.TestGetRowVersions
> Tests run: 1, Failures: 0, Errors: 0, Skipped: 0, Time elapsed: 32.386 sec
> Running org.apache.hadoop.hbase.client.TestTimestamp
> Tests run: 1, Failures: 0, Errors: 0, Skipped: 0, Time elapsed: 17.147 sec
> Running org.apache.hadoop.hbase.client.TestHCM
> Tests run: 3, Failures: 0, Errors: 0, Skipped: 0, Time elapsed: 19.791 sec
> Running org.apache.hadoop.hbase.client.TestAttributes
> Tests run: 3, Failures: 0, Errors: 0, Skipped: 0, Time elapsed: 0.133 sec
> Running org.apache.hadoop.hbase.client.TestScannerTimeout
> Tests run: 4, Failures: 0, Errors: 0, Skipped: 0, Time elapsed: 49.424 sec
> Running org.apache.hadoop.hbase.client.TestMetaScanner
> Tests run: 1, Failures: 0, Errors: 0, Skipped: 0, Time elapsed: 17.858 sec
> Running org.apache.hadoop.hbase.client.TestHTableUtil
> Tests run: 2, Failures: 0, Errors: 0, Skipped: 0, Time elapsed: 19.523 sec
> Running org.apache.hadoop.hbase.client.TestHTablePool
> Tests run: 18, Failures: 0, Errors: 8, Skipped: 0, Time elapsed: 172.84 sec <<<
FAILURE!
> Running org.apache.hadoop.hbase.client.TestGet
> Tests run: 2, Failures: 0, Errors: 0, Skipped: 0, Time elapsed: 0.131 sec
> Running org.apache.hadoop.hbase.client.TestMultipleTimestamps
> Tests run: 8, Failures: 0, Errors: 0, Skipped: 0, Time elapsed: 56.975 sec
> Running org.apache.hadoop.hbase.client.replication.TestReplicationAdmin
> Tests run: 1, Failures: 0, Errors: 0, Skipped: 0, Time elapsed: 0.667 sec
> Running org.apache.hadoop.hbase.client.TestMultiParallel
> Tests run: 10, Failures: 0, Errors: 0, Skipped: 0, Time elapsed: 27.975 sec
> Running org.apache.hadoop.hbase.client.TestAdmin
> Tests run: 21, Failures: 0, Errors: 0, Skipped: 0, Time elapsed: 223.836 sec
> Running org.apache.hadoop.hbase.client.TestScan
> Tests run: 2, Failures: 0, Errors: 0, Skipped: 0, Time elapsed: 0.133 sec
> Running org.apache.hadoop.hbase.TestHServerInfo
> Tests run: 6, Failures: 0, Errors: 0, Skipped: 0, Time elapsed: 0.07 sec
> Running org.apache.hadoop.hbase.metrics.TestMetricsMBeanBase
> Tests run: 2, Failures: 0, Errors: 0, Skipped: 0, Time elapsed: 0.124 sec
> Running org.apache.hadoop.hbase.executor.TestExecutorService
> Tests run: 1, Failures: 0, Errors: 0, Skipped: 0, Time elapsed: 2.403 sec
> Running org.apache.hadoop.hbase.rest.TestGzipFilter
> Tests run: 3, Failures: 0, Errors: 0, Skipped: 0, Time elapsed: 20.672 sec
> Running org.apache.hadoop.hbase.rest.TestMultiRowResource
> Tests run: 3, Failures: 0, Errors: 0, Skipped: 0, Time elapsed: 20.512 sec
> Running org.apache.hadoop.hbase.rest.TestScannersWithFilters
> Tests run: 10, Failures: 0, Errors: 0, Skipped: 0, Time elapsed: 22.408 sec
> Running org.apache.hadoop.hbase.rest.TestRowResource
> Tests run: 11, Failures: 0, Errors: 0, Skipped: 0, Time elapsed: 21.542 sec
> Running org.apache.hadoop.hbase.rest.model.TestCellModel
> Tests run: 3, Failures: 0, Errors: 0, Skipped: 0, Time elapsed: 0.465 sec
> Running org.apache.hadoop.hbase.rest.model.TestCellSetModel
> Tests run: 3, Failures: 0, Errors: 0, Skipped: 0, Time elapsed: 0.493 sec
> Running org.apache.hadoop.hbase.rest.model.TestTableListModel
> Tests run: 3, Failures: 0, Errors: 0, Skipped: 0, Time elapsed: 0.47 sec
> Running org.apache.hadoop.hbase.rest.model.TestVersionModel
> Tests run: 3, Failures: 0, Errors: 0, Skipped: 0, Time elapsed: 0.456 sec
> Running org.apache.hadoop.hbase.rest.model.TestColumnSchemaModel
> Tests run: 2, Failures: 0, Errors: 0, Skipped: 0, Time elapsed: 0.27 sec
> Running org.apache.hadoop.hbase.rest.model.TestTableInfoModel
> Tests run: 3, Failures: 0, Errors: 0, Skipped: 0, Time elapsed: 0.487 sec
> Running org.apache.hadoop.hbase.rest.model.TestRowModel
> Tests run: 2, Failures: 0, Errors: 0, Skipped: 0, Time elapsed: 0.363 sec
> Running org.apache.hadoop.hbase.rest.model.TestTableSchemaModel
> Tests run: 3, Failures: 0, Errors: 0, Skipped: 0, Time elapsed: 0.489 sec
> Running org.apache.hadoop.hbase.rest.model.TestStorageClusterVersionModel
> Tests run: 2, Failures: 0, Errors: 0, Skipped: 0, Time elapsed: 0.267 sec
> Running org.apache.hadoop.hbase.rest.model.TestTableRegionModel
> Tests run: 4, Failures: 0, Errors: 0, Skipped: 0, Time elapsed: 0.455 sec
> Running org.apache.hadoop.hbase.rest.model.TestStorageClusterStatusModel
> Tests run: 3, Failures: 0, Errors: 0, Skipped: 0, Time elapsed: 0.519 sec
> Running org.apache.hadoop.hbase.rest.model.TestScannerModel
> Tests run: 3, Failures: 0, Errors: 0, Skipped: 0, Time elapsed: 0.492 sec
> Running org.apache.hadoop.hbase.rest.client.TestRemoteAdmin
> Tests run: 2, Failures: 0, Errors: 0, Skipped: 0, Time elapsed: 28.322 sec
> Running org.apache.hadoop.hbase.rest.client.TestRemoteTable
> Tests run: 3, Failures: 0, Errors: 0, Skipped: 0, Time elapsed: 20.471 sec
> Running org.apache.hadoop.hbase.rest.TestVersionResource
> Tests run: 7, Failures: 0, Errors: 0, Skipped: 0, Time elapsed: 18.722 sec
> Running org.apache.hadoop.hbase.rest.TestScannerResource
> Tests run: 5, Failures: 0, Errors: 0, Skipped: 0, Time elapsed: 47.65 sec
> Running org.apache.hadoop.hbase.rest.TestTransform
> Tests run: 1, Failures: 0, Errors: 0, Skipped: 0, Time elapsed: 24.155 sec
> Running org.apache.hadoop.hbase.rest.TestTableResource
> Tests run: 8, Failures: 0, Errors: 0, Skipped: 0, Time elapsed: 51.634 sec
> Running org.apache.hadoop.hbase.rest.TestStatusResource
> Tests run: 2, Failures: 0, Errors: 0, Skipped: 0, Time elapsed: 24.604 sec
> Running org.apache.hadoop.hbase.rest.TestSchemaResource
> Tests run: 2, Failures: 0, Errors: 0, Skipped: 0, Time elapsed: 28.248 sec
> Running org.apache.hadoop.hbase.thrift.TestThriftServer
> Tests run: 1, Failures: 0, Errors: 0, Skipped: 0, Time elapsed: 43.88 sec
> Running org.apache.hadoop.hbase.io.TestHeapSize
> Tests run: 2, Failures: 0, Errors: 0, Skipped: 0, Time elapsed: 0.16 sec
> Running org.apache.hadoop.hbase.io.hfile.TestHFileSeek
> Tests run: 1, Failures: 0, Errors: 0, Skipped: 0, Time elapsed: 6.202 sec
> Running org.apache.hadoop.hbase.io.hfile.TestCachedBlockQueue
> Tests run: 2, Failures: 0, Errors: 0, Skipped: 0, Time elapsed: 0.1 sec
> Running org.apache.hadoop.hbase.io.hfile.TestHFileBlockIndex
> Tests run: 10, Failures: 0, Errors: 0, Skipped: 0, Time elapsed: 10.999 sec
> Running org.apache.hadoop.hbase.io.hfile.TestLruBlockCache
> Tests run: 7, Failures: 0, Errors: 0, Skipped: 0, Time elapsed: 1.138 sec
> Running org.apache.hadoop.hbase.io.hfile.TestHFilePerformance
> Tests run: 1, Failures: 0, Errors: 0, Skipped: 0, Time elapsed: 6.403 sec
> Running org.apache.hadoop.hbase.io.hfile.TestFixedFileTrailer
> Tests run: 2, Failures: 0, Errors: 0, Skipped: 0, Time elapsed: 0.543 sec
> Running org.apache.hadoop.hbase.io.hfile.TestHFileWriterV2
> Tests run: 1, Failures: 0, Errors: 0, Skipped: 0, Time elapsed: 0.864 sec
> Running org.apache.hadoop.hbase.io.hfile.TestHFileReaderV1
> Tests run: 1, Failures: 0, Errors: 0, Skipped: 0, Time elapsed: 0.431 sec
> Running org.apache.hadoop.hbase.io.hfile.TestHFile
> Tests run: 6, Failures: 0, Errors: 0, Skipped: 0, Time elapsed: 0.831 sec
> Running org.apache.hadoop.hbase.io.hfile.TestReseekTo
> Tests run: 1, Failures: 0, Errors: 0, Skipped: 0, Time elapsed: 1.406 sec
> Running org.apache.hadoop.hbase.io.hfile.TestHFileBlock
> Tests run: 7, Failures: 0, Errors: 0, Skipped: 0, Time elapsed: 29.806 sec
> Running org.apache.hadoop.hbase.io.hfile.TestSeekTo
> Tests run: 3, Failures: 0, Errors: 0, Skipped: 0, Time elapsed: 0.655 sec
> Running org.apache.hadoop.hbase.io.hfile.TestCacheOnWrite
> Tests run: 6, Failures: 0, Errors: 0, Skipped: 0, Time elapsed: 5.504 sec
> Running org.apache.hadoop.hbase.io.TestHbaseObjectWritable
> Tests run: 3, Failures: 0, Errors: 0, Skipped: 0, Time elapsed: 0.392 sec
> Running org.apache.hadoop.hbase.io.TestImmutableBytesWritable
> Tests run: 3, Failures: 0, Errors: 0, Skipped: 0, Time elapsed: 0.106 sec
> Running org.apache.hadoop.hbase.io.TestHalfStoreFileReader
> Tests run: 1, Failures: 0, Errors: 0, Skipped: 0, Time elapsed: 1.355 sec
> Running org.apache.hadoop.hbase.avro.TestAvroServer
> Tests run: 3, Failures: 0, Errors: 0, Skipped: 0, Time elapsed: 34.015 sec
> Running org.apache.hadoop.hbase.TestKeyValue
> Tests run: 9, Failures: 0, Errors: 0, Skipped: 0, Time elapsed: 0.124 sec
> Running org.apache.hadoop.hbase.replication.regionserver.TestReplicationSourceManager
> Tests run: 1, Failures: 0, Errors: 0, Skipped: 0, Time elapsed: 0.899 sec
> Running org.apache.hadoop.hbase.replication.regionserver.TestReplicationSink
> Tests run: 5, Failures: 0, Errors: 0, Skipped: 0, Time elapsed: 22.677 sec
> Running org.apache.hadoop.hbase.replication.TestReplicationSource
> Tests run: 1, Failures: 0, Errors: 0, Skipped: 0, Time elapsed: 7.264 sec
> Running org.apache.hadoop.hbase.replication.TestReplication
> Tests run: 7, Failures: 0, Errors: 0, Skipped: 0, Time elapsed: 109.017 sec
> Running org.apache.hadoop.hbase.ipc.TestDelayedRpc
> Tests run: 4, Failures: 0, Errors: 0, Skipped: 0, Time elapsed: 2.112 sec
> Running org.apache.hadoop.hbase.TestCompare
> Tests run: 1, Failures: 0, Errors: 0, Skipped: 0, Time elapsed: 0.224 sec
> Running org.apache.hadoop.hbase.TestZooKeeper
> Tests run: 7, Failures: 0, Errors: 0, Skipped: 0, Time elapsed: 85.296 sec
> Running org.apache.hadoop.hbase.TestHBaseTestingUtility
> Tests run: 6, Failures: 0, Errors: 0, Skipped: 0, Time elapsed: 62.286 sec
>
> Results :
>
> Tests in error:
>  testOrphanLogCreation(org.apache.hadoop.hbase.master.TestDistributedLogSplitting):
Unexpected exception, expected<org.apache.hadoop.hbase.regionserver.wal.OrphanHLogAfterSplitException>
but was<java.lang.NullPointerException>
>  testOrphanLogCreation(org.apache.hadoop.hbase.master.TestDistributedLogSplitting)
>  testRecoveredEdits(org.apache.hadoop.hbase.master.TestDistributedLogSplitting): <https://builds.apache.org/job/HBase-TRUNK/ws/trunk/target/test-data/39f36702-3dd6-4948-b75e-ac793d3491de/772c6f41-6a9b-481f-82a7-df1db1c0a109/81fe2a9d-970c-41b7-8a0a-ac33c7d9eaca/dfs/name1/current/fsimage>
(Too many open files)
>  testRecoveredEdits(org.apache.hadoop.hbase.master.TestDistributedLogSplitting)
>  testWorkerAbort(org.apache.hadoop.hbase.master.TestDistributedLogSplitting): <https://builds.apache.org/job/HBase-TRUNK/ws/trunk/target/test-data/39f36702-3dd6-4948-b75e-ac793d3491de/772c6f41-6a9b-481f-82a7-df1db1c0a109/81fe2a9d-970c-41b7-8a0a-ac33c7d9eaca/cface568-6b7c-42e8-862e-0c199fca0429/dfs/name1/current/fsimage>
(Too many open files)
>  testWorkerAbort(org.apache.hadoop.hbase.master.TestDistributedLogSplitting)
>  testInfoServersRedirect(org.apache.hadoop.hbase.TestInfoServers): Cannot lock storage
<https://builds.apache.org/job/HBase-TRUNK/ws/trunk/build/hbase/test/dfs/name1.> The
directory is already locked.
>  testInfoServersStatusPages(org.apache.hadoop.hbase.TestInfoServers): Cannot lock storage
<https://builds.apache.org/job/HBase-TRUNK/ws/trunk/build/hbase/test/dfs/name1.> The
directory is already locked.
>  testMergeTool(org.apache.hadoop.hbase.util.TestMergeTool): Cannot lock storage <https://builds.apache.org/job/HBase-TRUNK/ws/trunk/build/hbase/test/dfs/name2.>
The directory is already locked.
>  testCloseTablePool(org.apache.hadoop.hbase.client.TestHTablePool$TestHTableThreadLocalPool):
org.apache.hadoop.ipc.RemoteException: java.io.IOException: File /user/jenkins/TestHTablePool/83ad621d6c09ad0f65c2ddd898270e2e/.tmp/.regioninfo
could only be replicated to 0 nodes, instead of 1
>  testTableWithStringName(org.apache.hadoop.hbase.client.TestHTablePool$TestHTableThreadLocalPool):
Cluster already running at <https://builds.apache.org/job/HBase-TRUNK/ws/trunk/target/test-data/4f6f8abc-79a7-4f9d-aea9-3a9b5478e546/484964eb-9db9-4122-8011-da7b1ef22efb/4d62e4a9-5e03-4c92-bd46-260f584301d7/fe1fe7bb-34d4-4b23-91d2-2e0a29911f37/ec2a5039-8c84-4619-93c4-d29132c728e1/db75af3f-6c0e-4c57-8c92-d6155a7fc7bb/5646f83b-7cff-4643-b064-7fae27ef971d/ee948243-ee19-4efb-8216-4cf242f65a46/85887408-574c-4daa-b206-99c7265aadc2/39f427f4-0e29-4e97-97d0-745a0f1b67df/fc4b8755-731e-48a1-a760-dc2237aa2014>
>  testTableWithByteArrayName(org.apache.hadoop.hbase.client.TestHTablePool$TestHTableThreadLocalPool):
Cluster already running at <https://builds.apache.org/job/HBase-TRUNK/ws/trunk/target/test-data/4f6f8abc-79a7-4f9d-aea9-3a9b5478e546/484964eb-9db9-4122-8011-da7b1ef22efb/4d62e4a9-5e03-4c92-bd46-260f584301d7/fe1fe7bb-34d4-4b23-91d2-2e0a29911f37/ec2a5039-8c84-4619-93c4-d29132c728e1/db75af3f-6c0e-4c57-8c92-d6155a7fc7bb/5646f83b-7cff-4643-b064-7fae27ef971d/ee948243-ee19-4efb-8216-4cf242f65a46/85887408-574c-4daa-b206-99c7265aadc2/39f427f4-0e29-4e97-97d0-745a0f1b67df/fc4b8755-731e-48a1-a760-dc2237aa2014>
>  testTablesWithDifferentNames(org.apache.hadoop.hbase.client.TestHTablePool$TestHTableThreadLocalPool):
Cluster already running at <https://builds.apache.org/job/HBase-TRUNK/ws/trunk/target/test-data/4f6f8abc-79a7-4f9d-aea9-3a9b5478e546/484964eb-9db9-4122-8011-da7b1ef22efb/4d62e4a9-5e03-4c92-bd46-260f584301d7/fe1fe7bb-34d4-4b23-91d2-2e0a29911f37/ec2a5039-8c84-4619-93c4-d29132c728e1/db75af3f-6c0e-4c57-8c92-d6155a7fc7bb/5646f83b-7cff-4643-b064-7fae27ef971d/ee948243-ee19-4efb-8216-4cf242f65a46/85887408-574c-4daa-b206-99c7265aadc2/39f427f4-0e29-4e97-97d0-745a0f1b67df/fc4b8755-731e-48a1-a760-dc2237aa2014>
>  testProxyImplementationReturned(org.apache.hadoop.hbase.client.TestHTablePool$TestHTableThreadLocalPool):
Cluster already running at <https://builds.apache.org/job/HBase-TRUNK/ws/trunk/target/test-data/4f6f8abc-79a7-4f9d-aea9-3a9b5478e546/484964eb-9db9-4122-8011-da7b1ef22efb/4d62e4a9-5e03-4c92-bd46-260f584301d7/fe1fe7bb-34d4-4b23-91d2-2e0a29911f37/ec2a5039-8c84-4619-93c4-d29132c728e1/db75af3f-6c0e-4c57-8c92-d6155a7fc7bb/5646f83b-7cff-4643-b064-7fae27ef971d/ee948243-ee19-4efb-8216-4cf242f65a46/85887408-574c-4daa-b206-99c7265aadc2/39f427f4-0e29-4e97-97d0-745a0f1b67df/fc4b8755-731e-48a1-a760-dc2237aa2014>
>  testDeprecatedUsagePattern(org.apache.hadoop.hbase.client.TestHTablePool$TestHTableThreadLocalPool):
Cluster already running at <https://builds.apache.org/job/HBase-TRUNK/ws/trunk/target/test-data/4f6f8abc-79a7-4f9d-aea9-3a9b5478e546/484964eb-9db9-4122-8011-da7b1ef22efb/4d62e4a9-5e03-4c92-bd46-260f584301d7/fe1fe7bb-34d4-4b23-91d2-2e0a29911f37/ec2a5039-8c84-4619-93c4-d29132c728e1/db75af3f-6c0e-4c57-8c92-d6155a7fc7bb/5646f83b-7cff-4643-b064-7fae27ef971d/ee948243-ee19-4efb-8216-4cf242f65a46/85887408-574c-4daa-b206-99c7265aadc2/39f427f4-0e29-4e97-97d0-745a0f1b67df/fc4b8755-731e-48a1-a760-dc2237aa2014>
>  testReturnDifferentTable(org.apache.hadoop.hbase.client.TestHTablePool$TestHTableThreadLocalPool):
Cluster already running at <https://builds.apache.org/job/HBase-TRUNK/ws/trunk/target/test-data/4f6f8abc-79a7-4f9d-aea9-3a9b5478e546/484964eb-9db9-4122-8011-da7b1ef22efb/4d62e4a9-5e03-4c92-bd46-260f584301d7/fe1fe7bb-34d4-4b23-91d2-2e0a29911f37/ec2a5039-8c84-4619-93c4-d29132c728e1/db75af3f-6c0e-4c57-8c92-d6155a7fc7bb/5646f83b-7cff-4643-b064-7fae27ef971d/ee948243-ee19-4efb-8216-4cf242f65a46/85887408-574c-4daa-b206-99c7265aadc2/39f427f4-0e29-4e97-97d0-745a0f1b67df/fc4b8755-731e-48a1-a760-dc2237aa2014>
>  testClassCastException(org.apache.hadoop.hbase.client.TestHTablePool$TestHTableThreadLocalPool):
Cluster already running at <https://builds.apache.org/job/HBase-TRUNK/ws/trunk/target/test-data/4f6f8abc-79a7-4f9d-aea9-3a9b5478e546/484964eb-9db9-4122-8011-da7b1ef22efb/4d62e4a9-5e03-4c92-bd46-260f584301d7/fe1fe7bb-34d4-4b23-91d2-2e0a29911f37/ec2a5039-8c84-4619-93c4-d29132c728e1/db75af3f-6c0e-4c57-8c92-d6155a7fc7bb/5646f83b-7cff-4643-b064-7fae27ef971d/ee948243-ee19-4efb-8216-4cf242f65a46/85887408-574c-4daa-b206-99c7265aadc2/39f427f4-0e29-4e97-97d0-745a0f1b67df/fc4b8755-731e-48a1-a760-dc2237aa2014>
>
> Tests run: 877, Failures: 0, Errors: 17, Skipped: 9
>
> [INFO] ------------------------------------------------------------------------
> [INFO] BUILD FAILURE
> [INFO] ------------------------------------------------------------------------
> [INFO] Total time: 1:40:22.663s
> [INFO] Finished at: Tue Aug 16 05:43:51 UTC 2011
> [INFO] Final Memory: 41M/613M
> [INFO] ------------------------------------------------------------------------
> [ERROR] Failed to execute goal org.apache.maven.plugins:maven-surefire-plugin:2.9:test
(default-test) on project hbase: Failure or timeout -> [Help 1]
> [ERROR]
> [ERROR] To see the full stack trace of the errors, re-run Maven with the -e switch.
> [ERROR] Re-run Maven using the -X switch to enable full debug logging.
> [ERROR]
> [ERROR] For more information about the errors and possible solutions, please read the
following articles:
> [ERROR] [Help 1] http://cwiki.apache.org/confluence/display/MAVEN/MojoExecutionException
> [locks-and-latches] Releasing all the locks
> [locks-and-latches] All the locks released
> Archiving artifacts
> Updating HBASE-2399
> Updating HBASE-4197
> Recording test results
>
>

Mime
View raw message