hbase-dev mailing list archives

Site index · List index
Message view « Date » · « Thread »
Top « Date » · « Thread »
From Apache Jenkins Server <jenk...@builds.apache.org>
Subject Build failed in Jenkins: HBase-TRUNK #2116
Date Tue, 16 Aug 2011 02:40:55 GMT
See <https://builds.apache.org/job/HBase-TRUNK/2116/changes>

Changes:

[tedyu] HBASE-4197 TestCoprocessorInterface demonstrates CustomScanner usage

------------------------------------------
[...truncated 29334 lines...]
Running org.apache.hadoop.hbase.filter.TestColumnRangeFilter
Tests run: 1, Failures: 0, Errors: 0, Skipped: 0, Time elapsed: 25.705 sec
Running org.apache.hadoop.hbase.filter.TestFilterList
Tests run: 4, Failures: 0, Errors: 0, Skipped: 0, Time elapsed: 0.226 sec
Running org.apache.hadoop.hbase.filter.TestSingleColumnValueFilter
Tests run: 2, Failures: 0, Errors: 0, Skipped: 0, Time elapsed: 0.15 sec
Running org.apache.hadoop.hbase.filter.TestDependentColumnFilter
Tests run: 2, Failures: 0, Errors: 0, Skipped: 0, Time elapsed: 0.778 sec
Running org.apache.hadoop.hbase.coprocessor.TestClassLoading
Tests run: 3, Failures: 0, Errors: 0, Skipped: 0, Time elapsed: 25.417 sec
Running org.apache.hadoop.hbase.coprocessor.TestAggregateProtocol
Tests run: 44, Failures: 0, Errors: 0, Skipped: 0, Time elapsed: 18.107 sec
Running org.apache.hadoop.hbase.coprocessor.TestRegionObserverStacking
Tests run: 1, Failures: 0, Errors: 0, Skipped: 0, Time elapsed: 0.58 sec
Running org.apache.hadoop.hbase.coprocessor.TestMasterObserver
Tests run: 3, Failures: 0, Errors: 0, Skipped: 0, Time elapsed: 25.1 sec
Running org.apache.hadoop.hbase.coprocessor.TestCoprocessorEndpoint
Tests run: 2, Failures: 0, Errors: 0, Skipped: 0, Time elapsed: 23.252 sec
Running org.apache.hadoop.hbase.coprocessor.TestWALObserver
Tests run: 3, Failures: 0, Errors: 0, Skipped: 0, Time elapsed: 18.716 sec
Running org.apache.hadoop.hbase.coprocessor.TestCoprocessorInterface
Tests run: 1, Failures: 0, Errors: 0, Skipped: 0, Time elapsed: 3.707 sec
Running org.apache.hadoop.hbase.coprocessor.TestRegionObserverInterface
Tests run: 4, Failures: 0, Errors: 0, Skipped: 0, Time elapsed: 34.249 sec
Running org.apache.hadoop.hbase.mapred.TestTableMapReduce
Tests run: 1, Failures: 0, Errors: 0, Skipped: 0, Time elapsed: 109.665 sec
Running org.apache.hadoop.hbase.TestGlobalMemStoreSize
Tests run: 1, Failures: 0, Errors: 0, Skipped: 0, Time elapsed: 17.431 sec
Running org.apache.hadoop.hbase.mapreduce.TestTableSplit
Tests run: 1, Failures: 0, Errors: 0, Skipped: 0, Time elapsed: 0.13 sec
Running org.apache.hadoop.hbase.mapreduce.TestTableMapReduce
Tests run: 2, Failures: 0, Errors: 0, Skipped: 0, Time elapsed: 64.611 sec
Running org.apache.hadoop.hbase.mapreduce.TestSimpleTotalOrderPartitioner
Tests run: 1, Failures: 0, Errors: 0, Skipped: 0, Time elapsed: 0.314 sec
Running org.apache.hadoop.hbase.mapreduce.TestHFileOutputFormat
Tests run: 8, Failures: 0, Errors: 0, Skipped: 0, Time elapsed: 120.029 sec
Running org.apache.hadoop.hbase.mapreduce.TestImportTsv
Tests run: 8, Failures: 0, Errors: 0, Skipped: 0, Time elapsed: 43.426 sec
Running org.apache.hadoop.hbase.mapreduce.TestTableInputFormatScan
Tests run: 11, Failures: 0, Errors: 0, Skipped: 0, Time elapsed: 326.13 sec
Running org.apache.hadoop.hbase.mapreduce.TestTimeRangeMapRed
Tests run: 1, Failures: 0, Errors: 0, Skipped: 0, Time elapsed: 21.114 sec
Running org.apache.hadoop.hbase.mapreduce.TestLoadIncrementalHFiles
Tests run: 4, Failures: 0, Errors: 0, Skipped: 0, Time elapsed: 36.341 sec
Running org.apache.hadoop.hbase.TestAcidGuarantees
Tests run: 3, Failures: 0, Errors: 0, Skipped: 3, Time elapsed: 0.06 sec
Running org.apache.hadoop.hbase.TestSerialization
Tests run: 18, Failures: 0, Errors: 0, Skipped: 0, Time elapsed: 0.313 sec
Running org.apache.hadoop.hbase.catalog.TestMetaReaderEditor
Tests run: 4, Failures: 0, Errors: 0, Skipped: 0, Time elapsed: 22.742 sec
Running org.apache.hadoop.hbase.catalog.TestCatalogTrackerOnCluster
Tests run: 1, Failures: 0, Errors: 0, Skipped: 0, Time elapsed: 209.136 sec
Running org.apache.hadoop.hbase.catalog.TestCatalogTracker
Tests run: 8, Failures: 0, Errors: 0, Skipped: 0, Time elapsed: 3.032 sec
Running org.apache.hadoop.hbase.client.TestResult
Tests run: 2, Failures: 0, Errors: 0, Skipped: 0, Time elapsed: 0.14 sec
Running org.apache.hadoop.hbase.client.TestTimestampsFilter
Tests run: 3, Failures: 0, Errors: 0, Skipped: 0, Time elapsed: 31.158 sec
Running org.apache.hadoop.hbase.client.TestMetaMigration
Tests run: 4, Failures: 0, Errors: 0, Skipped: 0, Time elapsed: 15.684 sec
Running org.apache.hadoop.hbase.client.TestShell
Tests run: 1, Failures: 0, Errors: 0, Skipped: 0, Time elapsed: 35.928 sec
Running org.apache.hadoop.hbase.client.TestFromClientSide
Tests run: 45, Failures: 0, Errors: 0, Skipped: 3, Time elapsed: 103.513 sec
Running org.apache.hadoop.hbase.client.TestGetRowVersions
Tests run: 1, Failures: 0, Errors: 0, Skipped: 0, Time elapsed: 32.451 sec
Running org.apache.hadoop.hbase.client.TestTimestamp
Tests run: 1, Failures: 0, Errors: 0, Skipped: 0, Time elapsed: 17.083 sec
Running org.apache.hadoop.hbase.client.TestHCM
Tests run: 3, Failures: 0, Errors: 0, Skipped: 0, Time elapsed: 18.777 sec
Running org.apache.hadoop.hbase.client.TestAttributes
Tests run: 3, Failures: 0, Errors: 0, Skipped: 0, Time elapsed: 0.133 sec
Running org.apache.hadoop.hbase.client.TestScannerTimeout
Tests run: 4, Failures: 0, Errors: 4, Skipped: 0, Time elapsed: 202.263 sec <<< FAILURE!
Running org.apache.hadoop.hbase.client.TestMetaScanner
Tests run: 1, Failures: 0, Errors: 0, Skipped: 0, Time elapsed: 20.794 sec
Running org.apache.hadoop.hbase.client.TestHTableUtil
Tests run: 2, Failures: 0, Errors: 0, Skipped: 0, Time elapsed: 21.546 sec
Running org.apache.hadoop.hbase.client.TestHTablePool
Tests run: 18, Failures: 0, Errors: 8, Skipped: 0, Time elapsed: 213.491 sec <<<
FAILURE!
Running org.apache.hadoop.hbase.client.TestGet
Tests run: 2, Failures: 0, Errors: 0, Skipped: 0, Time elapsed: 0.131 sec
Running org.apache.hadoop.hbase.client.TestMultipleTimestamps
Tests run: 8, Failures: 0, Errors: 0, Skipped: 0, Time elapsed: 52.519 sec
Running org.apache.hadoop.hbase.client.replication.TestReplicationAdmin
Tests run: 1, Failures: 0, Errors: 0, Skipped: 0, Time elapsed: 0.665 sec
Running org.apache.hadoop.hbase.client.TestMultiParallel
Tests run: 10, Failures: 0, Errors: 0, Skipped: 0, Time elapsed: 24.694 sec
Running org.apache.hadoop.hbase.client.TestAdmin
Tests run: 20, Failures: 0, Errors: 0, Skipped: 0, Time elapsed: 203.299 sec
Running org.apache.hadoop.hbase.client.TestScan
Tests run: 2, Failures: 0, Errors: 0, Skipped: 0, Time elapsed: 0.133 sec
Running org.apache.hadoop.hbase.TestHServerInfo
Tests run: 6, Failures: 0, Errors: 0, Skipped: 0, Time elapsed: 0.069 sec
Running org.apache.hadoop.hbase.metrics.TestMetricsMBeanBase
Tests run: 2, Failures: 0, Errors: 0, Skipped: 0, Time elapsed: 0.124 sec
Running org.apache.hadoop.hbase.executor.TestExecutorService
Tests run: 1, Failures: 0, Errors: 0, Skipped: 0, Time elapsed: 2.399 sec
Running org.apache.hadoop.hbase.rest.TestGzipFilter
Tests run: 3, Failures: 0, Errors: 0, Skipped: 0, Time elapsed: 25.522 sec
Running org.apache.hadoop.hbase.rest.TestMultiRowResource
Tests run: 3, Failures: 0, Errors: 0, Skipped: 0, Time elapsed: 21.825 sec
Running org.apache.hadoop.hbase.rest.TestScannersWithFilters
Tests run: 10, Failures: 0, Errors: 0, Skipped: 0, Time elapsed: 23.448 sec
Running org.apache.hadoop.hbase.rest.TestRowResource
Tests run: 11, Failures: 0, Errors: 0, Skipped: 0, Time elapsed: 23.734 sec
Running org.apache.hadoop.hbase.rest.model.TestCellModel
Tests run: 3, Failures: 0, Errors: 0, Skipped: 0, Time elapsed: 0.463 sec
Running org.apache.hadoop.hbase.rest.model.TestCellSetModel
Tests run: 3, Failures: 0, Errors: 0, Skipped: 0, Time elapsed: 0.491 sec
Running org.apache.hadoop.hbase.rest.model.TestTableListModel
Tests run: 3, Failures: 0, Errors: 0, Skipped: 0, Time elapsed: 0.468 sec
Running org.apache.hadoop.hbase.rest.model.TestVersionModel
Tests run: 3, Failures: 0, Errors: 0, Skipped: 0, Time elapsed: 0.453 sec
Running org.apache.hadoop.hbase.rest.model.TestColumnSchemaModel
Tests run: 2, Failures: 0, Errors: 0, Skipped: 0, Time elapsed: 0.271 sec
Running org.apache.hadoop.hbase.rest.model.TestTableInfoModel
Tests run: 3, Failures: 0, Errors: 0, Skipped: 0, Time elapsed: 0.492 sec
Running org.apache.hadoop.hbase.rest.model.TestRowModel
Tests run: 2, Failures: 0, Errors: 0, Skipped: 0, Time elapsed: 0.362 sec
Running org.apache.hadoop.hbase.rest.model.TestTableSchemaModel
Tests run: 3, Failures: 0, Errors: 0, Skipped: 0, Time elapsed: 0.49 sec
Running org.apache.hadoop.hbase.rest.model.TestStorageClusterVersionModel
Tests run: 2, Failures: 0, Errors: 0, Skipped: 0, Time elapsed: 0.265 sec
Running org.apache.hadoop.hbase.rest.model.TestTableRegionModel
Tests run: 4, Failures: 0, Errors: 0, Skipped: 0, Time elapsed: 0.457 sec
Running org.apache.hadoop.hbase.rest.model.TestStorageClusterStatusModel
Tests run: 3, Failures: 0, Errors: 0, Skipped: 0, Time elapsed: 0.523 sec
Running org.apache.hadoop.hbase.rest.model.TestScannerModel
Tests run: 3, Failures: 0, Errors: 0, Skipped: 0, Time elapsed: 0.495 sec
Running org.apache.hadoop.hbase.rest.client.TestRemoteAdmin
Tests run: 2, Failures: 0, Errors: 0, Skipped: 0, Time elapsed: 24.531 sec
Running org.apache.hadoop.hbase.rest.client.TestRemoteTable
Tests run: 3, Failures: 0, Errors: 0, Skipped: 0, Time elapsed: 23.565 sec
Running org.apache.hadoop.hbase.rest.TestVersionResource
Tests run: 7, Failures: 0, Errors: 0, Skipped: 0, Time elapsed: 19.604 sec
Running org.apache.hadoop.hbase.rest.TestScannerResource
Tests run: 5, Failures: 0, Errors: 0, Skipped: 0, Time elapsed: 45.453 sec
Running org.apache.hadoop.hbase.rest.TestTransform
Tests run: 1, Failures: 0, Errors: 0, Skipped: 0, Time elapsed: 22.779 sec
Running org.apache.hadoop.hbase.rest.TestTableResource
Tests run: 8, Failures: 0, Errors: 0, Skipped: 0, Time elapsed: 52.61 sec
Running org.apache.hadoop.hbase.rest.TestStatusResource
Tests run: 2, Failures: 0, Errors: 0, Skipped: 0, Time elapsed: 25.306 sec
Running org.apache.hadoop.hbase.rest.TestSchemaResource
Tests run: 2, Failures: 0, Errors: 0, Skipped: 0, Time elapsed: 31.607 sec
Running org.apache.hadoop.hbase.thrift.TestThriftServer
Tests run: 1, Failures: 0, Errors: 0, Skipped: 0, Time elapsed: 43.52 sec
Running org.apache.hadoop.hbase.io.TestHeapSize
Tests run: 2, Failures: 0, Errors: 0, Skipped: 0, Time elapsed: 0.147 sec
Running org.apache.hadoop.hbase.io.hfile.TestHFileSeek
Tests run: 1, Failures: 0, Errors: 0, Skipped: 0, Time elapsed: 6.075 sec
Running org.apache.hadoop.hbase.io.hfile.TestCachedBlockQueue
Tests run: 2, Failures: 0, Errors: 0, Skipped: 0, Time elapsed: 0.1 sec
Running org.apache.hadoop.hbase.io.hfile.TestHFileBlockIndex
Tests run: 10, Failures: 0, Errors: 0, Skipped: 0, Time elapsed: 10.838 sec
Running org.apache.hadoop.hbase.io.hfile.TestLruBlockCache
Tests run: 7, Failures: 0, Errors: 0, Skipped: 0, Time elapsed: 1.138 sec
Running org.apache.hadoop.hbase.io.hfile.TestHFilePerformance
Tests run: 1, Failures: 0, Errors: 0, Skipped: 0, Time elapsed: 6.438 sec
Running org.apache.hadoop.hbase.io.hfile.TestFixedFileTrailer
Tests run: 2, Failures: 0, Errors: 0, Skipped: 0, Time elapsed: 0.544 sec
Running org.apache.hadoop.hbase.io.hfile.TestHFileWriterV2
Tests run: 1, Failures: 0, Errors: 0, Skipped: 0, Time elapsed: 0.859 sec
Running org.apache.hadoop.hbase.io.hfile.TestHFileReaderV1
Tests run: 1, Failures: 0, Errors: 0, Skipped: 0, Time elapsed: 0.43 sec
Running org.apache.hadoop.hbase.io.hfile.TestHFile
Tests run: 6, Failures: 0, Errors: 0, Skipped: 0, Time elapsed: 0.839 sec
Running org.apache.hadoop.hbase.io.hfile.TestReseekTo
Tests run: 1, Failures: 0, Errors: 0, Skipped: 0, Time elapsed: 1.416 sec
Running org.apache.hadoop.hbase.io.hfile.TestHFileBlock
Tests run: 7, Failures: 0, Errors: 0, Skipped: 0, Time elapsed: 30.16 sec
Running org.apache.hadoop.hbase.io.hfile.TestSeekTo
Tests run: 3, Failures: 0, Errors: 0, Skipped: 0, Time elapsed: 0.633 sec
Running org.apache.hadoop.hbase.io.hfile.TestCacheOnWrite
Tests run: 6, Failures: 0, Errors: 0, Skipped: 0, Time elapsed: 5.701 sec
Running org.apache.hadoop.hbase.io.TestHbaseObjectWritable
Tests run: 3, Failures: 0, Errors: 0, Skipped: 0, Time elapsed: 0.393 sec
Running org.apache.hadoop.hbase.io.TestImmutableBytesWritable
Tests run: 3, Failures: 0, Errors: 0, Skipped: 0, Time elapsed: 0.106 sec
Running org.apache.hadoop.hbase.io.TestHalfStoreFileReader
Tests run: 1, Failures: 0, Errors: 0, Skipped: 0, Time elapsed: 1.355 sec
Running org.apache.hadoop.hbase.avro.TestAvroServer
Tests run: 3, Failures: 0, Errors: 0, Skipped: 0, Time elapsed: 31.613 sec
Running org.apache.hadoop.hbase.TestKeyValue
Tests run: 9, Failures: 0, Errors: 0, Skipped: 0, Time elapsed: 0.124 sec
Running org.apache.hadoop.hbase.replication.regionserver.TestReplicationSourceManager
Tests run: 1, Failures: 0, Errors: 0, Skipped: 0, Time elapsed: 0.897 sec
Running org.apache.hadoop.hbase.replication.regionserver.TestReplicationSink
Tests run: 5, Failures: 0, Errors: 0, Skipped: 0, Time elapsed: 23.594 sec
Running org.apache.hadoop.hbase.replication.TestReplicationSource
Tests run: 1, Failures: 0, Errors: 0, Skipped: 0, Time elapsed: 6.962 sec
Running org.apache.hadoop.hbase.replication.TestReplication
Tests run: 7, Failures: 0, Errors: 0, Skipped: 0, Time elapsed: 98.976 sec
Running org.apache.hadoop.hbase.ipc.TestDelayedRpc
Tests run: 4, Failures: 0, Errors: 0, Skipped: 0, Time elapsed: 2.116 sec
Running org.apache.hadoop.hbase.TestCompare
Tests run: 1, Failures: 0, Errors: 0, Skipped: 0, Time elapsed: 0.223 sec
Running org.apache.hadoop.hbase.TestZooKeeper
Tests run: 7, Failures: 0, Errors: 0, Skipped: 0, Time elapsed: 89.103 sec
Running org.apache.hadoop.hbase.TestHBaseTestingUtility
Tests run: 6, Failures: 0, Errors: 0, Skipped: 0, Time elapsed: 60.52 sec

Results :

Tests in error: 
  testOrphanLogCreation(org.apache.hadoop.hbase.master.TestDistributedLogSplitting): Unexpected
exception, expected<org.apache.hadoop.hbase.regionserver.wal.OrphanHLogAfterSplitException>
but was<java.lang.NullPointerException>
  testOrphanLogCreation(org.apache.hadoop.hbase.master.TestDistributedLogSplitting)
  testRecoveredEdits(org.apache.hadoop.hbase.master.TestDistributedLogSplitting): java.io.FileNotFoundException:
<https://builds.apache.org/job/HBase-TRUNK/ws/trunk/target/classes/hbase-default.xml>
(Too many open files)
  testRecoveredEdits(org.apache.hadoop.hbase.master.TestDistributedLogSplitting)
  testWorkerAbort(org.apache.hadoop.hbase.master.TestDistributedLogSplitting): java.io.FileNotFoundException:
<https://builds.apache.org/job/HBase-TRUNK/ws/trunk/target/classes/hbase-default.xml>
(Too many open files)
  testWorkerAbort(org.apache.hadoop.hbase.master.TestDistributedLogSplitting)
  test2481(org.apache.hadoop.hbase.client.TestScannerTimeout): Trying to contact region server
/67.195.138.60:37074 for region t,,1313460891178.cff805b1a4ab3f27759dc01594949ac4., row '',
but failed after 10 attempts.
  test2772(org.apache.hadoop.hbase.client.TestScannerTimeout): Trying to contact region server
/67.195.138.60:54814 for region t,,1313460891178.cff805b1a4ab3f27759dc01594949ac4., row '',
but failed after 10 attempts.
  test3686a(org.apache.hadoop.hbase.client.TestScannerTimeout): Trying to contact region server
/67.195.138.60:60723 for region t,,1313460891178.cff805b1a4ab3f27759dc01594949ac4., row '',
but failed after 10 attempts.
  test3686b(org.apache.hadoop.hbase.client.TestScannerTimeout): Trying to contact region server
/67.195.138.60:60723 for region t,,1313460891178.cff805b1a4ab3f27759dc01594949ac4., row '',
but failed after 10 attempts.
  testCloseTablePool(org.apache.hadoop.hbase.client.TestHTablePool$TestHTableThreadLocalPool):
Connection refused
  testTableWithStringName(org.apache.hadoop.hbase.client.TestHTablePool$TestHTableThreadLocalPool):
Cluster already running at <https://builds.apache.org/job/HBase-TRUNK/ws/trunk/target/test-data/1aa6a0e2-4fe5-47ca-8367-5b905977b89f/bcc0082c-fc22-4802-b313-30b575e6e936/974332d1-abb7-4437-a8b9-7d03c85cff19/9ea74de4-b999-45c7-b024-97064fbe393a/09b9bd58-59ca-43d5-8557-e00caf436991/fde34865-cf12-4f45-907a-0ef7cd19be4a/10d5579a-7030-4ecc-9610-ef33aca65d9f/f1ee8042-8a4b-4de6-87a1-69273c1c12e2/e9a6b0a1-f3c7-43c0-8896-66eaa2b3ceeb/f051070a-b208-404c-b4dd-bd8a22bc0a89/c97e9ca2-46cc-4086-a8fd-52d69740390a>
  testTableWithByteArrayName(org.apache.hadoop.hbase.client.TestHTablePool$TestHTableThreadLocalPool):
Cluster already running at <https://builds.apache.org/job/HBase-TRUNK/ws/trunk/target/test-data/1aa6a0e2-4fe5-47ca-8367-5b905977b89f/bcc0082c-fc22-4802-b313-30b575e6e936/974332d1-abb7-4437-a8b9-7d03c85cff19/9ea74de4-b999-45c7-b024-97064fbe393a/09b9bd58-59ca-43d5-8557-e00caf436991/fde34865-cf12-4f45-907a-0ef7cd19be4a/10d5579a-7030-4ecc-9610-ef33aca65d9f/f1ee8042-8a4b-4de6-87a1-69273c1c12e2/e9a6b0a1-f3c7-43c0-8896-66eaa2b3ceeb/f051070a-b208-404c-b4dd-bd8a22bc0a89/c97e9ca2-46cc-4086-a8fd-52d69740390a>
  testTablesWithDifferentNames(org.apache.hadoop.hbase.client.TestHTablePool$TestHTableThreadLocalPool):
Cluster already running at <https://builds.apache.org/job/HBase-TRUNK/ws/trunk/target/test-data/1aa6a0e2-4fe5-47ca-8367-5b905977b89f/bcc0082c-fc22-4802-b313-30b575e6e936/974332d1-abb7-4437-a8b9-7d03c85cff19/9ea74de4-b999-45c7-b024-97064fbe393a/09b9bd58-59ca-43d5-8557-e00caf436991/fde34865-cf12-4f45-907a-0ef7cd19be4a/10d5579a-7030-4ecc-9610-ef33aca65d9f/f1ee8042-8a4b-4de6-87a1-69273c1c12e2/e9a6b0a1-f3c7-43c0-8896-66eaa2b3ceeb/f051070a-b208-404c-b4dd-bd8a22bc0a89/c97e9ca2-46cc-4086-a8fd-52d69740390a>
  testProxyImplementationReturned(org.apache.hadoop.hbase.client.TestHTablePool$TestHTableThreadLocalPool):
Cluster already running at <https://builds.apache.org/job/HBase-TRUNK/ws/trunk/target/test-data/1aa6a0e2-4fe5-47ca-8367-5b905977b89f/bcc0082c-fc22-4802-b313-30b575e6e936/974332d1-abb7-4437-a8b9-7d03c85cff19/9ea74de4-b999-45c7-b024-97064fbe393a/09b9bd58-59ca-43d5-8557-e00caf436991/fde34865-cf12-4f45-907a-0ef7cd19be4a/10d5579a-7030-4ecc-9610-ef33aca65d9f/f1ee8042-8a4b-4de6-87a1-69273c1c12e2/e9a6b0a1-f3c7-43c0-8896-66eaa2b3ceeb/f051070a-b208-404c-b4dd-bd8a22bc0a89/c97e9ca2-46cc-4086-a8fd-52d69740390a>
  testDeprecatedUsagePattern(org.apache.hadoop.hbase.client.TestHTablePool$TestHTableThreadLocalPool):
Cluster already running at <https://builds.apache.org/job/HBase-TRUNK/ws/trunk/target/test-data/1aa6a0e2-4fe5-47ca-8367-5b905977b89f/bcc0082c-fc22-4802-b313-30b575e6e936/974332d1-abb7-4437-a8b9-7d03c85cff19/9ea74de4-b999-45c7-b024-97064fbe393a/09b9bd58-59ca-43d5-8557-e00caf436991/fde34865-cf12-4f45-907a-0ef7cd19be4a/10d5579a-7030-4ecc-9610-ef33aca65d9f/f1ee8042-8a4b-4de6-87a1-69273c1c12e2/e9a6b0a1-f3c7-43c0-8896-66eaa2b3ceeb/f051070a-b208-404c-b4dd-bd8a22bc0a89/c97e9ca2-46cc-4086-a8fd-52d69740390a>
  testReturnDifferentTable(org.apache.hadoop.hbase.client.TestHTablePool$TestHTableThreadLocalPool):
Cluster already running at <https://builds.apache.org/job/HBase-TRUNK/ws/trunk/target/test-data/1aa6a0e2-4fe5-47ca-8367-5b905977b89f/bcc0082c-fc22-4802-b313-30b575e6e936/974332d1-abb7-4437-a8b9-7d03c85cff19/9ea74de4-b999-45c7-b024-97064fbe393a/09b9bd58-59ca-43d5-8557-e00caf436991/fde34865-cf12-4f45-907a-0ef7cd19be4a/10d5579a-7030-4ecc-9610-ef33aca65d9f/f1ee8042-8a4b-4de6-87a1-69273c1c12e2/e9a6b0a1-f3c7-43c0-8896-66eaa2b3ceeb/f051070a-b208-404c-b4dd-bd8a22bc0a89/c97e9ca2-46cc-4086-a8fd-52d69740390a>
  testClassCastException(org.apache.hadoop.hbase.client.TestHTablePool$TestHTableThreadLocalPool):
Cluster already running at <https://builds.apache.org/job/HBase-TRUNK/ws/trunk/target/test-data/1aa6a0e2-4fe5-47ca-8367-5b905977b89f/bcc0082c-fc22-4802-b313-30b575e6e936/974332d1-abb7-4437-a8b9-7d03c85cff19/9ea74de4-b999-45c7-b024-97064fbe393a/09b9bd58-59ca-43d5-8557-e00caf436991/fde34865-cf12-4f45-907a-0ef7cd19be4a/10d5579a-7030-4ecc-9610-ef33aca65d9f/f1ee8042-8a4b-4de6-87a1-69273c1c12e2/e9a6b0a1-f3c7-43c0-8896-66eaa2b3ceeb/f051070a-b208-404c-b4dd-bd8a22bc0a89/c97e9ca2-46cc-4086-a8fd-52d69740390a>

Tests run: 877, Failures: 0, Errors: 18, Skipped: 9

[INFO] ------------------------------------------------------------------------
[INFO] BUILD FAILURE
[INFO] ------------------------------------------------------------------------
[INFO] Total time: 1:30:52.566s
[INFO] Finished at: Tue Aug 16 02:40:13 UTC 2011
[INFO] Final Memory: 36M/448M
[INFO] ------------------------------------------------------------------------
[ERROR] Failed to execute goal org.apache.maven.plugins:maven-surefire-plugin:2.9:test (default-test)
on project hbase: There are test failures.
[ERROR] 
[ERROR] Please refer to <https://builds.apache.org/job/HBase-TRUNK/ws/trunk/target/surefire-reports>
for the individual test results.
[ERROR] -> [Help 1]
[ERROR] 
[ERROR] To see the full stack trace of the errors, re-run Maven with the -e switch.
[ERROR] Re-run Maven using the -X switch to enable full debug logging.
[ERROR] 
[ERROR] For more information about the errors and possible solutions, please read the following
articles:
[ERROR] [Help 1] http://cwiki.apache.org/confluence/display/MAVEN/MojoFailureException
[locks-and-latches] Releasing all the locks
[locks-and-latches] All the locks released
Archiving artifacts
Recording test results
Updating HBASE-4197


Mime
View raw message