hbase-dev mailing list archives

Site index · List index
Message view « Date » · « Thread »
Top « Date » · « Thread »
From Apache Jenkins Server <jenk...@builds.apache.org>
Subject Build failed in Jenkins: HBase-TRUNK #2110
Date Thu, 11 Aug 2011 21:52:05 GMT
See <https://builds.apache.org/job/HBase-TRUNK/2110/changes>

Changes:

[tedyu] HBASE-4186  No region is added to regionsInTransitionInRS

------------------------------------------
[...truncated 1516 lines...]
Tests run: 3, Failures: 0, Errors: 0, Skipped: 0, Time elapsed: 0.491 sec
Running org.apache.hadoop.hbase.rest.model.TestTableInfoModel
Tests run: 3, Failures: 0, Errors: 0, Skipped: 0, Time elapsed: 0.49 sec
Running org.apache.hadoop.hbase.rest.model.TestCellModel
Tests run: 3, Failures: 0, Errors: 0, Skipped: 0, Time elapsed: 0.465 sec
Running org.apache.hadoop.hbase.rest.model.TestStorageClusterStatusModel
Tests run: 3, Failures: 0, Errors: 0, Skipped: 0, Time elapsed: 0.53 sec
Running org.apache.hadoop.hbase.rest.model.TestColumnSchemaModel
Tests run: 2, Failures: 0, Errors: 0, Skipped: 0, Time elapsed: 0.273 sec
Running org.apache.hadoop.hbase.rest.model.TestRowModel
Tests run: 2, Failures: 0, Errors: 0, Skipped: 0, Time elapsed: 0.365 sec
Running org.apache.hadoop.hbase.rest.model.TestTableSchemaModel
Tests run: 3, Failures: 0, Errors: 0, Skipped: 0, Time elapsed: 0.499 sec
Running org.apache.hadoop.hbase.rest.model.TestStorageClusterVersionModel
Tests run: 2, Failures: 0, Errors: 0, Skipped: 0, Time elapsed: 0.268 sec
Running org.apache.hadoop.hbase.rest.model.TestTableListModel
Tests run: 3, Failures: 0, Errors: 0, Skipped: 0, Time elapsed: 0.476 sec
Running org.apache.hadoop.hbase.rest.model.TestCellSetModel
Tests run: 3, Failures: 0, Errors: 0, Skipped: 0, Time elapsed: 0.499 sec
Running org.apache.hadoop.hbase.rest.model.TestTableRegionModel
Tests run: 4, Failures: 0, Errors: 0, Skipped: 0, Time elapsed: 0.453 sec
Running org.apache.hadoop.hbase.rest.model.TestVersionModel
Tests run: 3, Failures: 0, Errors: 0, Skipped: 0, Time elapsed: 0.457 sec
Running org.apache.hadoop.hbase.rest.TestStatusResource
Tests run: 2, Failures: 0, Errors: 0, Skipped: 0, Time elapsed: 18.286 sec
Running org.apache.hadoop.hbase.rest.TestScannersWithFilters
Tests run: 10, Failures: 0, Errors: 0, Skipped: 0, Time elapsed: 22.289 sec
Running org.apache.hadoop.hbase.TestInfoServers
Tests run: 2, Failures: 0, Errors: 0, Skipped: 0, Time elapsed: 32.25 sec
Running org.apache.hadoop.hbase.monitoring.TestTaskMonitor
Tests run: 3, Failures: 0, Errors: 0, Skipped: 0, Time elapsed: 0.206 sec
Running org.apache.hadoop.hbase.TestHRegionLocation
Tests run: 3, Failures: 0, Errors: 0, Skipped: 0, Time elapsed: 0.136 sec
Running org.apache.hadoop.hbase.metrics.TestMetricsMBeanBase
Tests run: 2, Failures: 0, Errors: 0, Skipped: 0, Time elapsed: 0.124 sec
Running org.apache.hadoop.hbase.regionserver.TestServerCustomProtocol
Tests run: 6, Failures: 0, Errors: 0, Skipped: 0, Time elapsed: 22.919 sec
Running org.apache.hadoop.hbase.regionserver.TestHRegion
Tests run: 56, Failures: 0, Errors: 0, Skipped: 0, Time elapsed: 50.634 sec
Running org.apache.hadoop.hbase.regionserver.TestScanWildcardColumnTracker
Tests run: 2, Failures: 0, Errors: 0, Skipped: 0, Time elapsed: 0.372 sec
Running org.apache.hadoop.hbase.regionserver.TestCompaction
Tests run: 9, Failures: 0, Errors: 0, Skipped: 0, Time elapsed: 124.801 sec
Running org.apache.hadoop.hbase.regionserver.TestRSStatusServlet
Tests run: 2, Failures: 0, Errors: 0, Skipped: 0, Time elapsed: 0.65 sec
Running org.apache.hadoop.hbase.regionserver.TestColumnSeeking
Tests run: 2, Failures: 0, Errors: 0, Skipped: 0, Time elapsed: 16.843 sec
Running org.apache.hadoop.hbase.regionserver.wal.TestHLog
Tests run: 9, Failures: 0, Errors: 0, Skipped: 0, Time elapsed: 85.832 sec
Running org.apache.hadoop.hbase.regionserver.wal.TestWALReplay
Tests run: 4, Failures: 0, Errors: 0, Skipped: 0, Time elapsed: 22.775 sec
Running org.apache.hadoop.hbase.regionserver.wal.TestWALActionsListener
Tests run: 1, Failures: 0, Errors: 0, Skipped: 0, Time elapsed: 0.657 sec
Running org.apache.hadoop.hbase.regionserver.wal.TestHLogMethods
Tests run: 3, Failures: 0, Errors: 0, Skipped: 0, Time elapsed: 0.806 sec
Running org.apache.hadoop.hbase.regionserver.wal.TestLogRolling
Tests run: 2, Failures: 0, Errors: 0, Skipped: 0, Time elapsed: 111.063 sec
Running org.apache.hadoop.hbase.regionserver.wal.TestHLogSplit
Tests run: 28, Failures: 0, Errors: 0, Skipped: 0, Time elapsed: 193.867 sec
Running org.apache.hadoop.hbase.regionserver.TestStore
Tests run: 11, Failures: 0, Errors: 0, Skipped: 0, Time elapsed: 2.152 sec
Running org.apache.hadoop.hbase.regionserver.TestRpcMetrics
Tests run: 1, Failures: 0, Errors: 0, Skipped: 0, Time elapsed: 1.545 sec
Running org.apache.hadoop.hbase.regionserver.TestCompoundBloomFilter
Tests run: 3, Failures: 0, Errors: 0, Skipped: 0, Time elapsed: 24.328 sec
Running org.apache.hadoop.hbase.regionserver.TestKeyValueScanFixture
Tests run: 1, Failures: 0, Errors: 0, Skipped: 0, Time elapsed: 0.112 sec
Running org.apache.hadoop.hbase.regionserver.TestExplicitColumnTracker
Tests run: 4, Failures: 0, Errors: 0, Skipped: 0, Time elapsed: 0.884 sec
Running org.apache.hadoop.hbase.regionserver.TestStoreFile
Tests run: 8, Failures: 0, Errors: 0, Skipped: 0, Time elapsed: 30.124 sec
Running org.apache.hadoop.hbase.regionserver.TestWideScanner
Tests run: 1, Failures: 0, Errors: 0, Skipped: 0, Time elapsed: 14.97 sec
Running org.apache.hadoop.hbase.regionserver.TestQueryMatcher
Tests run: 4, Failures: 0, Errors: 0, Skipped: 0, Time elapsed: 0.465 sec
Running org.apache.hadoop.hbase.regionserver.TestReadWriteConsistencyControl
Tests run: 1, Failures: 0, Errors: 0, Skipped: 0, Time elapsed: 10.107 sec
Running org.apache.hadoop.hbase.regionserver.TestResettingCounters
Tests run: 1, Failures: 0, Errors: 0, Skipped: 0, Time elapsed: 0.651 sec
Running org.apache.hadoop.hbase.regionserver.TestStoreScanner
Tests run: 14, Failures: 0, Errors: 0, Skipped: 0, Time elapsed: 0.134 sec
Running org.apache.hadoop.hbase.regionserver.TestMemStoreLAB
Tests run: 3, Failures: 0, Errors: 0, Skipped: 0, Time elapsed: 1.44 sec
Running org.apache.hadoop.hbase.regionserver.TestSplitTransactionOnCluster
Tests run: 4, Failures: 0, Errors: 0, Skipped: 0, Time elapsed: 36.108 sec
Running org.apache.hadoop.hbase.regionserver.TestSplitTransaction
Tests run: 6, Failures: 0, Errors: 0, Skipped: 0, Time elapsed: 4.335 sec
Running org.apache.hadoop.hbase.regionserver.TestScanDeleteTracker
Tests run: 6, Failures: 0, Errors: 0, Skipped: 0, Time elapsed: 0.54 sec
Running org.apache.hadoop.hbase.regionserver.TestCompactSelection
Tests run: 1, Failures: 0, Errors: 0, Skipped: 0, Time elapsed: 0.595 sec
Running org.apache.hadoop.hbase.regionserver.TestMemStore
Tests run: 21, Failures: 0, Errors: 0, Skipped: 0, Time elapsed: 29.19 sec
Running org.apache.hadoop.hbase.regionserver.TestGetClosestAtOrBefore
Tests run: 3, Failures: 0, Errors: 0, Skipped: 0, Time elapsed: 6.282 sec
Running org.apache.hadoop.hbase.regionserver.TestKeyValueSkipListSet
Tests run: 4, Failures: 0, Errors: 0, Skipped: 0, Time elapsed: 0.117 sec
Running org.apache.hadoop.hbase.regionserver.TestKeyValueHeap
Tests run: 3, Failures: 0, Errors: 0, Skipped: 0, Time elapsed: 0.436 sec
Running org.apache.hadoop.hbase.regionserver.TestScanner
Tests run: 6, Failures: 0, Errors: 0, Skipped: 0, Time elapsed: 51.822 sec
Running org.apache.hadoop.hbase.regionserver.TestHRegionInfo
Tests run: 3, Failures: 0, Errors: 0, Skipped: 0, Time elapsed: 0.549 sec
Running org.apache.hadoop.hbase.regionserver.handler.TestOpenRegionHandler
Tests run: 1, Failures: 0, Errors: 0, Skipped: 0, Time elapsed: 0.734 sec
Running org.apache.hadoop.hbase.regionserver.TestMasterAddressManager
Tests run: 1, Failures: 0, Errors: 0, Skipped: 0, Time elapsed: 0.495 sec
Running org.apache.hadoop.hbase.regionserver.TestSplitLogWorker
Tests run: 5, Failures: 0, Errors: 0, Skipped: 0, Time elapsed: 1.992 sec
Running org.apache.hadoop.hbase.regionserver.TestFSErrorsExposed
Tests run: 3, Failures: 0, Errors: 0, Skipped: 0, Time elapsed: 28.7 sec
Running org.apache.hadoop.hbase.TestHServerAddress
Tests run: 6, Failures: 0, Errors: 0, Skipped: 0, Time elapsed: 0.067 sec
Running org.apache.hadoop.hbase.filter.TestColumnRangeFilter
Tests run: 1, Failures: 0, Errors: 0, Skipped: 0, Time elapsed: 26.399 sec
Running org.apache.hadoop.hbase.filter.TestColumnPaginationFilter
Tests run: 1, Failures: 0, Errors: 0, Skipped: 0, Time elapsed: 0.11 sec
Running org.apache.hadoop.hbase.filter.TestPageFilter
Tests run: 2, Failures: 0, Errors: 0, Skipped: 0, Time elapsed: 0.028 sec
Running org.apache.hadoop.hbase.filter.TestRandomRowFilter
Tests run: 2, Failures: 0, Errors: 0, Skipped: 0, Time elapsed: 0.576 sec
Running org.apache.hadoop.hbase.filter.TestPrefixFilter
Tests run: 3, Failures: 0, Errors: 0, Skipped: 0, Time elapsed: 0.107 sec
Running org.apache.hadoop.hbase.filter.TestBitComparator
Tests run: 3, Failures: 0, Errors: 0, Skipped: 0, Time elapsed: 0.033 sec
Running org.apache.hadoop.hbase.filter.TestDependentColumnFilter
Tests run: 2, Failures: 0, Errors: 0, Skipped: 0, Time elapsed: 0.773 sec
Running org.apache.hadoop.hbase.filter.TestSingleColumnValueFilter
Tests run: 2, Failures: 0, Errors: 0, Skipped: 0, Time elapsed: 0.151 sec
Running org.apache.hadoop.hbase.filter.TestInclusiveStopFilter
Tests run: 2, Failures: 0, Errors: 0, Skipped: 0, Time elapsed: 0.107 sec
Running org.apache.hadoop.hbase.filter.TestFilterList
Tests run: 4, Failures: 0, Errors: 0, Skipped: 0, Time elapsed: 0.23 sec
Running org.apache.hadoop.hbase.filter.TestFilter
Tests run: 18, Failures: 0, Errors: 0, Skipped: 0, Time elapsed: 4.776 sec
Running org.apache.hadoop.hbase.filter.TestMultipleColumnPrefixFilter
Tests run: 3, Failures: 0, Errors: 0, Skipped: 0, Time elapsed: 3.639 sec
Running org.apache.hadoop.hbase.filter.TestColumnPrefixFilter
Tests run: 2, Failures: 0, Errors: 0, Skipped: 0, Time elapsed: 2.595 sec
Running org.apache.hadoop.hbase.filter.TestSingleColumnValueExcludeFilter
Tests run: 1, Failures: 0, Errors: 0, Skipped: 0, Time elapsed: 0.114 sec
Running org.apache.hadoop.hbase.TestGlobalMemStoreSize
Tests run: 1, Failures: 0, Errors: 0, Skipped: 0, Time elapsed: 18.898 sec
Running org.apache.hadoop.hbase.TestHBaseTestingUtility
Tests run: 6, Failures: 0, Errors: 0, Skipped: 0, Time elapsed: 73.644 sec
Running org.apache.hadoop.hbase.security.TestUser
Tests run: 2, Failures: 0, Errors: 0, Skipped: 0, Time elapsed: 0.249 sec
Running org.apache.hadoop.hbase.TestRegionRebalancing
Tests run: 1, Failures: 0, Errors: 0, Skipped: 0, Time elapsed: 55.956 sec
Running org.apache.hadoop.hbase.replication.TestReplication
Tests run: 7, Failures: 0, Errors: 0, Skipped: 0, Time elapsed: 101.876 sec
Running org.apache.hadoop.hbase.replication.regionserver.TestReplicationSourceManager
Tests run: 1, Failures: 0, Errors: 0, Skipped: 0, Time elapsed: 0.854 sec
Running org.apache.hadoop.hbase.replication.regionserver.TestReplicationSink
Tests run: 5, Failures: 0, Errors: 0, Skipped: 0, Time elapsed: 23.351 sec
Running org.apache.hadoop.hbase.replication.TestReplicationSource
Tests run: 1, Failures: 0, Errors: 0, Skipped: 0, Time elapsed: 7.584 sec
Running org.apache.hadoop.hbase.avro.TestAvroServer
Tests run: 3, Failures: 0, Errors: 0, Skipped: 0, Time elapsed: 33.902 sec
Running org.apache.hadoop.hbase.TestAcidGuarantees
Tests run: 3, Failures: 0, Errors: 0, Skipped: 3, Time elapsed: 0.06 sec
Running org.apache.hadoop.hbase.TestKeyValue
Tests run: 9, Failures: 0, Errors: 0, Skipped: 0, Time elapsed: 0.125 sec
Running org.apache.hadoop.hbase.coprocessor.TestRegionObserverInterface
Tests run: 4, Failures: 0, Errors: 0, Skipped: 0, Time elapsed: 28.872 sec
Running org.apache.hadoop.hbase.coprocessor.TestCoprocessorInterface
Tests run: 1, Failures: 0, Errors: 0, Skipped: 0, Time elapsed: 3.773 sec
Running org.apache.hadoop.hbase.coprocessor.TestMasterObserver
Tests run: 3, Failures: 0, Errors: 0, Skipped: 0, Time elapsed: 22.847 sec
Running org.apache.hadoop.hbase.coprocessor.TestCoprocessorEndpoint
Tests run: 2, Failures: 0, Errors: 0, Skipped: 0, Time elapsed: 25.061 sec
Running org.apache.hadoop.hbase.coprocessor.TestWALObserver
Tests run: 3, Failures: 0, Errors: 0, Skipped: 0, Time elapsed: 32.443 sec
Running org.apache.hadoop.hbase.coprocessor.TestAggregateProtocol
Tests run: 44, Failures: 0, Errors: 0, Skipped: 0, Time elapsed: 21.82 sec
Running org.apache.hadoop.hbase.coprocessor.TestRegionObserverStacking
Tests run: 1, Failures: 0, Errors: 0, Skipped: 0, Time elapsed: 0.572 sec
Running org.apache.hadoop.hbase.coprocessor.TestClassLoading
Tests run: 3, Failures: 0, Errors: 0, Skipped: 0, Time elapsed: 23.644 sec
Running org.apache.hadoop.hbase.TestScanMultipleVersions
Tests run: 1, Failures: 0, Errors: 0, Skipped: 0, Time elapsed: 17.129 sec
Running org.apache.hadoop.hbase.mapred.TestTableMapReduce
Tests run: 1, Failures: 0, Errors: 0, Skipped: 0, Time elapsed: 38.554 sec
Running org.apache.hadoop.hbase.TestServerName
Tests run: 2, Failures: 0, Errors: 0, Skipped: 0, Time elapsed: 0.055 sec
Running org.apache.hadoop.hbase.master.TestActiveMasterManager
Tests run: 2, Failures: 0, Errors: 0, Skipped: 0, Time elapsed: 0.679 sec
Running org.apache.hadoop.hbase.master.TestMasterFailover
Tests run: 3, Failures: 0, Errors: 1, Skipped: 0, Time elapsed: 245 sec <<< FAILURE!
Running org.apache.hadoop.hbase.master.TestMasterRestartAfterDisablingTable
Tests run: 1, Failures: 0, Errors: 0, Skipped: 0, Time elapsed: 32.742 sec
Running org.apache.hadoop.hbase.master.TestCatalogJanitor
Tests run: 2, Failures: 0, Errors: 0, Skipped: 0, Time elapsed: 0.923 sec
Running org.apache.hadoop.hbase.master.TestRollingRestart
Tests run: 1, Failures: 0, Errors: 0, Skipped: 0, Time elapsed: 73.508 sec
Running org.apache.hadoop.hbase.master.TestMasterTransitions
Tests run: 3, Failures: 0, Errors: 0, Skipped: 3, Time elapsed: 27.32 sec
Running org.apache.hadoop.hbase.master.TestRestartCluster
Tests run: 2, Failures: 0, Errors: 0, Skipped: 0, Time elapsed: 54.602 sec
Running org.apache.hadoop.hbase.master.TestMasterStatusServlet
Tests run: 4, Failures: 0, Errors: 0, Skipped: 0, Time elapsed: 1.007 sec
Running org.apache.hadoop.hbase.master.TestClockSkewDetection
Tests run: 1, Failures: 0, Errors: 0, Skipped: 0, Time elapsed: 0.227 sec
Running org.apache.hadoop.hbase.master.TestHMasterRPCException
Tests run: 1, Failures: 0, Errors: 0, Skipped: 0, Time elapsed: 0.66 sec
Running org.apache.hadoop.hbase.master.TestLoadBalancer
Tests run: 5, Failures: 0, Errors: 0, Skipped: 0, Time elapsed: 2.358 sec
Running org.apache.hadoop.hbase.master.TestDistributedLogSplitting
Tests run: 4, Failures: 0, Errors: 0, Skipped: 0, Time elapsed: 127.217 sec
Running org.apache.hadoop.hbase.master.TestMaster
Tests run: 1, Failures: 0, Errors: 0, Skipped: 0, Time elapsed: 80.073 sec
Running org.apache.hadoop.hbase.master.TestSplitLogManager
Tests run: 9, Failures: 0, Errors: 0, Skipped: 0, Time elapsed: 11.773 sec
Running org.apache.hadoop.hbase.master.TestDeadServer
Tests run: 1, Failures: 0, Errors: 0, Skipped: 0, Time elapsed: 0.056 sec
Running org.apache.hadoop.hbase.master.TestLogsCleaner
Tests run: 1, Failures: 0, Errors: 0, Skipped: 0, Time elapsed: 1.176 sec
Running org.apache.hadoop.hbase.master.TestZKBasedOpenCloseRegion
Tests run: 3, Failures: 0, Errors: 0, Skipped: 0, Time elapsed: 31.541 sec

Results :

Tests in error: 
  testMasterFailoverWithMockedRITOnDeadRS(org.apache.hadoop.hbase.master.TestMasterFailover):
test timed out after 180000 milliseconds

Tests run: 874, Failures: 0, Errors: 1, Skipped: 9

[INFO] ------------------------------------------------------------------------
[INFO] BUILD FAILURE
[INFO] ------------------------------------------------------------------------
[INFO] Total time: 1:31:36.199s
[INFO] Finished at: Thu Aug 11 21:51:28 UTC 2011
[INFO] Final Memory: 34M/685M
[INFO] ------------------------------------------------------------------------
[ERROR] Failed to execute goal org.apache.maven.plugins:maven-surefire-plugin:2.9:test (default-test)
on project hbase: There are test failures.
[ERROR] 
[ERROR] Please refer to <https://builds.apache.org/job/HBase-TRUNK/ws/trunk/target/surefire-reports>
for the individual test results.
[ERROR] -> [Help 1]
[ERROR] 
[ERROR] To see the full stack trace of the errors, re-run Maven with the -e switch.
[ERROR] Re-run Maven using the -X switch to enable full debug logging.
[ERROR] 
[ERROR] For more information about the errors and possible solutions, please read the following
articles:
[ERROR] [Help 1] http://cwiki.apache.org/confluence/display/MAVEN/MojoFailureException
[locks-and-latches] Releasing all the locks
[locks-and-latches] All the locks released
Archiving artifacts
Recording test results
Updating HBASE-4186


Mime
View raw message