hbase-dev mailing list archives

Site index · List index
Message view « Date » · « Thread »
Top « Date » · « Thread »
From Ted Yu <yuzhih...@gmail.com>
Subject Re: Build failed in Jenkins: HBase-TRUNK #2062
Date Fri, 29 Jul 2011 16:31:30 GMT
Ramkrishna has fixed TestSplitLogManager which hung in this build.

Running org.apache.hadoop.hbase.master.TestSplitLogManager

> killed.
> [INFO]
> ------------------------------------------------------------------------
> [INFO] BUILD FAILURE
> [INFO]
> ------------------------------------------------------------------------
> [INFO] Total time: 1:02:14.673s
> [INFO] Finished at: Fri Jul 29 08:38:05 UTC 2011
> [INFO] Final Memory: 42M/1040M
> [INFO]
> ------------------------------------------------------------------------
> [ERROR] Failed to execute goal
> org.apache.maven.plugins:maven-surefire-plugin:2.4.3:test (default-test) on
> project hbase: Error while executing forked tests.; nested exception is
> org.apache.maven.surefire.booter.shade.org.codehaus.plexus.util.cli.CommandLineException:
> Error while executing external command, process killed. Process timeout out
> after 900 seconds -> [Help 1]
> [ERROR]
> [ERROR] To see the full stack trace of the errors, re-run Maven with the -e
> switch.
> [ERROR] Re-run Maven using the -X switch to enable full debug logging.
> [ERROR]
> [ERROR] For more information about the errors and possible solutions,
> please read the following articles:
> [ERROR] [Help 1]
> http://cwiki.apache.org/confluence/display/MAVEN/MojoExecutionException
> [locks-and-latches] Releasing all the locks
> [locks-and-latches] All the locks released
> Archiving artifacts
> Recording test results
> Updating HBASE-4144
>
>

Mime
  • Unnamed multipart/alternative (inline, None, 0 bytes)
View raw message