hbase-dev mailing list archives

Site index · List index
Message view « Date » · « Thread »
Top « Date » · « Thread »
From Apache Jenkins Server <jenk...@builds.apache.org>
Subject Build failed in Jenkins: HBase-TRUNK #2054
Date Tue, 26 Jul 2011 22:51:19 GMT
See <https://builds.apache.org/job/HBase-TRUNK/2054/changes>

Changes:

[apurtell] HBASE-4139  [stargate] Update ScannerModel with support for filter package additions

[apurtell] HBASE-4142 Advise against large batches in javadoc for HTable#put(List<Put>)

------------------------------------------
[...truncated 1150 lines...]
[INFO] --- docbkx-maven-plugin:2.0.11:generate-html (multipage) @ hbase ---
[INFO] Processing input file: upgrading.xml
[INFO] /x1/jenkins/jenkins-slave/workspace/HBase-TRUNK/trunk/target/site/book/upgrading.html
has been generated.
[INFO] Processing input file: shell.xml
[INFO] /x1/jenkins/jenkins-slave/workspace/HBase-TRUNK/trunk/target/site/book/shell.html has
been generated.
[INFO] Processing input file: configuration.xml
[INFO] /x1/jenkins/jenkins-slave/workspace/HBase-TRUNK/trunk/target/site/book/configuration.html
has been generated.
[INFO] Processing input file: getting_started.xml
[INFO] /x1/jenkins/jenkins-slave/workspace/HBase-TRUNK/trunk/target/site/book/getting_started.html
has been generated.
[INFO] Processing input file: troubleshooting.xml
[INFO] /x1/jenkins/jenkins-slave/workspace/HBase-TRUNK/trunk/target/site/book/troubleshooting.html
has been generated.
[INFO] Processing input file: build.xml
[INFO] /x1/jenkins/jenkins-slave/workspace/HBase-TRUNK/trunk/target/site/book/build.html has
been generated.
[INFO] Processing input file: performance.xml
[INFO] /x1/jenkins/jenkins-slave/workspace/HBase-TRUNK/trunk/target/site/book/performance.html
has been generated.
[INFO] Processing input file: developer.xml
[INFO] /x1/jenkins/jenkins-slave/workspace/HBase-TRUNK/trunk/target/site/book/developer.html
has been generated.
[INFO] Processing input file: book.xml
[INFO] /x1/jenkins/jenkins-slave/workspace/HBase-TRUNK/trunk/target/site/book/book.html has
been generated.
[INFO] /x1/jenkins/jenkins-slave/workspace/HBase-TRUNK/trunk/target/site/book/preface.html
is up to date.
[INFO] 
[INFO] --- docbkx-maven-plugin:2.0.11:generate-html (onepage) @ hbase ---
[INFO] Processing input file: upgrading.xml
[INFO] /x1/jenkins/jenkins-slave/workspace/HBase-TRUNK/trunk/target/site/upgrading.html has
been generated.
[INFO] Processing input file: shell.xml
[INFO] /x1/jenkins/jenkins-slave/workspace/HBase-TRUNK/trunk/target/site/shell.html has been
generated.
[INFO] Processing input file: configuration.xml
[INFO] /x1/jenkins/jenkins-slave/workspace/HBase-TRUNK/trunk/target/site/configuration.html
has been generated.
[INFO] Processing input file: getting_started.xml
[INFO] /x1/jenkins/jenkins-slave/workspace/HBase-TRUNK/trunk/target/site/getting_started.html
has been generated.
[INFO] Processing input file: troubleshooting.xml
[INFO] /x1/jenkins/jenkins-slave/workspace/HBase-TRUNK/trunk/target/site/troubleshooting.html
has been generated.
[INFO] Processing input file: build.xml
[INFO] /x1/jenkins/jenkins-slave/workspace/HBase-TRUNK/trunk/target/site/build.html has been
generated.
[INFO] Processing input file: performance.xml
[INFO] /x1/jenkins/jenkins-slave/workspace/HBase-TRUNK/trunk/target/site/performance.html
has been generated.
[INFO] Processing input file: developer.xml
[INFO] /x1/jenkins/jenkins-slave/workspace/HBase-TRUNK/trunk/target/site/developer.html has
been generated.
[INFO] Processing input file: book.xml
[INFO] /x1/jenkins/jenkins-slave/workspace/HBase-TRUNK/trunk/target/site/book.html has been
generated.
[INFO] Processing input file: preface.xml
[INFO] /x1/jenkins/jenkins-slave/workspace/HBase-TRUNK/trunk/target/site/preface.html has
been generated.
[INFO] 
[INFO] --- maven-site-plugin:2.0.1:site (default-site) @ hbase ---
[INFO] Unable to load parent project from a relative path: 1 problem was encountered while
building the effective model
[FATAL] Non-readable POM /x1/jenkins/jenkins-slave/workspace/HBase-TRUNK/pom.xml: /x1/jenkins/jenkins-slave/workspace/HBase-TRUNK/pom.xml
(No such file or directory) @ 
 for project  at /x1/jenkins/jenkins-slave/workspace/HBase-TRUNK/pom.xml for project  at /x1/jenkins/jenkins-slave/workspace/HBase-TRUNK/pom.xml
[INFO] Parent project loaded from repository.
[INFO] Unable to load parent project from a relative path: 1 problem was encountered while
building the effective model
[FATAL] Non-readable POM /x1/jenkins/jenkins-slave/workspace/HBase-TRUNK/pom.xml: /x1/jenkins/jenkins-slave/workspace/HBase-TRUNK/pom.xml
(No such file or directory) @ 
 for project  at /x1/jenkins/jenkins-slave/workspace/HBase-TRUNK/pom.xml for project  at /x1/jenkins/jenkins-slave/workspace/HBase-TRUNK/pom.xml
[INFO] Parent project loaded from repository.
[INFO]                                                                         
[INFO] ------------------------------------------------------------------------
[INFO] Building HBase 0.91.0-SNAPSHOT
[INFO] ------------------------------------------------------------------------
[INFO] 
[INFO] >>> maven-assembly-plugin:2.2-beta-5:assembly (default-cli) @ hbase >>>
[INFO] 
[INFO] --- maven-antrun-plugin:1.6:run (generate) @ hbase ---
[WARNING] Parameter tasks is deprecated, use target instead
[INFO] Executing tasks

main:
    [mkdir] Created dir: /x1/jenkins/jenkins-slave/workspace/HBase-TRUNK/trunk/target/hbase-webapps
     [copy] Copying 4 files to /x1/jenkins/jenkins-slave/workspace/HBase-TRUNK/trunk/target/hbase-webapps
SLF4J: Failed to load class "org.slf4j.impl.StaticLoggerBinder".
SLF4J: See http://www.slf4j.org/codes.html#StaticLoggerBinder for further details.
2011-07-26 22:08:19.607:INFO::Logging to STDERR via org.mortbay.log.StdErrLog
    [mkdir] Created dir: /x1/jenkins/jenkins-slave/workspace/HBase-TRUNK/trunk/target/hbase-webapps/master/WEB-INF
    [mkdir] Created dir: /x1/jenkins/jenkins-slave/workspace/HBase-TRUNK/trunk/target/hbase-webapps/regionserver/WEB-INF
[INFO] Executed tasks
[INFO] 
[INFO] --- build-helper-maven-plugin:1.5:add-source (add-jspc-source) @ hbase ---
[INFO] Source directory: /x1/jenkins/jenkins-slave/workspace/HBase-TRUNK/trunk/target/jspc
added.
[INFO] 
[INFO] --- build-helper-maven-plugin:1.5:add-source (add-package-info) @ hbase ---
[INFO] Source directory: /x1/jenkins/jenkins-slave/workspace/HBase-TRUNK/trunk/target/generated-sources
added.
[INFO] 
[INFO] --- jamon-maven-plugin:2.3.4:translate (default) @ hbase ---
[INFO] Translating 4 templates from /x1/jenkins/jenkins-slave/workspace/HBase-TRUNK/trunk/src/main/jamon
to /x1/jenkins/jenkins-slave/workspace/HBase-TRUNK/trunk/target/generated-jamon
[INFO] 
[INFO] --- maven-remote-resources-plugin:1.1:process (default) @ hbase ---
[INFO] Setting property: classpath.resource.loader.class => 'org.codehaus.plexus.velocity.ContextClassLoaderResourceLoader'.
[INFO] Setting property: velocimacro.messages.on => 'false'.
[INFO] Setting property: resource.loader => 'classpath'.
[INFO] Setting property: resource.manager.logwhenfound => 'false'.
[INFO] 
[INFO] --- maven-resources-plugin:2.4:resources (default-resources) @ hbase ---
[INFO] Using 'UTF-8' encoding to copy filtered resources.
[INFO] Copying 1 resource
[INFO] Copying 6 resources
[INFO] Copying 3 resources
[INFO] 
[INFO] --- maven-antrun-plugin:1.6:run (default) @ hbase ---
[WARNING] Parameter tasks is deprecated, use target instead
[INFO] Executing tasks

main:
    [mkdir] Created dir: /x1/jenkins/jenkins-slave/workspace/HBase-TRUNK/trunk/target/nativelib
     [exec] tar: hadoop-snappy-nativelibs.tar: Cannot open: No such file or directory
     [exec] tar: Error is not recoverable: exiting now
     [exec] Result: 2
[INFO] Executed tasks
[INFO] 
[INFO] --- maven-compiler-plugin:2.0.2:compile (default-compile) @ hbase ---
[INFO] Compiling 531 source files to /x1/jenkins/jenkins-slave/workspace/HBase-TRUNK/trunk/target/classes
[WARNING] /x1/jenkins/jenkins-slave/workspace/HBase-TRUNK/trunk/src/main/java/org/apache/hadoop/hbase/util/Bytes.java:[44,15]
sun.misc.Unsafe is Sun proprietary API and may be removed in a future release

[WARNING] /x1/jenkins/jenkins-slave/workspace/HBase-TRUNK/trunk/src/main/java/org/apache/hadoop/hbase/util/Bytes.java:[1037,19]
sun.misc.Unsafe is Sun proprietary API and may be removed in a future release

[WARNING] /x1/jenkins/jenkins-slave/workspace/HBase-TRUNK/trunk/src/main/java/org/apache/hadoop/hbase/util/Bytes.java:[1043,21]
sun.misc.Unsafe is Sun proprietary API and may be removed in a future release

[WARNING] /x1/jenkins/jenkins-slave/workspace/HBase-TRUNK/trunk/src/main/java/org/apache/hadoop/hbase/util/Bytes.java:[1048,28]
sun.misc.Unsafe is Sun proprietary API and may be removed in a future release

[INFO] 
[INFO] --- maven-resources-plugin:2.4:testResources (default-testResources) @ hbase ---
[INFO] Using 'UTF-8' encoding to copy filtered resources.
[INFO] Copying 4 resources
[INFO] Copying 3 resources
[INFO] 
[INFO] --- maven-compiler-plugin:2.0.2:testCompile (default-testCompile) @ hbase ---
[INFO] Compiling 225 source files to /x1/jenkins/jenkins-slave/workspace/HBase-TRUNK/trunk/target/test-classes
[INFO] 
[INFO] --- maven-surefire-plugin:2.4.3:test (default-test) @ hbase ---
[INFO] Surefire report directory: /x1/jenkins/jenkins-slave/workspace/HBase-TRUNK/trunk/target/surefire-reports

-------------------------------------------------------
 T E S T S
-------------------------------------------------------
Running org.apache.hadoop.hbase.regionserver.TestColumnSeeking
Tests run: 2, Failures: 0, Errors: 0, Skipped: 0, Time elapsed: 10.241 sec
Running org.apache.hadoop.hbase.master.TestHMasterRPCException
Tests run: 1, Failures: 0, Errors: 0, Skipped: 0, Time elapsed: 0.259 sec
Running org.apache.hadoop.hbase.regionserver.TestMemStoreLAB
Tests run: 3, Failures: 0, Errors: 0, Skipped: 0, Time elapsed: 0.723 sec
Running org.apache.hadoop.hbase.client.TestMultipleTimestamps
Tests run: 8, Failures: 0, Errors: 0, Skipped: 0, Time elapsed: 57.182 sec
Running org.apache.hadoop.hbase.coprocessor.TestRegionObserverInterface
Tests run: 4, Failures: 0, Errors: 0, Skipped: 0, Time elapsed: 35.955 sec
Running org.apache.hadoop.hbase.coprocessor.TestCoprocessorInterface
Tests run: 1, Failures: 0, Errors: 0, Skipped: 0, Time elapsed: 2.251 sec
Running org.apache.hadoop.hbase.TestZooKeeper
Tests run: 7, Failures: 0, Errors: 0, Skipped: 0, Time elapsed: 84.226 sec
Running org.apache.hadoop.hbase.regionserver.wal.TestLogRolling
Tests run: 2, Failures: 0, Errors: 0, Skipped: 0, Time elapsed: 110.358 sec
Running org.apache.hadoop.hbase.io.hfile.TestCachedBlockQueue
Tests run: 2, Failures: 0, Errors: 0, Skipped: 0, Time elapsed: 0.013 sec
Running org.apache.hadoop.hbase.filter.TestPrefixFilter
Tests run: 3, Failures: 0, Errors: 0, Skipped: 0, Time elapsed: 0.013 sec
Running org.apache.hadoop.hbase.io.TestHeapSize
Tests run: 2, Failures: 0, Errors: 0, Skipped: 0, Time elapsed: 0.026 sec
Running org.apache.hadoop.hbase.io.TestImmutableBytesWritable
Tests run: 3, Failures: 0, Errors: 0, Skipped: 0, Time elapsed: 0.013 sec
Running org.apache.hadoop.hbase.rest.model.TestRowModel
Tests run: 2, Failures: 0, Errors: 0, Skipped: 0, Time elapsed: 0.026 sec
Running org.apache.hadoop.hbase.io.hfile.TestHFileSeek
Tests run: 1, Failures: 0, Errors: 0, Skipped: 0, Time elapsed: 3.567 sec
Running org.apache.hadoop.hbase.regionserver.TestStore
Tests run: 11, Failures: 0, Errors: 0, Skipped: 0, Time elapsed: 1.258 sec
Running org.apache.hadoop.hbase.zookeeper.TestHQuorumPeer
Tests run: 3, Failures: 0, Errors: 0, Skipped: 0, Time elapsed: 0.751 sec
Running org.apache.hadoop.hbase.regionserver.TestSplitTransactionOnCluster
Tests run: 4, Failures: 0, Errors: 0, Skipped: 0, Time elapsed: 34.299 sec
Running org.apache.hadoop.hbase.io.hfile.TestHFilePerformance
Tests run: 1, Failures: 0, Errors: 0, Skipped: 0, Time elapsed: 4.502 sec
Running org.apache.hadoop.hbase.rest.TestScannersWithFilters
Tests run: 10, Failures: 0, Errors: 0, Skipped: 0, Time elapsed: 32.099 sec
Running org.apache.hadoop.hbase.io.TestHbaseObjectWritable
Tests run: 3, Failures: 0, Errors: 0, Skipped: 0, Time elapsed: 0.057 sec
Running org.apache.hadoop.hbase.regionserver.TestResettingCounters
Running org.apache.hadoop.hbase.regionserver.handler.TestOpenRegionHandler
Tests run: 1, Failures: 0, Errors: 0, Skipped: 0, Time elapsed: 0.299 sec
Running org.apache.hadoop.hbase.regionserver.wal.TestHLogSplit
Tests run: 28, Failures: 0, Errors: 0, Skipped: 0, Time elapsed: 195.815 sec
Running org.apache.hadoop.hbase.thrift.TestThriftServer
Tests run: 1, Failures: 0, Errors: 0, Skipped: 0, Time elapsed: 37.437 sec
Running org.apache.hadoop.hbase.TestHServerInfo
Tests run: 6, Failures: 0, Errors: 0, Skipped: 0, Time elapsed: 0.021 sec
Running org.apache.hadoop.hbase.master.TestDistributedLogSplitting
Tests run: 4, Failures: 0, Errors: 0, Skipped: 0, Time elapsed: 109.44 sec
Running org.apache.hadoop.hbase.regionserver.TestRpcMetrics
Tests run: 1, Failures: 0, Errors: 0, Skipped: 0, Time elapsed: 1.152 sec
Running org.apache.hadoop.hbase.filter.TestColumnPrefixFilter
Tests run: 2, Failures: 0, Errors: 0, Skipped: 0, Time elapsed: 1.697 sec
Running org.apache.hadoop.hbase.master.TestZKBasedOpenCloseRegion
Tests run: 3, Failures: 0, Errors: 0, Skipped: 0, Time elapsed: 26.306 sec
Running org.apache.hadoop.hbase.regionserver.TestServerCustomProtocol
Tests run: 6, Failures: 0, Errors: 0, Skipped: 0, Time elapsed: 31.332 sec
Running org.apache.hadoop.hbase.TestCompare
Tests run: 1, Failures: 0, Errors: 0, Skipped: 0, Time elapsed: 0.013 sec
Running org.apache.hadoop.hbase.util.TestEnvironmentEdgeManager
Tests run: 2, Failures: 0, Errors: 0, Skipped: 0, Time elapsed: 0.106 sec
Running org.apache.hadoop.hbase.regionserver.TestExplicitColumnTracker
Tests run: 4, Failures: 0, Errors: 0, Skipped: 0, Time elapsed: 0.249 sec
Running org.apache.hadoop.hbase.util.TestDefaultEnvironmentEdge
Tests run: 1, Failures: 0, Errors: 0, Skipped: 0, Time elapsed: 0.013 sec
Running org.apache.hadoop.hbase.io.TestHalfStoreFileReader
Tests run: 1, Failures: 0, Errors: 0, Skipped: 0, Time elapsed: 0.204 sec
Running org.apache.hadoop.hbase.rest.TestTransform
Tests run: 1, Failures: 0, Errors: 0, Skipped: 0, Time elapsed: 34.441 sec
Running org.apache.hadoop.hbase.util.TestFSUtils
Tests run: 1, Failures: 0, Errors: 0, Skipped: 0, Time elapsed: 11.672 sec
Running org.apache.hadoop.hbase.filter.TestBitComparator
Tests run: 3, Failures: 0, Errors: 0, Skipped: 0, Time elapsed: 0.012 sec
Running org.apache.hadoop.hbase.security.TestUser
Tests run: 2, Failures: 0, Errors: 0, Skipped: 0, Time elapsed: 0.027 sec
Running org.apache.hadoop.hbase.regionserver.TestScanWildcardColumnTracker
Tests run: 2, Failures: 0, Errors: 0, Skipped: 0, Time elapsed: 0.05 sec
Running org.apache.hadoop.hbase.master.TestMasterTransitions
Tests run: 3, Failures: 0, Errors: 0, Skipped: 3, Time elapsed: 35.933 sec
Running org.apache.hadoop.hbase.regionserver.TestKeyValueSkipListSet
Tests run: 4, Failures: 0, Errors: 0, Skipped: 0, Time elapsed: 0.017 sec
Running org.apache.hadoop.hbase.io.hfile.TestSeekTo
Tests run: 3, Failures: 0, Errors: 0, Skipped: 0, Time elapsed: 0.104 sec
Running org.apache.hadoop.hbase.filter.TestPageFilter
Tests run: 2, Failures: 0, Errors: 0, Skipped: 0, Time elapsed: 0.012 sec
Running org.apache.hadoop.hbase.filter.TestColumnPaginationFilter
Tests run: 1, Failures: 0, Errors: 0, Skipped: 0, Time elapsed: 0.012 sec
Running org.apache.hadoop.hbase.rest.TestStatusResource
Tests run: 2, Failures: 0, Errors: 0, Skipped: 0, Time elapsed: 17.706 sec
Running org.apache.hadoop.hbase.coprocessor.TestCoprocessorEndpoint
Tests run: 2, Failures: 0, Errors: 0, Skipped: 0, Time elapsed: 23.351 sec
Running org.apache.hadoop.hbase.executor.TestExecutorService
Tests run: 1, Failures: 0, Errors: 0, Skipped: 0, Time elapsed: 2.137 sec
Running org.apache.hadoop.hbase.client.TestFromClientSide
Tests run: 45, Failures: 0, Errors: 0, Skipped: 3, Time elapsed: 109.919 sec
Running org.apache.hadoop.hbase.replication.TestReplication
killed.
[INFO] ------------------------------------------------------------------------
[INFO] BUILD FAILURE
[INFO] ------------------------------------------------------------------------
[INFO] Total time: 34:02.048s
[INFO] Finished at: Tue Jul 26 22:42:08 UTC 2011
[INFO] Final Memory: 55M/1109M
[INFO] ------------------------------------------------------------------------
[ERROR] Failed to execute goal org.apache.maven.plugins:maven-surefire-plugin:2.4.3:test (default-test)
on project hbase: Error while executing forked tests.; nested exception is org.apache.maven.surefire.booter.shade.org.codehaus.plexus.util.cli.CommandLineException:
Error while executing external command, process killed. Process timeout out after 900 seconds
-> [Help 1]
[ERROR] 
[ERROR] To see the full stack trace of the errors, re-run Maven with the -e switch.
[ERROR] Re-run Maven using the -X switch to enable full debug logging.
[ERROR] 
[ERROR] For more information about the errors and possible solutions, please read the following
articles:
[ERROR] [Help 1] http://cwiki.apache.org/confluence/display/MAVEN/MojoExecutionException
[locks-and-latches] Releasing all the locks
[locks-and-latches] All the locks released
Archiving artifacts
Recording test results
Updating HBASE-4142
Updating HBASE-4139


Mime
View raw message